{"text_format":"1","workbook":"xlsx","n_sheets":6,"sheets":["Projektdaten","Risikobeurteilung","B-Normen","EN ISO 12100","Sprache","Eigene Zellen"],"not_rendered":{"charts":0,"images":3,"macros":1,"external_links":0,"defined_names":86,"comments":3,"pivot_tables":0},"unopened":[],"bounds":{"document_bytes":16777216,"sheet_cells":100000,"rows_first":2000,"rows_last":500,"rows_between":2000,"halvings":0,"cell_chars":16384,"cell_head_chars":4096},"cells_cut":0,"cells_raw":0,"read":"whole","date_system":"1900"}

{"sheet":"Projektdaten","index":0,"n_rows":163,"n_cols":5,"rows_kept":163,"cut":false,"hidden":false,"merged":[[69,2,69,4],[70,2,70,4],[71,2,71,4],[72,2,72,4],[98,1,99,1],[76,2,76,4],[77,2,77,4],[67,0,68,0],[32,0,32,1],[33,0,33,1],[66,2,66,4],[65,0,65,4],[41,0,41,1],[42,0,42,1],[66,0,66,1],[48,0,48,1],[49,0,49,1],[50,0,50,1],[51,0,51,1],[52,0,52,1],[53,0,53,1],[67,2,67,4],[68,2,68,4],[18,0,19,0],[18,1,19,1],[20,0,22,0],[23,0,27,0],[28,0,29,0],[20,1,22,1],[76,0,77,0],[76,1,77,1],[131,0,141,0],[142,0,148,0],[108,0,118,0],[119,0,130,0],[80,0,85,0],[98,0,99,0],[86,0,97,0],[100,0,107,0],[159,0,159,1],[78,0,79,0],[78,1,79,1],[78,2,79,2],[78,4,79,4],[151,1,151,4],[153,1,153,4],[155,1,155,4]]}
[{"$f":"Sprache!A267","v":"Projektdaten"}]
[]
[{"$f":"Sprache!A268","v":"Bezeichnung der Maschine:"}]
[{"$f":"Sprache!A269","v":"Maschinentyp:"}]
[{"$f":"Sprache!A270","v":"Seriennummer:"}]
[{"$f":"Sprache!A271","v":"allgemeine Beschreibung der Maschine:"}]
[{"$f":"Sprache!A272","v":"Konformitätsbewertungsverfahren:"}]
[{"$f":"Sprache!A273","v":"notifizierte Stelle:"}]
[]
[]
{"$rows_left_out":154}
{"sheet":"Risikobeurteilung","index":1,"n_rows":184,"n_cols":46,"rows_kept":184,"cut":false,"hidden":false,"merged":[[0,43,2,43],[0,5,2,5],[0,42,2,42],[0,45,2,45],[1,38,1,41],[0,38,0,41],[0,44,2,44],[1,2,1,3],[1,33,2,33],[1,37,2,37],[1,36,2,36],[0,30,0,37],[1,26,1,29],[1,34,2,34],[1,20,2,20],[1,21,2,21],[1,22,2,22],[1,23,2,23],[1,24,2,24],[1,7,2,7],[0,0,1,1],[0,17,2,17],[0,16,2,16],[0,15,2,15],[1,35,2,35],[1,31,2,31],[1,32,2,32],[1,30,2,30],[0,18,0,25],[1,18,2,18],[1,25,2,25],[1,19,2,19],[0,6,2,6],[0,4,2,4],[1,9,1,14],[1,8,2,8]]}
[{"$f":"Sprache!A3","v":"Laufende Nummer der Gefährdung"},null,null,null,{"$f":"Sprache!A9","v":"Original (x=Zeile kann nicht gelöscht werden)"},{"$f":"Sprache!A10","v":"GSA trifft zu"},{"$f":"Sprache!A59","v":"Datum der letzten Änderung"},null,null,null,null,null,null,null,null,{"$f":"Sprache!A23","v":"Ort / Gefahrbereich / Position in Zeichnung"},{"$f":"Sprache!A24","v":"Gefährdung / Gefährdungssituation"},{"$f":"Sprache!A25","v":"Gefährdete Personen"},{"$f":"Sprache!A26","v":"Lebensphase (nach EN ISO 12100, Tabelle B.3)"},null,null,null,null,null,null,null,null,null,null,null,{"$f":"Sprache!A41","v":"Risikominimierung"},null,null,null,null,null,null,null,null,null,null,null,{"$f":"Sprache!A55","v":"Weitere Reduzierung notwendig?"},{"$f":"Sprache!A57","v":"Kommentar"},{"$f":"Sprache!A58","v":"Bearbeiter"},{"$f":"Sprache!A60","v":"Gefährdung ist behandelt?"}]
[null,null,{"$f":"Sprache!A6","v":"grundlegende Sicherheits- und Gesundheitsschutzanforderungen"},null,null,null,null,{"$f":"Sprache!A12","v":"Inhalt bereits abgedeckt?"},{"$f":"Sprache!A14","v":"Norm-Typ"},{"$f":"Sprache!A16","v":"Gefährdungen nach (harmonisierter) Norm"},null,null,null,null,null,null,null,null,{"$f":"Sprache!A27","v":"Alle"},{"$f":"Sprache!A28","v":"Transport"},{"$f":"Sprache!A29","v":"Montage und Installation\nIn Betrieb nehmen"},{"$f":"Sprache!A30","v":"Einrichten\nEinlernen (Teachen)/ Programmieren und/oder Umrüsten"},{"$f":"Sprache!A31","v":"Betrieb"},{"$f":"Sprache!A32","v":"Reinigung\nInstandhaltung"},{"$f":"Sprache!A33","v":"Fehlersuche und -beseitigung"},{"$f":"Sprache!A34","v":"Demontage\nAußer Betrieb nehmen"},{"$f":"Sprache!A35","v":"Risiko- einschätzung"},null,null,null,{"$f":"Sprache!A42","v":"konstruktiv"},{"$f":"Sprache!A43","v":"sicherheitstechnisch"},{"$f":"Sprache!A44","v":"informativ"},{"$f":"Sprache!A45","v":"Beschreibung der Risikominderung"},{"$f":"Sprache!A46","v":"angewandte technische Spezifikation / harmonisierte B / C Norm"},{"$f":"Sprache!A47","v":"Titel"},{"$f":"Sprache!A48","v":"Fundstelle in Norm"},{"$f":"Sprache!A49","v":"technischer Bericht / Prüfergebnis"},{"$f":"Sprache!A50","v":"Risiko- einschätzung"}]
[{"$f":"Sprache!A4","v":"Haupt"},{"$f":"Sprache!A5","v":"Unter"},{"$f":"Sprache!A7","v":"Nr."},{"$f":"Sprache!A8","v":"Bezeichnung"},null,null,null,null,null,{"$f":"Sprache!A17","v":"Norm Nummer"},{"$f":"Sprache!A18","v":"Norm Titel"},{"$f":"Sprache!A19","v":"Abschnitt / Detail"},{"$f":"Sprache!A20","v":"Norminhalt (eingekürzt und bearbeitet)"},{"$f":"Sprache!A21","v":"Ursprung"},{"$f":"Sprache!A22","v":"mögliche Auswirkung"},null,null,null,null,null,null,null,null,null,null,null,{"$f":"Sprache!A37","v":"S"},{"$f":"Sprache!A38","v":"F"},{"$f":"Sprache!A39","v":"P"},{"$f":"Sprache!A40","v":"Risiko"},null,null,null,null,null,null,null,null,{"$f":"Sprache!A51","v":"S"},{"$f":"Sprache!A52","v":"F"},{"$f":"Sprache!A53","v":"P"},{"$f":"Sprache!A54","v":"Risiko"}]
["Haupt","Unter","Nr.","Bezeichnung","Spalte212","Spalte3","Datum der letzten Änderung","Inhalt bereits abgedeckt?","Norm-Typ","Norm Nummer","Norm Titel","Abschnitt / Detail","Norminhalt (eingekürzt und bearbeitet)","Ursprung","mögliche Auswirkung","Ort / Gefahrbereich / Position in Zeichnung","Gefährdung / Gefährdungssituation","Gefährdete Personen","Alle","Transport","Montage und Installation\nIn Betrieb nehmen","Einrichten\nEinlernen (Teachen)/ Programmieren und/oder Umrüsten","Betrieb","Reinigung\nInstandhaltung","Fehlersuche und -beseitigung","Demontage\nAußer Betrieb nehmen","S","F","P","Risiko","konstruktiv","sicherheitstechnisch","informativ","Beschreibung der Risikominderung","angewandte technische Spezifikation / harmonisierte B / C Norm","Titel","Fundstelle in Norm","technischer Bericht / Prüfergebnis","S2","F3","P4","Risiko5","Weitere Reduzierung notwendig?","Kommentar","Bearbeiter","Gefährdung ist behandelt?"]
[null,null,"1.1.",{"$f":"Sprache!A$83","v":"Allgemeines"},"x","x",null,null,null,null,{"$f":"IF(J5<>\"\", INDIRECT(\"'B-Normen'!B\" & MATCH(J5,'B-Normen'!$A:$A,0)),\"\")","v":""},null,null,null,null,null,null,null,null,null,null,null,null,null,null,null,null,null,null,{"$f":"IF((Table_RiskAssessment[[#This Row],[S]]* Table_RiskAssessment[[#This Row],[F]]* Table_RiskAssessment[[#This Row],[P]]>0), IF(Table_RiskAssessment[[#This Row],[S]]=1,  IF(Table_RiskAssessment[[#This Row],[F]]=1,IF(Table_RiskAssessment[[#This Row],[P]]=1,\"a\",\"b\"),IF(Table_RiskAssessment[[#This Row],[P]]=1,\"b\",\"c\")),IF(Table_RiskAssessment[[#This Row],[F]]=1,IF(Table_RiskAssessment[[#This Row],[P]]=1,\"c\",\"d\"),IF(Table_RiskAssessment[[#This Row],[P]]=1,\"d\",\"e\"))),\"?\")","v":"?"},null,null,null,null,null,null,null,null,null,null,null,{"$f":"IF((Table_RiskAssessment[[#This Row],[S2]]* Table_RiskAssessment[[#This Row],[F3]]* Table_RiskAssessment[[#This Row],[P4]]>0), IF(Table_RiskAssessment[[#This Row],[S2]]=1,  IF(Table_RiskAssessment[[#This Row],[F3]]=1,IF(Table_RiskAssessment[[#This Row],[P4]]=1,\"a\",\"b\"),IF(Table_RiskAssessment[[#This Row],[P4]]=1,\"b\",\"c\")),IF(Table_RiskAssessment[[#This Row],[F3]]=1,IF(Table_RiskAssessment[[#This Row],[P4]]=1,\"c\",\"d\"),IF(Table_RiskAssessment[[#This Row],[P4]]=1,\"d\",\"e\"))),\"?\")","v":"?"}]
[null,null,"1.1. 2.",{"$f":"Sprache!A$84","v":"Grundsätze für die Integration der Sicherheit"},"x","x",null,null,null,null,{"$f":"IF(J6<>\"\", INDIRECT(\"'B-Normen'!B\" & MATCH(J6,'B-Normen'!$A:$A,0)),\"\")","v":""},null,null,null,null,null,null,null,null,null,null,null,null,null,null,null,null,null,null,{"$f":"IF((Table_RiskAssessment[[#This Row],[S]]* Table_RiskAssessment[[#This Row],[F]]* Table_RiskAssessment[[#This Row],[P]]>0), IF(Table_RiskAssessment[[#This Row],[S]]=1,  IF(Table_RiskAssessment[[#This Row],[F]]=1,IF(Table_RiskAssessment[[#This Row],[P]]=1,\"a\",\"b\"),IF(Table_RiskAssessment[[#This Row],[P]]=1,\"b\",\"c\")),IF(Table_RiskAssessment[[#This Row],[F]]=1,IF(Table_RiskAssessment[[#This Row],[P]]=1,\"c\",\"d\"),IF(Table_RiskAssessment[[#This Row],[P]]=1,\"d\",\"e\"))),\"?\")","v":"?"},null,null,null,null,null,null,null,null,null,null,null,{"$f":"IF((Table_RiskAssessment[[#This Row],[S2]]* Table_RiskAssessment[[#This Row],[F3]]* Table_RiskAssessment[[#This Row],[P4]]>0), IF(Table_RiskAssessment[[#This Row],[S2]]=1,  IF(Table_RiskAssessment[[#This Row],[F3]]=1,IF(Table_RiskAssessment[[#This Row],[P4]]=1,\"a\",\"b\"),IF(Table_RiskAssessment[[#This Row],[P4]]=1,\"b\",\"c\")),IF(Table_RiskAssessment[[#This Row],[F3]]=1,IF(Table_RiskAssessment[[#This Row],[P4]]=1,\"c\",\"d\"),IF(Table_RiskAssessment[[#This Row],[P4]]=1,\"d\",\"e\"))),\"?\")","v":"?"}]
[null,null,"1.1.3.",{"$f":"Sprache!A$85","v":"Materialien und Produkte"},"x","x",null,null,null,null,{"$f":"IF(J7<>\"\", INDIRECT(\"'B-Normen'!B\" & MATCH(J7,'B-Normen'!$A:$A,0)),\"\")","v":""},null,null,null,null,null,null,null,null,null,null,null,null,null,null,null,null,null,null,{"$f":"IF((Table_RiskAssessment[[#This Row],[S]]* Table_RiskAssessment[[#This Row],[F]]* Table_RiskAssessment[[#This Row],[P]]>0), IF(Table_RiskAssessment[[#This Row],[S]]=1,  IF(Table_RiskAssessment[[#This Row],[F]]=1,IF(Table_RiskAssessment[[#This Row],[P]]=1,\"a\",\"b\"),IF(Table_RiskAssessment[[#This Row],[P]]=1,\"b\",\"c\")),IF(Table_RiskAssessment[[#This Row],[F]]=1,IF(Table_RiskAssessment[[#This Row],[P]]=1,\"c\",\"d\"),IF(Table_RiskAssessment[[#This Row],[P]]=1,\"d\",\"e\"))),\"?\")","v":"?"},null,null,null,null,null,null,null,null,null,null,null,{"$f":"IF((Table_RiskAssessment[[#This Row],[S2]]* Table_RiskAssessment[[#This Row],[F3]]* Table_RiskAssessment[[#This Row],[P4]]>0), IF(Table_RiskAssessment[[#This Row],[S2]]=1,  IF(Table_RiskAssessment[[#This Row],[F3]]=1,IF(Table_RiskAssessment[[#This Row],[P4]]=1,\"a\",\"b\"),IF(Table_RiskAssessment[[#This Row],[P4]]=1,\"b\",\"c\")),IF(Table_RiskAssessment[[#This Row],[F3]]=1,IF(Table_RiskAssessment[[#This Row],[P4]]=1,\"c\",\"d\"),IF(Table_RiskAssessment[[#This Row],[P4]]=1,\"d\",\"e\"))),\"?\")","v":"?"}]
[null,null,"1.1.4.",{"$f":"Sprache!A$86","v":"Beleuchtung"},"x","x",null,null,null,"---",{"$f":"IF(J8<>\"\", INDIRECT(\"'B-Normen'!B\" & MATCH(J8,'B-Normen'!$A:$A,0)),\"\")","v":" "},null,null,null,null,null,null,null,null,null,null,null,null,null,null,null,null,null,null,{"$f":"IF((Table_RiskAssessment[[#This Row],[S]]* Table_RiskAssessment[[#This Row],[F]]* Table_RiskAssessment[[#This Row],[P]]>0), IF(Table_RiskAssessment[[#This Row],[S]]=1,  IF(Table_RiskAssessment[[#This Row],[F]]=1,IF(Table_RiskAssessment[[#This Row],[P]]=1,\"a\",\"b\"),IF(Table_RiskAssessment[[#This Row],[P]]=1,\"b\",\"c\")),IF(Table_RiskAssessment[[#This Row],[F]]=1,IF(Table_RiskAssessment[[#This Row],[P]]=1,\"c\",\"d\"),IF(Table_RiskAssessment[[#This Row],[P]]=1,\"d\",\"e\"))),\"?\")","v":"?"},null,null,null,null,"---",{"$f":"INDIRECT(\"'B-Normen'!B\" & MATCH(AI8,'B-Normen'!$A:$A,0))","v":" "},null,null,null,null,null,{"$f":"IF((Table_RiskAssessment[[#This Row],[S2]]* Table_RiskAssessment[[#This Row],[F3]]* Table_RiskAssessment[[#This Row],[P4]]>0), IF(Table_RiskAssessment[[#This Row],[S2]]=1,  IF(Table_RiskAssessment[[#This Row],[F3]]=1,IF(Table_RiskAssessment[[#This Row],[P4]]=1,\"a\",\"b\"),IF(Table_RiskAssessment[[#This Row],[P4]]=1,\"b\",\"c\")),IF(Table_RiskAssessment[[#This Row],[F3]]=1,IF(Table_RiskAssessment[[#This Row],[P4]]=1,\"c\",\"d\"),IF(Table_RiskAssessment[[#This Row],[P4]]=1,\"d\",\"e\"))),\"?\")","v":"?"}]
[null,null,"1.1.5.",{"$f":"Sprache!A$87","v":"Konstruktion der Maschine im Hinblick auf die Handhabung"},"x","x",null,null,null,null,{"$f":"IF(J9<>\"\", INDIRECT(\"'B-Normen'!B\" & MATCH(J9,'B-Normen'!$A:$A,0)),\"\")","v":""},null,null,null,null,null,null,null,null,null,null,null,null,null,null,null,null,null,null,{"$f":"IF((Table_RiskAssessment[[#This Row],[S]]* Table_RiskAssessment[[#This Row],[F]]* Table_RiskAssessment[[#This Row],[P]]>0), IF(Table_RiskAssessment[[#This Row],[S]]=1,  IF(Table_RiskAssessment[[#This Row],[F]]=1,IF(Table_RiskAssessment[[#This Row],[P]]=1,\"a\",\"b\"),IF(Table_RiskAssessment[[#This Row],[P]]=1,\"b\",\"c\")),IF(Table_RiskAssessment[[#This Row],[F]]=1,IF(Table_RiskAssessment[[#This Row],[P]]=1,\"c\",\"d\"),IF(Table_RiskAssessment[[#This Row],[P]]=1,\"d\",\"e\"))),\"?\")","v":"?"},null,null,null,null,null,null,null,null,null,null,null,{"$f":"IF((Table_RiskAssessment[[#This Row],[S2]]* Table_RiskAssessment[[#This Row],[F3]]* Table_RiskAssessment[[#This Row],[P4]]>0), IF(Table_RiskAssessment[[#This Row],[S2]]=1,  IF(Table_RiskAssessment[[#This Row],[F3]]=1,IF(Table_RiskAssessment[[#This Row],[P4]]=1,\"a\",\"b\"),IF(Table_RiskAssessment[[#This Row],[P4]]=1,\"b\",\"c\")),IF(Table_RiskAssessment[[#This Row],[F3]]=1,IF(Table_RiskAssessment[[#This Row],[P4]]=1,\"c\",\"d\"),IF(Table_RiskAssessment[[#This Row],[P4]]=1,\"d\",\"e\"))),\"?\")","v":"?"}]
[null,null,"1.1.6.",{"$f":"Sprache!A$88","v":"Ergonomie"},"x","x",null,null,null,"---",{"$f":"IF(J10<>\"\", INDIRECT(\"'B-Normen'!B\" & MATCH(J10,'B-Normen'!$A:$A,0)),\"\")","v":" "},null,null,null,null,null,null,null,null,null,null,null,null,null,null,null,null,null,null,{"$f":"IF((Table_RiskAssessment[[#This Row],[S]]* Table_RiskAssessment[[#This Row],[F]]* Table_RiskAssessment[[#This Row],[P]]>0), IF(Table_RiskAssessment[[#This Row],[S]]=1,  IF(Table_RiskAssessment[[#This Row],[F]]=1,IF(Table_RiskAssessment[[#This Row],[P]]=1,\"a\",\"b\"),IF(Table_RiskAssessment[[#This Row],[P]]=1,\"b\",\"c\")),IF(Table_RiskAssessment[[#This Row],[F]]=1,IF(Table_RiskAssessment[[#This Row],[P]]=1,\"c\",\"d\"),IF(Table_RiskAssessment[[#This Row],[P]]=1,\"d\",\"e\"))),\"?\")","v":"?"},null,null,null,null,"---",{"$f":"INDIRECT(\"'B-Normen'!B\" & MATCH(AI10,'B-Normen'!$A:$A,0))","v":" "},null,null,null,null,null,{"$f":"IF((Table_RiskAssessment[[#This Row],[S2]]* Table_RiskAssessment[[#This Row],[F3]]* Table_RiskAssessment[[#This Row],[P4]]>0), IF(Table_RiskAssessment[[#This Row],[S2]]=1,  IF(Table_RiskAssessment[[#This Row],[F3]]=1,IF(Table_RiskAssessment[[#This Row],[P4]]=1,\"a\",\"b\"),IF(Table_RiskAssessment[[#This Row],[P4]]=1,\"b\",\"c\")),IF(Table_RiskAssessment[[#This Row],[F3]]=1,IF(Table_RiskAssessment[[#This Row],[P4]]=1,\"c\",\"d\"),IF(Table_RiskAssessment[[#This Row],[P4]]=1,\"d\",\"e\"))),\"?\")","v":"?"}]
{"$rows_left_out":175}
{"sheet":"B-Normen","index":2,"n_rows":180,"n_cols":5,"rows_kept":180,"cut":false,"hidden":false,"merged":[[0,2,0,4]]}
["2012-11-15","Auflistung der B-Normen,\njeweils den grundlegenden Sicherheits- und Gesundheitsanforderungen,\nAnlage I der Maschinenrichtlinie 2006/42/EG, zugeordnet\nnach: MMS Muck Maschinensicherheit GmbH","Auflistung der B-Normen,\njeweils den grundlegenden Sicherheits- und Gesundheitsanforderungen,\nAnlage I der Maschinenrichtlinie 2006/42/EG, zugeordnet\nnach: MMS Muck Maschinensicherheit GmbH"]
["Nummer","Bezeichnung","Deutsch","English","Français"]
["---",{"$f":"INDEX(Table_Standards[#This Row],1,Language_select+2)","v":" "}," "," "," "]
["1.1.4",{"$f":"INDEX(Table_Standards[#This Row],1,Language_select+2)","v":"Beleuchtung"},"Beleuchtung","Lighting"]
["EN 1837:1999+A1:2009",{"$f":"INDEX(Table_Standards[#This Row],1,Language_select+2)","v":"Sicherheit von Maschinen — Maschinenintegrierte Beleuchtung"},"Sicherheit von Maschinen — Maschinenintegrierte Beleuchtung","English","Français"]
["---",{"$f":"INDEX(Table_Standards[#This Row],1,Language_select+2)","v":" "}," "," "," "]
["1.1.6",{"$f":"INDEX(Table_Standards[#This Row],1,Language_select+2)","v":"Ergonomie"},"Ergonomie","Ergonomics","Français"]
["EN 547-1:1996+A1:2008",{"$f":"INDEX(Table_Standards[#This Row],1,Language_select+2)","v":"Sicherheit von Maschinen — Körpermaße des Menschen —  Teil 1: Grundlagen zur Bestimmung von Abmessungen für Ganzkörperzugänge  an Maschinenarbeitsplätzen"},"Sicherheit von Maschinen — Körpermaße des Menschen —  Teil 1: Grundlagen zur Bestimmung von Abmessungen für Ganzkörperzugänge  an Maschinenarbeitsplätzen","English","Français"]
["EN 547-2:1996+A1:2008",{"$f":"INDEX(Table_Standards[#This Row],1,Language_select+2)","v":"Sicherheit von Maschinen — Körpermaße des Menschen —  Teil 2: Grundlagen für die Bemessung von Zugangsöffnungen"},"Sicherheit von Maschinen — Körpermaße des Menschen —  Teil 2: Grundlagen für die Bemessung von Zugangsöffnungen","English","Français"]
["EN 547-3:1996+A1:2008",{"$f":"INDEX(Table_Standards[#This Row],1,Language_select+2)","v":"Sicherheit von Maschinen — Körpermaße des Menschen —  Teil 3: Körpermaßdaten"},"Sicherheit von Maschinen — Körpermaße des Menschen —  Teil 3: Körpermaßdaten","English","Français"]
{"$rows_left_out":171}
{"sheet":"EN ISO 12100","index":3,"n_rows":101,"n_cols":5,"rows_kept":101,"cut":false,"hidden":false,"merged":[[89,1,99,1],[89,0,99,0],[78,1,88,1],[78,0,88,0],[0,0,0,4],[59,1,64,1],[59,0,64,0],[65,1,77,1],[65,0,77,0],[32,1,38,1],[32,0,38,0],[39,1,50,1],[39,0,50,0],[51,1,58,1],[51,0,58,0],[1,2,1,3],[3,1,21,1],[3,0,21,0],[22,1,31,1],[22,0,31,0]]}
["Gefährdungen EN ISO 12100 Tabelle B.1"]
[null,null,"Gefährdungsbeispiele"]
["Nr.","Art oder Gruppe","Ursprung","Mögliche Auswirkungen","Abschnitt Bezug"]
[1,"Mechanische Gefährdungen","---","---","---"]
[null,null,"Beschleunigung/Abbremsung;","Überfahren werden;","6.2.2.1"]
[null,null,"spitze Teile;","Weggeschleudert werden;","6.2.2.2"]
[null,null,"Annäherung eines sich bewegenden Teils an ein feststehendes Teil;","Quetschen;","6.2.3 a)"]
[null,null,"schneidende Teile;","Schneiden oder Abschneiden;","6.2.3 b)"]
[null,null,"elastische Elemente;","Einziehen oder Fangen;","6.2.6"]
[null,null,"herab fallende Gegenstände;","Erfassen;","6.2.10"]
{"$rows_left_out":92}
{"sheet":"Sprache","index":4,"n_rows":426,"n_cols":4,"rows_kept":426,"cut":false,"hidden":false,"merged":[]}
["1","Deutsch","English","Français"]
[{"$f":"INDEX(Table_Language[#This Row],1,Language_select+1)","v":"Blatt Risikobeurteilung"},"Blatt Risikobeurteilung","Sheet Risk Assessment","Français"]
[{"$f":"INDEX(Table_Language[#This Row],1,Language_select+1)","v":"Laufende Nummer der Gefährdung"},"Laufende Nummer der Gefährdung","Identifying Number of the hazard","Français"]
[{"$f":"INDEX(Table_Language[#This Row],1,Language_select+1)","v":"Haupt"},"Haupt","Main","Français"]
[{"$f":"INDEX(Table_Language[#This Row],1,Language_select+1)","v":"Unter"},"Unter","Sub","Français"]
[{"$f":"INDEX(Table_Language[#This Row],1,Language_select+1)","v":"grundlegende Sicherheits- und Gesundheitsschutzanforderungen"},"grundlegende Sicherheits- und Gesundheitsschutzanforderungen","Essential health and safety requirements","Français"]
[{"$f":"INDEX(Table_Language[#This Row],1,Language_select+1)","v":"Nr."},"Nr.","No.","Français"]
[{"$f":"INDEX(Table_Language[#This Row],1,Language_select+1)","v":"Bezeichnung"},"Bezeichnung","Title","Français"]
[{"$f":"INDEX(Table_Language[#This Row],1,Language_select+1)","v":"Original (x=Zeile kann nicht gelöscht werden)"},"Original (x=Zeile kann nicht gelöscht werden)","Original (x=line can not be deleted)","Français"]
[{"$f":"INDEX(Table_Language[#This Row],1,Language_select+1)","v":"GSA trifft zu"},"GSA trifft zu","applying EHSR","Français"]
{"$rows_left_out":417}
{"sheet":"Eigene Zellen","index":5,"n_rows":6,"n_cols":4,"rows_kept":6,"cut":false,"hidden":false,"merged":[]}
["1","Deutsch","English","Français"]
[{"$f":"INDEX(Table_OwnEntries[#This Row],1,Language_select+1)","v":"Blatt Risikobeurteilung"},"Blatt Risikobeurteilung","Sheet Risk Assessment","Évaluation des risques "]
[{"$f":"INDEX(Table_OwnEntries[#This Row],1,Language_select+1)","v":"Eigener Eintrag"},"Eigener Eintrag","Own entry","Propre élément"]
[{"$f":"INDEX(Table_OwnEntries[#This Row],1,Language_select+1)","v":"Eigener Eintrag"},"Eigener Eintrag","Own entry","Propre élément"]
[{"$f":"INDEX(Table_OwnEntries[#This Row],1,Language_select+1)","v":"Projektdaten"},"Projektdaten","Project data","Données projet"]
[{"$f":"INDEX(Table_OwnEntries[#This Row],1,Language_select+1)","v":"Eigener Eintrag"},"Eigener Eintrag","Own entry","Propre élément"]