{"text_format":"1","workbook":"xlsx","n_sheets":10,"sheets":["Project data","Risk Assessment","Risk assessment Log","B-Standards","EN ISO 12100","Language","Own Cells","Version","EHSR","Constants"],"not_rendered":{"charts":0,"images":0,"macros":1,"external_links":0,"defined_names":350,"comments":3,"pivot_tables":0},"unopened":[],"bounds":{"document_bytes":16777216,"sheet_cells":100000,"rows_first":2000,"rows_last":500,"rows_between":2000,"halvings":0,"cell_chars":16384,"cell_head_chars":4096},"cells_cut":0,"cells_raw":0,"read":"whole","date_system":"1900"}

{"sheet":"Project data","index":0,"n_rows":169,"n_cols":5,"rows_kept":169,"cut":false,"hidden":false,"merged":[[71,2,71,4],[97,1,98,1],[75,2,75,4],[76,2,76,4],[66,2,66,4],[67,2,67,4],[68,2,68,4],[69,2,69,4],[70,2,70,4],[65,2,65,4],[64,0,64,4],[38,0,38,1],[39,0,39,1],[65,0,65,1],[45,0,45,1],[46,0,46,1],[47,0,47,1],[48,0,48,1],[49,0,49,1],[50,0,50,1],[24,0,25,0],[75,0,76,0],[75,1,76,1],[130,0,140,0],[66,0,67,0],[29,0,29,1],[28,0,28,1],[30,0,30,1],[37,0,37,1],[44,0,44,1],[158,0,158,1],[77,0,78,0],[77,1,78,1],[77,2,78,2],[77,4,78,4],[150,1,150,4],[152,1,152,4],[154,1,154,4],[141,0,147,0],[107,0,117,0],[118,0,129,0],[79,0,84,0],[97,0,98,0],[85,0,96,0],[99,0,106,0]]}
[{"$f":"Language!A267","v":"Project data"}]
[]
[{"$f":"Language!A441","v":"Manufacturer:"}]
[{"$f":"Language!A442","v":"Address of the manufacturer:"}]
[{"$f":"Language!A443","v":"Version of the complete document:"}]
[{"$f":"Language!A444","v":"Date of last change:"}]
[{"$f":"Language!A268","v":"Commercial name of the Machinery:"}]
[{"$f":"Language!A269","v":"Machinery type:"}]
[{"$f":"Language!A270","v":"Serial number:"}]
[{"$f":"Language!A458","v":"year of construction:"}]
[{"$f":"Language!A271","v":"General description of the machinery:"}]
[{"$f":"Language!A272","v":"Procedures for assessing the conformity:"},{"$f":"Language!$A$489","v":"please select"}]
[{"$f":"Language!A273","v":"Notified body:"}]
[]
[]
[{"$f":"Language!A274","v":"Project leader:"}]
[{"$f":"Language!A275","v":"Mechanical designer:"}]
[{"$f":"Language!A276","v":"Electrical designer:"}]
[{"$f":"Language!A277","v":"Control system designer:"}]
[{"$f":"Language!A278","v":"Communication medium designer:"}]
[{"$f":"Language!A279","v":"Authorised person to compile the technical file:"}]
[]
[{"$f":"Language!A282","v":"Intended use"}]
[{"$f":"Language!A283","v":"Reasonably foreseeable misuse (considering customer feedback and known history of accidents)"}]
[{"$f":"Language!A284","v":"Operating modes:"},{"$f":"Language!A285","v":"Description of the different modes of operation and protective measures."}]
[]
[{"$f":"Language!A286","v":"Field of application:"},{"$f":"Language!$A$497","v":"please select"}]
[]
[{"$f":"Language!A287","v":"Space limits"}]
[{"$f":"Language!A288","v":"the range of movement, space requirements for persons interacting with the machine, such as during operation and maintenance"}]
[{"$f":"Language!A289","v":"operator–machine interface, machine–power supply interface"}]
[{"$f":"Language!A290","v":"Overview drawing including parts list"}]
[{"$f":"Language!A292","v":"Requirement/design specifications"}]
[{"$f":"Language!A293","v":"Technical specifications"}]
[{"$f":"Language!A294","v":"Description on setup and components in the manual chapter XXX"}]
[{"$f":"Language!A295","v":"Technical data in the manual chapter XXX"}]
[]
[{"$f":"Language!A296","v":"Time limits"}]
[{"$f":"Language!A297","v":"the life limit of the machinery and/or of some of its components, taking into account its intended use and reasonably foreseeable\nmisuse"}]
[{"$f":"Language!A298","v":"recommended service intervals"}]
[{"$f":"Language!A300","v":"Lifecycle of the machine"}]
[{"$f":"Language!A301","v":"Lifecycle of the wear parts (list)"}]
[{"$f":"Language!A302","v":"Recommended maintenance intervals (list)"}]
[]
[{"$f":"Language!A303","v":"Other limits"}]
[{"$f":"Language!A304","v":"properties of the material(s) to be processed"}]
[{"$f":"Language!A305","v":"housekeeping — the level of cleanliness required"}]
[{"$f":"Language!A306","v":"the recommended minimum and maximum temperatures, in the machine / environment"}]
[{"$f":"Language!A307","v":"operation indoors or outdoors, in dry / wet weather, in direct / indirect sunlight"}]
[{"$f":"Language!A308","v":"tolerance to dust and wet"}]
[{"$f":"Language!A309","v":"etc."}]
[{"$f":"Language!A310","v":"Materials being processed (list with hazards)"}]
[{"$f":"Language!A311","v":"necessary degree of cleanliness"}]
[{"$f":"Language!A313","v":"Minimum / maximum temperature in the environment"}]
[{"$f":"Language!A314","v":"Minimum / maximum temperature in the machine"}]
[{"$f":"Language!A316","v":"Operation indoors / outdoors"}]
[{"$f":"Language!A318","v":"at dry / wet weather"}]
[{"$f":"Language!A319","v":"at direct / indirect sunlight"}]
[{"$f":"Language!A320","v":"Tolerance to dust and wet"}]
[{"$f":"Language!A438","v":"Aggressive environmental conditions"}]
[{"$f":"Language!A439","v":"etc."}]
[]
[]
[]
[{"$f":"Language!A322","v":"Subcontractors"}]
[{"$f":"Language!A323","v":"delivery of main assembly (e.g. machinery-components, mechanics, electrics, hydraulic, pneumatic) "},null,{"$f":"Language!A324","v":"Supplier:"}]
[{"$f":"Language!A325","v":"Mechanics:"},{"$f":"Language!A326","v":"·        Steelwork"}]
[null,{"$f":"Language!A327","v":"·        stationary access (stairs, ladders, platform)"}]
[{"$f":"Language!A328","v":"electrics"},{"$f":"Language!A329","v":"·        control box incl. PLC"}]
[{"$f":"Language!A330","v":"Hydraulic:"},{"$f":"Language!A331","v":"·        Hydraulic unit, cylinder, valve"}]
[{"$f":"Language!A332","v":"Pneumatic:"},{"$f":"Language!A333","v":"·        cylinder, valve"}]
[{"$f":"Language!A334","v":"Fluid connection:"},{"$f":"Language!A335","v":"·        Connection for cooling water, gas and so on"}]
[]
[]
[{"$f":"Language!A336","v":"Basis of the given table is the EN ISO 12100:2010"}]
[{"$f":"Language!A337","v":"Phase of machine life cycle"},{"$f":"Language!A338","v":"Examples of tasks"},{"$f":"Language!A339","v":"qualification required for "}]
[null,null,{"$f":"Language!A340","v":"Operator  [i])"}]
[null,null,{"$f":"Language!A341","v":"non-professional operator"},{"$f":"Language!A342","v":"skilled / trained"},{"$f":"Language!A344","v":"specialist [iii])"}]
[null,null,null,{"$f":"Language!A343","v":"persons [ii])"}]
[{"$f":"Language!A345","v":"1. Transport"},{"$f":"Language!A346","v":"-     Lifting"}]
[null,{"$f":"Language!A347","v":"-     Loading"}]
[null,{"$f":"Language!A348","v":"-     Packing"}]
[null,{"$f":"Language!A349","v":"-     Transportation"}]
[null,{"$f":"Language!A350","v":"-     Unloading"}]
[null,{"$f":"Language!A351","v":"-     Unpacking"}]
[{"$f":"Language!A352","v":"2. Assembly and installation"},{"$f":"Language!A353","v":"-     Adjustments of the machine and its components"}]
[null,{"$f":"Language!A354","v":"-     Assembly of the machine"}]
[null,{"$f":"Language!A355","v":"-     Connecting to disposal system (for example, exhaust system, waste water installation)"}]
[null,{"$f":"Language!A356","v":"-     Connecting to power supply (for example, electric power supply, compressed air)"}]
[null,{"$f":"Language!A357","v":"-     Demonstration"}]
[null,{"$f":"Language!A358","v":"-     Feeding, filling, loading of ancillary fluids (for example, lubricant, grease, glue)"}]
[null,{"$f":"Language!A359","v":"-     Fencing"}]
[null,{"$f":"Language!A360","v":"-     Fixing, anchoring"}]
[null,{"$f":"Language!A361","v":"-     Preparations for the installation (for example, foundations, vibration isolators)"}]
[null,{"$f":"Language!A362","v":"-     Running the machine without load"}]
[null,{"$f":"Language!A363","v":"-     Testing"}]
[null,{"$f":"Language!A364","v":"-     Trials with load or maximum load"}]
[{"$f":"Language!A365","v":"3. Usage"}]
[]
[{"$f":"Language!A366","v":"3a Setting Teaching/programming and/or process changeover"},{"$f":"Language!A367","v":"-     Adjustment and setting of protective devices and other components"}]
[null,{"$f":"Language!A368","v":"-     Adjustment and setting or verification of functional parameters of the machine (for example, speed, pressure, force, travelling limits)"}]
[null,{"$f":"Language!A369","v":"-     Clamping/fastening the workpiece"}]
[null,{"$f":"Language!A370","v":"-     Feeding, filling, loading of raw material"}]
[null,{"$f":"Language!A371","v":"-     Functional test, trials"}]
[null,{"$f":"Language!A372","v":"-     Mounting or changing tools, tool-setting"}]
[null,{"$f":"Language!A373","v":"-     Programming verification"}]
[null,{"$f":"Language!A374","v":"-     Verification of the final product"}]
[{"$f":"Language!A375","v":"3b Operation"},{"$f":"Language!A376","v":"-     Clamping/fastening the workpiece"}]
[null,{"$f":"Language!A377","v":"-     Control/inspection"}]
[null,{"$f":"Language!A378","v":"-     Driving the machine"}]
[null,{"$f":"Language!A379","v":"-     Feeding, filling, loading of raw material"}]
[null,{"$f":"Language!A380","v":"-     Manual loading/unloading"}]
[null,{"$f":"Language!A381","v":"-     Minor adjustments and setting of functional parameters of the machine (for example, speed, pressure, force, travel limits)"}]
[null,{"$f":"Language!A382","v":"-     Minor interventions during operation (for example, removing waste material, eliminating jams, local cleaning)"}]
[null,{"$f":"Language!A383","v":"-     Operating manual controls"}]
[null,{"$f":"Language!A384","v":"-     Restarting the machine after stopping/interruption"}]
[null,{"$f":"Language!A385","v":"-     Supervision"}]
[null,{"$f":"Language!A386","v":"-     Verification of the final product"}]
[{"$f":"Language!A387","v":"3c Cleaning / Maintenance"},{"$f":"Language!A388","v":"-     Adjustments"}]
[null,{"$f":"Language!A389","v":"-     Cleaning, disinfection"}]
[null,{"$f":"Language!A390","v":"-     Dismantling/removal of parts, components, devices of the machine"}]
[null,{"$f":"Language!A391","v":"-     Setup of the Machine"}]
[null,{"$f":"Language!A392","v":"-     Housekeeping"}]
[null,{"$f":"Language!A393","v":"-     Isolation and energy dissipation"}]
[null,{"$f":"Language!A394","v":"-     Lubrication"}]
[null,{"$f":"Language!A395","v":"-     Replacement of tools"}]
[null,{"$f":"Language!A396","v":"-     Replacement of worn parts"}]
[null,{"$f":"Language!A397","v":"-     Resetting"}]
[null,{"$f":"Language!A398","v":"-     Restoring fluid levels"}]
[null,{"$f":"Language!A399","v":"-     Verification of parts, components, devices of the machine"}]
[{"$f":"Language!A400","v":"3d Fault-finding/ Troubleshooting"},{"$f":"Language!A401","v":"-     Adjustments"}]
[null,{"$f":"Language!A402","v":"-     Dismantling/removal of parts, components, devices of the machine"}]
[null,{"$f":"Language!A403","v":"-     Fault-finding"}]
[null,{"$f":"Language!A404","v":"-     Isolation and energy dissipation"}]
[null,{"$f":"Language!A405","v":"-     Recovering from control and protective devices failure"}]
[null,{"$f":"Language!A406","v":"-     Recovering from jam"}]
[null,{"$f":"Language!A407","v":"-     Repairing"}]
[null,{"$f":"Language!A408","v":"-     Replacement of parts, components, devices of the machine"}]
[null,{"$f":"Language!A409","v":"-     Rescue of trapped persons"}]
[null,{"$f":"Language!A410","v":"-     Resetting"}]
[null,{"$f":"Language!A411","v":"-     Verification of parts, components, devices of the machine"}]
[{"$f":"Language!A412","v":"4. Dismantling / Disabling"},{"$f":"Language!A413","v":"-     Disconnection and energy dissipation"}]
[null,{"$f":"Language!A414","v":"-     Dismantling"}]
[null,{"$f":"Language!A415","v":"-     Lifting"}]
[null,{"$f":"Language!A416","v":"-     Loading"}]
[null,{"$f":"Language!A417","v":"-     Packing"}]
[null,{"$f":"Language!A418","v":"-     Transportation"}]
[null,{"$f":"Language!A419","v":"-     Unloading"}]
[]
[]
["[i]) ",{"$f":"Language!A420","v":"Machinery Directive, Annex I, No. 1.1.1 d: \"operator\" means the person or persons installing, operating, adjusting, maintaining, cleaning, repairing or moving machinery"}]
[]
["[ii]) ",{"$f":"Language!A421","v":"Analogue DIN VDE 0105-100: Skilled / trained personnel are persons who have been instructed and trained in the duties with which they are entrusted and the risks which may arise from incorrect behaviour. They also have been advised on the necessary protective devices and precautions. Personal which must be trained or instructed or which is in a general training is only allowed to perform under permanent control of a skilled person."}]
[]
["[iii]) ",{"$f":"Language!A422","v":"Analogue DIN VDE 0105-100: A specialist is a qualified person, which based on professional training, knowledge and experience is able to assess assigned duties and will be aware of possible risks. Furthermore this person knows the relevant regulations."}]
[]
[]
[]
[{"$f":"Language!A423","v":"List of Standards"}]
[{"$f":"Language!A425","v":"Number"},{"$f":"Language!A426","v":"Title"}]
[null," "]
[]
[]
[]
[]
[]
[]
[]
[null,""]

{"sheet":"Risk Assessment","index":1,"n_rows":185,"n_cols":60,"rows_kept":185,"cut":false,"hidden":false,"merged":[[2,30,3,30],[1,30,1,39],[2,31,2,34],[2,35,2,38],[1,22,1,29],[2,22,3,22],[2,29,3,29],[2,23,3,23],[2,24,3,24],[2,25,3,25],[2,26,3,26],[2,27,3,27],[2,28,3,28],[1,59,3,59],[1,56,3,56],[1,55,3,55],[1,58,3,58],[2,50,2,54],[1,50,1,54],[1,57,3,57],[2,49,3,49],[2,46,3,46],[1,40,1,49],[2,44,3,44],[2,43,3,43],[2,41,3,41],[2,42,3,42],[2,40,3,40],[2,47,3,47],[2,48,3,48],[2,45,3,45],[2,3,3,3],[1,1,2,2],[1,21,3,21],[1,20,3,20],[1,19,3,19],[1,9,3,9],[1,6,3,6],[2,13,2,18],[2,12,3,12],[2,4,2,5],[2,11,3,11],[1,7,3,7],[1,8,3,8],[2,10,3,10]]}
[]
[null,{"$f":"Language!A3","v":"Identifying Number of the hazard"},null,null,null,null,{"$f":"Language!A9","v":"Original (x=line can not be deleted)"},{"$f":"Language!A535","v":"is empty headline"},{"$f":"Language!A10","v":"Hazard exists"},{"$f":"Language!A59","v":"Date of last change"},null,null,null,null,null,null,null,null,null,{"$f":"Language!A23","v":"Place / hazard zone / position in drawing"},{"$f":"Language!A531","v":"hazardous event (hazard / hazardous situation)"},{"$f":"Language!A25","v":"Person in danger"},{"$f":"Language!A26","v":"Phase of life cycle (acc. to EN ISO 12100, Table B.3)"},null,null,null,null,null,null,null,{"$f":"Language!A35","v":"Risk Assessment"},null,null,null,null,null,null,null,null,null,{"$f":"Language!A41","v":"risk reduction"},null,null,null,null,null,null,null,null,null,null,null,null,null,null,{"$f":"Language!A55","v":"Further reduction of the risk necessary?"},{"$f":"Language!A57","v":"Comment"},{"$f":"Language!A58","v":"Person in charge"},{"$f":"Language!A60","v":"Hazard is covered?"},{"$f":"Language!A460","v":"Language of row"}]
[null,null,null,{"$f":"Language!A534","v":"Directive"},{"$f":"Language!A6","v":"Essential health and safety requirements"},null,null,null,null,null,{"$f":"Language!A540","v":"machine type"},{"$f":"Language!A12","v":"Content already covered?"},{"$f":"Language!A14","v":"Standard type"},{"$f":"Language!A16","v":"Hazard according to (harmonized) standard"},null,null,null,null,null,null,null,null,{"$f":"Language!A27","v":"All"},{"$f":"Language!A28","v":"Transport"},{"$f":"Language!A29","v":"Assembly and installation\nCommissioning"},{"$f":"Language!A30","v":"Setting\nTeaching/programming\nand/or process changeover"},{"$f":"Language!A31","v":"Operation"},{"$f":"Language!A32","v":"Cleaning\nMaintenance"},{"$f":"Language!A33","v":"Fault-finding/\nTroubleshooting"},{"$f":"Language!A34","v":"Dismantling\nDisabling"},{"$f":"Language!A539","v":"given by standard"},{"$f":"Language!A541","v":"EN ISO 13849"},null,null,null,{"$f":"Language!A542","v":"EN 62061"},null,null,null,null,{"$f":"Language!A42","v":"design and construction"},{"$f":"Language!A43","v":"protective measures"},{"$f":"Language!A44","v":"information"},{"$f":"Language!A45","v":"description of the risk reduction"},{"$f":"Language!A46","v":"applied technical standards / harmonised B / C standard"},{"$f":"Language!A47","v":"Title"},{"$f":"Language!A48","v":"Subclause of the Standard"},{"$f":"Language!A435","v":"Safety function (if protective measures are applied)"},{"$f":"Language!A446","v":"Verification-/ Validationfile"},{"$f":"Language!A49","v":"technical report / test result"},{"$f":"Language!A50","v":"Risk Assessment"}]
[null,{"$f":"Language!A4","v":"Main"},{"$f":"Language!A5","v":"Sub"},null,{"$f":"Language!A7","v":"No."},{"$f":"Language!A8","v":"Title"},null,null,null,null,null,null,null,{"$f":"Language!A17","v":"Standard number"},{"$f":"Language!A18","v":"Standard title"},{"$f":"Language!A19","v":"Subclause"},{"$f":"Language!A20","v":"Standard's content (short form)"},{"$f":"Language!A21","v":"Origin"},{"$f":"Language!A532","v":"potential consequences"},null,null,null,null,null,null,null,null,null,null,null,null,{"$f":"Language!A37","v":"S"},{"$f":"Language!A38","v":"F"},{"$f":"Language!A39","v":"P"},{"$f":"Language!A448","v":"O"},{"$f":"Language!A37","v":"S"},{"$f":"Language!A38","v":"F"},{"$f":"Language!A39","v":"P"},{"$f":"Language!A448","v":"O"},{"$f":"Language!A40","v":"Risk"},null,null,null,null,null,null,null,null,null,null,{"$f":"Language!A51","v":"S"},{"$f":"Language!A52","v":"F"},{"$f":"Language!A53","v":"P"},{"$f":"Language!A449","v":"O"},{"$f":"Language!A54","v":"Risk"}]
["Spalte1","Haupt","Unter","Richtlinie","Nr.","Bezeichnung","Original","Leere Überschrift","Gefährdung vorhanden","Datum der letzten Änderung","Maschinentyp","Inhalt bereits abgedeckt?","Norm-Typ","Norm Nummer","Norm Titel","Abschnitt / Detail","Norminhalt (eingekürzt und bearbeitet)","Ursprung","mögliche Auswirkung","Ort / Gefahrbereich / Position in Zeichnung","Gefährdung / Gefährdungssituation","Gefährdete Personen","Alle","Transport","Montage und Installation In Betrieb nehmen","Einrichten Einlernen (Teachen)/ Programmieren und/oder Umrüsten","Betrieb","Reinigung Instandhaltung","Fehlersuche und -beseitigung","Demontage Außer Betrieb nehmen","Normvorgabe","S","F","P","W","S62061","F62061","P62061","W62061","Risiko","konstruktiv","sicherheitstechnisch","informativ","Beschreibung der Risikominderung","angewandte technische Spezifikation / harmonisierte B / C Norm","Titel","Fundstelle in Norm","Sicherheitsfunktion","Verifikation Validation","technischer Bericht / Prüfergebnis","S2","F2","P2","W2","Risiko2","Weitere Reduzierung notwendig?","Kommentar","Bearbeiter","Gefährdung ist behandelt?","Sprache der Zeile"]
[null,null,null,"2006 / 42","1.1.",{"$f":"Language!A$83","v":"General remarks"},"x","x","x",null,null,null,null,null,null,null,null,null,null,null,null,null,null,null,null,null,null,null,null,null,null,null,null,null,null,null,null,null,null,null,null,null,null,null,null,null,null,null,null,null,null,null,null,null,{"$f":"IF((Table_RiskAssessment[[#This Row],[S2]]* Table_RiskAssessment[[#This Row],[F2]]* Table_RiskAssessment[[#This Row],[P2]]>0),IF(Table_RiskAssessment[[#This Row],[S2]]=1,IF(Table_RiskAssessment[[#This Row],[F2]]=1,IF(Table_RiskAssessment[[#This Row],[P2]]=1,\"a\",IF(Table_RiskAssessment[[#This Row],[W2]]=1,\"a\",\"b\")),IF(Table_RiskAssessment[[#This Row],[P2]]=1,IF(Table_RiskAssessment[[#This Row],[W2]]=1,\"a\",\"b\"),IF(Table_RiskAssessment[[#This Row],[W2]]=1,\"b\",\"c\"))),IF(Table_RiskAssessment[[#This Row],[F2]]=1,IF(Table_RiskAssessment[[#This Row],[P2]]=1,IF(Table_RiskAssessment[[#This Row],[W2]]=1,\"b\",\"c\"),IF(Table_RiskAssessment[[#This Row],[W2]]=1,\"c\",\"d\")),IF(Table_RiskAssessment[[#This Row],[P2]]=1,IF(Table_RiskAssessment[[#This Row],[W2]]=1,\"c\",\"d\"),IF(Table_RiskAssessment[[#This Row],[W2]]=1,\"d\",\"e\")))),\"?\")","v":"?"},null,null,null,"-"]
[null,null,null,"2006 / 42","1.1.2.",{"$f":"Language!A$84","v":"Principles of safety integration"},"x","","x",null,null,null,null,null,null,null,null,null,null,null,null,null,null,null,null,null,null,null,null,null,null,null,null,null,null,null,null,null,null,null,null,null,null,null,null,null,null,null,null,null,null,null,null,null,{"$f":"IF((Table_RiskAssessment[[#This Row],[S2]]* Table_RiskAssessment[[#This Row],[F2]]* Table_RiskAssessment[[#This Row],[P2]]>0),IF(Table_RiskAssessment[[#This Row],[S2]]=1,IF(Table_RiskAssessment[[#This Row],[F2]]=1,IF(Table_RiskAssessment[[#This Row],[P2]]=1,\"a\",IF(Table_RiskAssessment[[#This Row],[W2]]=1,\"a\",\"b\")),IF(Table_RiskAssessment[[#This Row],[P2]]=1,IF(Table_RiskAssessment[[#This Row],[W2]]=1,\"a\",\"b\"),IF(Table_RiskAssessment[[#This Row],[W2]]=1,\"b\",\"c\"))),IF(Table_RiskAssessment[[#This Row],[F2]]=1,IF(Table_RiskAssessment[[#This Row],[P2]]=1,IF(Table_RiskAssessment[[#This Row],[W2]]=1,\"b\",\"c\"),IF(Table_RiskAssessment[[#This Row],[W2]]=1,\"c\",\"d\")),IF(Table_RiskAssessment[[#This Row],[P2]]=1,IF(Table_RiskAssessment[[#This Row],[W2]]=1,\"c\",\"d\"),IF(Table_RiskAssessment[[#This Row],[W2]]=1,\"d\",\"e\")))),\"?\")","v":"?"},null,null,null,"-"]
[null,null,null,"2006 / 42","1.1.3.",{"$f":"Language!A$85","v":"Materials and products"},"x","","x",null,null,null,null,null,null,null,null,null,null,null,null,null,null,null,null,null,null,null,null,null,null,null,null,null,null,null,null,null,null,null,null,null,null,null,null,null,null,null,null,null,null,null,null,null,{"$f":"IF((Table_RiskAssessment[[#This Row],[S2]]* Table_RiskAssessment[[#This Row],[F2]]* Table_RiskAssessment[[#This Row],[P2]]>0),IF(Table_RiskAssessment[[#This Row],[S2]]=1,IF(Table_RiskAssessment[[#This Row],[F2]]=1,IF(Table_RiskAssessment[[#This Row],[P2]]=1,\"a\",IF(Table_RiskAssessment[[#This Row],[W2]]=1,\"a\",\"b\")),IF(Table_RiskAssessment[[#This Row],[P2]]=1,IF(Table_RiskAssessment[[#This Row],[W2]]=1,\"a\",\"b\"),IF(Table_RiskAssessment[[#This Row],[W2]]=1,\"b\",\"c\"))),IF(Table_RiskAssessment[[#This Row],[F2]]=1,IF(Table_RiskAssessment[[#This Row],[P2]]=1,IF(Table_RiskAssessment[[#This Row],[W2]]=1,\"b\",\"c\"),IF(Table_RiskAssessment[[#This Row],[W2]]=1,\"c\",\"d\")),IF(Table_RiskAssessment[[#This Row],[P2]]=1,IF(Table_RiskAssessment[[#This Row],[W2]]=1,\"c\",\"d\"),IF(Table_RiskAssessment[[#This Row],[W2]]=1,\"d\",\"e\")))),\"?\")","v":"?"},null,null,null,"-"]
[null,null,null,"2006 / 42","1.1.4.",{"$f":"Language!A$86","v":"Lighting"},"x","","x",null,null,null,null,"---",null,null,null,null,null,null,null,null,null,null,null,null,null,null,null,null,null,null,null,null,null,null,null,null,null,null,null,null,null,null,"---",null,null,null,null,null,null,null,null,null,{"$f":"IF((Table_RiskAssessment[[#This Row],[S2]]* Table_RiskAssessment[[#This Row],[F2]]* Table_RiskAssessment[[#This Row],[P2]]>0),IF(Table_RiskAssessment[[#This Row],[S2]]=1,IF(Table_RiskAssessment[[#This Row],[F2]]=1,IF(Table_RiskAssessment[[#This Row],[P2]]=1,\"a\",IF(Table_RiskAssessment[[#This Row],[W2]]=1,\"a\",\"b\")),IF(Table_RiskAssessment[[#This Row],[P2]]=1,IF(Table_RiskAssessment[[#This Row],[W2]]=1,\"a\",\"b\"),IF(Table_RiskAssessment[[#This Row],[W2]]=1,\"b\",\"c\"))),IF(Table_RiskAssessment[[#This Row],[F2]]=1,IF(Table_RiskAssessment[[#This Row],[P2]]=1,IF(Table_RiskAssessment[[#This Row],[W2]]=1,\"b\",\"c\"),IF(Table_RiskAssessment[[#This Row],[W2]]=1,\"c\",\"d\")),IF(Table_RiskAssessment[[#This Row],[P2]]=1,IF(Table_RiskAssessment[[#This Row],[W2]]=1,\"c\",\"d\"),IF(Table_RiskAssessment[[#This Row],[W2]]=1,\"d\",\"e\")))),\"?\")","v":"?"},null,null,null,"-"]
[null,null,null,"2006 / 42","1.1.5.",{"$f":"Language!A$87","v":"Design of machinery to facilitate its handling"},"x","","x",null,null,null,null,null,null,null,null,null,null,null,null,null,null,null,null,null,null,null,null,null,null,null,null,null,null,null,null,null,null,null,null,null,null,null,null,null,null,null,null,null,null,null,null,null,{"$f":"IF((Table_RiskAssessment[[#This Row],[S2]]* Table_RiskAssessment[[#This Row],[F2]]* Table_RiskAssessment[[#This Row],[P2]]>0),IF(Table_RiskAssessment[[#This Row],[S2]]=1,IF(Table_RiskAssessment[[#This Row],[F2]]=1,IF(Table_RiskAssessment[[#This Row],[P2]]=1,\"a\",IF(Table_RiskAssessment[[#This Row],[W2]]=1,\"a\",\"b\")),IF(Table_RiskAssessment[[#This Row],[P2]]=1,IF(Table_RiskAssessment[[#This Row],[W2]]=1,\"a\",\"b\"),IF(Table_RiskAssessment[[#This Row],[W2]]=1,\"b\",\"c\"))),IF(Table_RiskAssessment[[#This Row],[F2]]=1,IF(Table_RiskAssessment[[#This Row],[P2]]=1,IF(Table_RiskAssessment[[#This Row],[W2]]=1,\"b\",\"c\"),IF(Table_RiskAssessment[[#This Row],[W2]]=1,\"c\",\"d\")),IF(Table_RiskAssessment[[#This Row],[P2]]=1,IF(Table_RiskAssessment[[#This Row],[W2]]=1,\"c\",\"d\"),IF(Table_RiskAssessment[[#This Row],[W2]]=1,\"d\",\"e\")))),\"?\")","v":"?"},null,null,null,"-"]
[null,null,null,"2006 / 42","1.1.6.",{"$f":"Language!A$88","v":"Ergonomics"},"x","","x",null,null,null,null,"---",null,null,null,null,null,null,null,null,null,null,null,null,null,null,null,null,null,null,null,null,null,null,null,null,null,null,null,null,null,null,"---",null,null,null,null,null,null,null,null,null,{"$f":"IF((Table_RiskAssessment[[#This Row],[S2]]* Table_RiskAssessment[[#This Row],[F2]]* Table_RiskAssessment[[#This Row],[P2]]>0),IF(Table_RiskAssessment[[#This Row],[S2]]=1,IF(Table_RiskAssessment[[#This Row],[F2]]=1,IF(Table_RiskAssessment[[#This Row],[P2]]=1,\"a\",IF(Table_RiskAssessment[[#This Row],[W2]]=1,\"a\",\"b\")),IF(Table_RiskAssessment[[#This Row],[P2]]=1,IF(Table_RiskAssessment[[#This Row],[W2]]=1,\"a\",\"b\"),IF(Table_RiskAssessment[[#This Row],[W2]]=1,\"b\",\"c\"))),IF(Table_RiskAssessment[[#This Row],[F2]]=1,IF(Table_RiskAssessment[[#This Row],[P2]]=1,IF(Table_RiskAssessment[[#This Row],[W2]]=1,\"b\",\"c\"),IF(Table_RiskAssessment[[#This Row],[W2]]=1,\"c\",\"d\")),IF(Table_RiskAssessment[[#This Row],[P2]]=1,IF(Table_RiskAssessment[[#This Row],[W2]]=1,\"c\",\"d\"),IF(Table_RiskAssessment[[#This Row],[W2]]=1,\"d\",\"e\")))),\"?\")","v":"?"},null,null,null,"-"]
[null,null,null,"2006 / 42","1.1.7.",{"$f":"Language!A$89","v":"Operating positions"},"x","","x",null,null,null,null,null,null,null,null,null,null,null,null,null,null,null,null,null,null,null,null,null,null,null,null,null,null,null,null,null,null,null,null,null,null,null,null,null,null,null,null,null,null,null,null,null,{"$f":"IF((Table_RiskAssessment[[#This Row],[S2]]* Table_RiskAssessment[[#This Row],[F2]]* Table_RiskAssessment[[#This Row],[P2]]>0),IF(Table_RiskAssessment[[#This Row],[S2]]=1,IF(Table_RiskAssessment[[#This Row],[F2]]=1,IF(Table_RiskAssessment[[#This Row],[P2]]=1,\"a\",IF(Table_RiskAssessment[[#This Row],[W2]]=1,\"a\",\"b\")),IF(Table_RiskAssessment[[#This Row],[P2]]=1,IF(Table_RiskAssessment[[#This Row],[W2]]=1,\"a\",\"b\"),IF(Table_RiskAssessment[[#This Row],[W2]]=1,\"b\",\"c\"))),IF(Table_RiskAssessment[[#This Row],[F2]]=1,IF(Table_RiskAssessment[[#This Row],[P2]]=1,IF(Table_RiskAssessment[[#This Row],[W2]]=1,\"b\",\"c\"),IF(Table_RiskAssessment[[#This Row],[W2]]=1,\"c\",\"d\")),IF(Table_RiskAssessment[[#This Row],[P2]]=1,IF(Table_RiskAssessment[[#This Row],[W2]]=1,\"c\",\"d\"),IF(Table_RiskAssessment[[#This Row],[W2]]=1,\"d\",\"e\")))),\"?\")","v":"?"},null,null,null,"-"]
[null,null,null,"2006 / 42","1.1.8.",{"$f":"Language!A$90","v":"Seating"},"x","","x",null,null,null,null,null,null,null,null,null,null,null,null,null,null,null,null,null,null,null,null,null,null,null,null,null,null,null,null,null,null,null,null,null,null,null,null,null,null,null,null,null,null,null,null,null,{"$f":"IF((Table_RiskAssessment[[#This Row],[S2]]* Table_RiskAssessment[[#This Row],[F2]]* Table_RiskAssessment[[#This Row],[P2]]>0),IF(Table_RiskAssessment[[#This Row],[S2]]=1,IF(Table_RiskAssessment[[#This Row],[F2]]=1,IF(Table_RiskAssessment[[#This Row],[P2]]=1,\"a\",IF(Table_RiskAssessment[[#This Row],[W2]]=1,\"a\",\"b\")),IF(Table_RiskAssessment[[#This Row],[P2]]=1,IF(Table_RiskAssessment[[#This Row],[W2]]=1,\"a\",\"b\"),IF(Table_RiskAssessment[[#This Row],[W2]]=1,\"b\",\"c\"))),IF(Table_RiskAssessment[[#This Row],[F2]]=1,IF(Table_RiskAssessment[[#This Row],[P2]]=1,IF(Table_RiskAssessment[[#This Row],[W2]]=1,\"b\",\"c\"),IF(Table_RiskAssessment[[#This Row],[W2]]=1,\"c\",\"d\")),IF(Table_RiskAssessment[[#This Row],[P2]]=1,IF(Table_RiskAssessment[[#This Row],[W2]]=1,\"c\",\"d\"),IF(Table_RiskAssessment[[#This Row],[W2]]=1,\"d\",\"e\")))),\"?\")","v":"?"},null,null,null,"-"]
[null,null,null,"2006 / 42","1.2.",{"$f":"Language!A$91","v":"Control systems"},"x","x","x",null,null,null,null,null,null,null,null,null,null,null,null,null,null,null,null,null,null,null,null,null,null,null,null,null,null,null,null,null,null,null,null,null,null,null,null,null,null,null,null,null,null,null,null,null,{"$f":"IF((Table_RiskAssessment[[#This Row],[S2]]* Table_RiskAssessment[[#This Row],[F2]]* Table_RiskAssessment[[#This Row],[P2]]>0),IF(Table_RiskAssessment[[#This Row],[S2]]=1,IF(Table_RiskAssessment[[#This Row],[F2]]=1,IF(Table_RiskAssessment[[#This Row],[P2]]=1,\"a\",IF(Table_RiskAssessment[[#This Row],[W2]]=1,\"a\",\"b\")),IF(Table_RiskAssessment[[#This Row],[P2]]=1,IF(Table_RiskAssessment[[#This Row],[W2]]=1,\"a\",\"b\"),IF(Table_RiskAssessment[[#This Row],[W2]]=1,\"b\",\"c\"))),IF(Table_RiskAssessment[[#This Row],[F2]]=1,IF(Table_RiskAssessment[[#This Row],[P2]]=1,IF(Table_RiskAssessment[[#This Row],[W2]]=1,\"b\",\"c\"),IF(Table_RiskAssessment[[#This Row],[W2]]=1,\"c\",\"d\")),IF(Table_RiskAssessment[[#This Row],[P2]]=1,IF(Table_RiskAssessment[[#This Row],[W2]]=1,\"c\",\"d\"),IF(Table_RiskAssessment[[#This Row],[W2]]=1,\"d\",\"e\")))),\"?\")","v":"?"},null,null,null,"-"]
[null,null,null,"2006 / 42","1.2.1.",{"$f":"Language!A$92","v":"Safety and reliability of control systems"},"x","","x",null,null,null,null,"---",null,null,null,null,null,null,null,null,null,null,null,null,null,null,null,null,null,null,null,null,null,null,null,null,null,null,null,null,null,null,"---",null,null,null,null,null,null,null,null,null,{"$f":"IF((Table_RiskAssessment[[#This Row],[S2]]* Table_RiskAssessment[[#This Row],[F2]]* Table_RiskAssessment[[#This Row],[P2]]>0),IF(Table_RiskAssessment[[#This Row],[S2]]=1,IF(Table_RiskAssessment[[#This Row],[F2]]=1,IF(Table_RiskAssessment[[#This Row],[P2]]=1,\"a\",IF(Table_RiskAssessment[[#This Row],[W2]]=1,\"a\",\"b\")),IF(Table_RiskAssessment[[#This Row],[P2]]=1,IF(Table_RiskAssessment[[#This Row],[W2]]=1,\"a\",\"b\"),IF(Table_RiskAssessment[[#This Row],[W2]]=1,\"b\",\"c\"))),IF(Table_RiskAssessment[[#This Row],[F2]]=1,IF(Table_RiskAssessment[[#This Row],[P2]]=1,IF(Table_RiskAssessment[[#This Row],[W2]]=1,\"b\",\"c\"),IF(Table_RiskAssessment[[#This Row],[W2]]=1,\"c\",\"d\")),IF(Table_RiskAssessment[[#This Row],[P2]]=1,IF(Table_RiskAssessment[[#This Row],[W2]]=1,\"c\",\"d\"),IF(Table_RiskAssessment[[#This Row],[W2]]=1,\"d\",\"e\")))),\"?\")","v":"?"},null,null,null,"-"]
[null,null,null,"2006 / 42","1.2.2.",{"$f":"Language!A$93","v":"Control devices"},"x","","x",null,null,null,null,"---",null,null,null,null,null,null,null,null,null,null,null,null,null,null,null,null,null,null,null,null,null,null,null,null,null,null,null,null,null,null,"---",null,null,null,null,null,null,null,null,null,{"$f":"IF((Table_RiskAssessment[[#This Row],[S2]]* Table_RiskAssessment[[#This Row],[F2]]* Table_RiskAssessment[[#This Row],[P2]]>0),IF(Table_RiskAssessment[[#This Row],[S2]]=1,IF(Table_RiskAssessment[[#This Row],[F2]]=1,IF(Table_RiskAssessment[[#This Row],[P2]]=1,\"a\",IF(Table_RiskAssessment[[#This Row],[W2]]=1,\"a\",\"b\")),IF(Table_RiskAssessment[[#This Row],[P2]]=1,IF(Table_RiskAssessment[[#This Row],[W2]]=1,\"a\",\"b\"),IF(Table_RiskAssessment[[#This Row],[W2]]=1,\"b\",\"c\"))),IF(Table_RiskAssessment[[#This Row],[F2]]=1,IF(Table_RiskAssessment[[#This Row],[P2]]=1,IF(Table_RiskAssessment[[#This Row],[W2]]=1,\"b\",\"c\"),IF(Table_RiskAssessment[[#This Row],[W2]]=1,\"c\",\"d\")),IF(Table_RiskAssessment[[#This Row],[P2]]=1,IF(Table_RiskAssessment[[#This Row],[W2]]=1,\"c\",\"d\"),IF(Table_RiskAssessment[[#This Row],[W2]]=1,\"d\",\"e\")))),\"?\")","v":"?"},null,null,null,"-"]
[null,null,null,"2006 / 42","1.2.3.",{"$f":"Language!A$94","v":"Starting"},"x","","x",null,null,null,null,"---",null,null,null,null,null,null,null,null,null,null,null,null,null,null,null,null,null,null,null,null,null,null,null,null,null,null,null,null,null,null,"---",null,null,null,null,null,null,null,null,null,{"$f":"IF((Table_RiskAssessment[[#This Row],[S2]]* Table_RiskAssessment[[#This Row],[F2]]* Table_RiskAssessment[[#This Row],[P2]]>0),IF(Table_RiskAssessment[[#This Row],[S2]]=1,IF(Table_RiskAssessment[[#This Row],[F2]]=1,IF(Table_RiskAssessment[[#This Row],[P2]]=1,\"a\",IF(Table_RiskAssessment[[#This Row],[W2]]=1,\"a\",\"b\")),IF(Table_RiskAssessment[[#This Row],[P2]]=1,IF(Table_RiskAssessment[[#This Row],[W2]]=1,\"a\",\"b\"),IF(Table_RiskAssessment[[#This Row],[W2]]=1,\"b\",\"c\"))),IF(Table_RiskAssessment[[#This Row],[F2]]=1,IF(Table_RiskAssessment[[#This Row],[P2]]=1,IF(Table_RiskAssessment[[#This Row],[W2]]=1,\"b\",\"c\"),IF(Table_RiskAssessment[[#This Row],[W2]]=1,\"c\",\"d\")),IF(Table_RiskAssessment[[#This Row],[P2]]=1,IF(Table_RiskAssessment[[#This Row],[W2]]=1,\"c\",\"d\"),IF(Table_RiskAssessment[[#This Row],[W2]]=1,\"d\",\"e\")))),\"?\")","v":"?"},null,null,null,"-"]
[null,null,null,"2006 / 42","1.2.4.",{"$f":"Language!A$95","v":"Stopping"},"x","x","x",null,null,null,null,null,null,null,null,null,null,null,null,null,null,null,null,null,null,null,null,null,null,null,null,null,null,null,null,null,null,null,null,null,null,null,null,null,null,null,null,null,null,null,null,null,{"$f":"IF((Table_RiskAssessment[[#This Row],[S2]]* Table_RiskAssessment[[#This Row],[F2]]* Table_RiskAssessment[[#This Row],[P2]]>0),IF(Table_RiskAssessment[[#This Row],[S2]]=1,IF(Table_RiskAssessment[[#This Row],[F2]]=1,IF(Table_RiskAssessment[[#This Row],[P2]]=1,\"a\",IF(Table_RiskAssessment[[#This Row],[W2]]=1,\"a\",\"b\")),IF(Table_RiskAssessment[[#This Row],[P2]]=1,IF(Table_RiskAssessment[[#This Row],[W2]]=1,\"a\",\"b\"),IF(Table_RiskAssessment[[#This Row],[W2]]=1,\"b\",\"c\"))),IF(Table_RiskAssessment[[#This Row],[F2]]=1,IF(Table_RiskAssessment[[#This Row],[P2]]=1,IF(Table_RiskAssessment[[#This Row],[W2]]=1,\"b\",\"c\"),IF(Table_RiskAssessment[[#This Row],[W2]]=1,\"c\",\"d\")),IF(Table_RiskAssessment[[#This Row],[P2]]=1,IF(Table_RiskAssessment[[#This Row],[W2]]=1,\"c\",\"d\"),IF(Table_RiskAssessment[[#This Row],[W2]]=1,\"d\",\"e\")))),\"?\")","v":"?"},null,null,null,"-"]
[null,null,null,"2006 / 42","1.2.4.1.",{"$f":"Language!A$96","v":"Normal stop"},"x","","x",null,null,null,null,null,null,null,null,null,null,null,null,null,null,null,null,null,null,null,null,null,null,null,null,null,null,null,null,null,null,null,null,null,null,null,null,null,null,null,null,null,null,null,null,null,{"$f":"IF((Table_RiskAssessment[[#This Row],[S2]]* Table_RiskAssessment[[#This Row],[F2]]* Table_RiskAssessment[[#This Row],[P2]]>0),IF(Table_RiskAssessment[[#This Row],[S2]]=1,IF(Table_RiskAssessment[[#This Row],[F2]]=1,IF(Table_RiskAssessment[[#This Row],[P2]]=1,\"a\",IF(Table_RiskAssessment[[#This Row],[W2]]=1,\"a\",\"b\")),IF(Table_RiskAssessment[[#This Row],[P2]]=1,IF(Table_RiskAssessment[[#This Row],[W2]]=1,\"a\",\"b\"),IF(Table_RiskAssessment[[#This Row],[W2]]=1,\"b\",\"c\"))),IF(Table_RiskAssessment[[#This Row],[F2]]=1,IF(Table_RiskAssessment[[#This Row],[P2]]=1,IF(Table_RiskAssessment[[#This Row],[W2]]=1,\"b\",\"c\"),IF(Table_RiskAssessment[[#This Row],[W2]]=1,\"c\",\"d\")),IF(Table_RiskAssessment[[#This Row],[P2]]=1,IF(Table_RiskAssessment[[#This Row],[W2]]=1,\"c\",\"d\"),IF(Table_RiskAssessment[[#This Row],[W2]]=1,\"d\",\"e\")))),\"?\")","v":"?"},null,null,null,"-"]
[null,null,null,"2006 / 42","1.2.4.2.",{"$f":"Language!A$97","v":"Operational stop"},"x","","x",null,null,null,null,null,null,null,null,null,null,null,null,null,null,null,null,null,null,null,null,null,null,null,null,null,null,null,null,null,null,null,null,null,null,null,null,null,null,null,null,null,null,null,null,null,{"$f":"IF((Table_RiskAssessment[[#This Row],[S2]]* Table_RiskAssessment[[#This Row],[F2]]* Table_RiskAssessment[[#This Row],[P2]]>0),IF(Table_RiskAssessment[[#This Row],[S2]]=1,IF(Table_RiskAssessment[[#This Row],[F2]]=1,IF(Table_RiskAssessment[[#This Row],[P2]]=1,\"a\",IF(Table_RiskAssessment[[#This Row],[W2]]=1,\"a\",\"b\")),IF(Table_RiskAssessment[[#This Row],[P2]]=1,IF(Table_RiskAssessment[[#This Row],[W2]]=1,\"a\",\"b\"),IF(Table_RiskAssessment[[#This Row],[W2]]=1,\"b\",\"c\"))),IF(Table_RiskAssessment[[#This Row],[F2]]=1,IF(Table_RiskAssessment[[#This Row],[P2]]=1,IF(Table_RiskAssessment[[#This Row],[W2]]=1,\"b\",\"c\"),IF(Table_RiskAssessment[[#This Row],[W2]]=1,\"c\",\"d\")),IF(Table_RiskAssessment[[#This Row],[P2]]=1,IF(Table_RiskAssessment[[#This Row],[W2]]=1,\"c\",\"d\"),IF(Table_RiskAssessment[[#This Row],[W2]]=1,\"d\",\"e\")))),\"?\")","v":"?"},null,null,null,"-"]
[null,null,null,"2006 / 42","1.2.4.3.",{"$f":"Language!A$98","v":"Emergency stop"},"x","","x",null,null,null,null,"---",null,null,null,null,null,null,null,null,null,null,null,null,null,null,null,null,null,null,null,null,null,null,null,null,null,null,null,null,null,null,"---",null,null,null,null,null,null,null,null,null,{"$f":"IF((Table_RiskAssessment[[#This Row],[S2]]* Table_RiskAssessment[[#This Row],[F2]]* Table_RiskAssessment[[#This Row],[P2]]>0),IF(Table_RiskAssessment[[#This Row],[S2]]=1,IF(Table_RiskAssessment[[#This Row],[F2]]=1,IF(Table_RiskAssessment[[#This Row],[P2]]=1,\"a\",IF(Table_RiskAssessment[[#This Row],[W2]]=1,\"a\",\"b\")),IF(Table_RiskAssessment[[#This Row],[P2]]=1,IF(Table_RiskAssessment[[#This Row],[W2]]=1,\"a\",\"b\"),IF(Table_RiskAssessment[[#This Row],[W2]]=1,\"b\",\"c\"))),IF(Table_RiskAssessment[[#This Row],[F2]]=1,IF(Table_RiskAssessment[[#This Row],[P2]]=1,IF(Table_RiskAssessment[[#This Row],[W2]]=1,\"b\",\"c\"),IF(Table_RiskAssessment[[#This Row],[W2]]=1,\"c\",\"d\")),IF(Table_RiskAssessment[[#This Row],[P2]]=1,IF(Table_RiskAssessment[[#This Row],[W2]]=1,\"c\",\"d\"),IF(Table_RiskAssessment[[#This Row],[W2]]=1,\"d\",\"e\")))),\"?\")","v":"?"},null,null,null,"-"]
[null,null,null,"2006 / 42","1.2.4.4.",{"$f":"Language!A$99","v":"Assembly of machinery"},"x","","x",null,null,null,null,null,null,null,null,null,null,null,null,null,null,null,null,null,null,null,null,null,null,null,null,null,null,null,null,null,null,null,null,null,null,null,null,null,null,null,null,null,null,null,null,null,{"$f":"IF((Table_RiskAssessment[[#This Row],[S2]]* Table_RiskAssessment[[#This Row],[F2]]* Table_RiskAssessment[[#This Row],[P2]]>0),IF(Table_RiskAssessment[[#This Row],[S2]]=1,IF(Table_RiskAssessment[[#This Row],[F2]]=1,IF(Table_RiskAssessment[[#This Row],[P2]]=1,\"a\",IF(Table_RiskAssessment[[#This Row],[W2]]=1,\"a\",\"b\")),IF(Table_RiskAssessment[[#This Row],[P2]]=1,IF(Table_RiskAssessment[[#This Row],[W2]]=1,\"a\",\"b\"),IF(Table_RiskAssessment[[#This Row],[W2]]=1,\"b\",\"c\"))),IF(Table_RiskAssessment[[#This Row],[F2]]=1,IF(Table_RiskAssessment[[#This Row],[P2]]=1,IF(Table_RiskAssessment[[#This Row],[W2]]=1,\"b\",\"c\"),IF(Table_RiskAssessment[[#This Row],[W2]]=1,\"c\",\"d\")),IF(Table_RiskAssessment[[#This Row],[P2]]=1,IF(Table_RiskAssessment[[#This Row],[W2]]=1,\"c\",\"d\"),IF(Table_RiskAssessment[[#This Row],[W2]]=1,\"d\",\"e\")))),\"?\")","v":"?"},null,null,null,"-"]
[null,null,null,"2006 / 42","1.2.5.",{"$f":"Language!A$100","v":"Selection of control or operating modes"},"x","","x",null,null,null,null,null,null,null,null,null,null,null,null,null,null,null,null,null,null,null,null,null,null,null,null,null,null,null,null,null,null,null,null,null,null,null,null,null,null,null,null,null,null,null,null,null,{"$f":"IF((Table_RiskAssessment[[#This Row],[S2]]* Table_RiskAssessment[[#This Row],[F2]]* Table_RiskAssessment[[#This Row],[P2]]>0),IF(Table_RiskAssessment[[#This Row],[S2]]=1,IF(Table_RiskAssessment[[#This Row],[F2]]=1,IF(Table_RiskAssessment[[#This Row],[P2]]=1,\"a\",IF(Table_RiskAssessment[[#This Row],[W2]]=1,\"a\",\"b\")),IF(Table_RiskAssessment[[#This Row],[P2]]=1,IF(Table_RiskAssessment[[#This Row],[W2]]=1,\"a\",\"b\"),IF(Table_RiskAssessment[[#This Row],[W2]]=1,\"b\",\"c\"))),IF(Table_RiskAssessment[[#This Row],[F2]]=1,IF(Table_RiskAssessment[[#This Row],[P2]]=1,IF(Table_RiskAssessment[[#This Row],[W2]]=1,\"b\",\"c\"),IF(Table_RiskAssessment[[#This Row],[W2]]=1,\"c\",\"d\")),IF(Table_RiskAssessment[[#This Row],[P2]]=1,IF(Table_RiskAssessment[[#This Row],[W2]]=1,\"c\",\"d\"),IF(Table_RiskAssessment[[#This Row],[W2]]=1,\"d\",\"e\")))),\"?\")","v":"?"},null,null,null,"-"]
[null,null,null,"2006 / 42","1.2.6.",{"$f":"Language!A$101","v":"Failure of the power supply"},"x","","x",null,null,null,null,null,null,null,null,null,null,null,null,null,null,null,null,null,null,null,null,null,null,null,null,null,null,null,null,null,null,null,null,null,null,null,null,null,null,null,null,null,null,null,null,null,{"$f":"IF((Table_RiskAssessment[[#This Row],[S2]]* Table_RiskAssessment[[#This Row],[F2]]* Table_RiskAssessment[[#This Row],[P2]]>0),IF(Table_RiskAssessment[[#This Row],[S2]]=1,IF(Table_RiskAssessment[[#This Row],[F2]]=1,IF(Table_RiskAssessment[[#This Row],[P2]]=1,\"a\",IF(Table_RiskAssessment[[#This Row],[W2]]=1,\"a\",\"b\")),IF(Table_RiskAssessment[[#This Row],[P2]]=1,IF(Table_RiskAssessment[[#This Row],[W2]]=1,\"a\",\"b\"),IF(Table_RiskAssessment[[#This Row],[W2]]=1,\"b\",\"c\"))),IF(Table_RiskAssessment[[#This Row],[F2]]=1,IF(Table_RiskAssessment[[#This Row],[P2]]=1,IF(Table_RiskAssessment[[#This Row],[W2]]=1,\"b\",\"c\"),IF(Table_RiskAssessment[[#This Row],[W2]]=1,\"c\",\"d\")),IF(Table_RiskAssessment[[#This Row],[P2]]=1,IF(Table_RiskAssessment[[#This Row],[W2]]=1,\"c\",\"d\"),IF(Table_RiskAssessment[[#This Row],[W2]]=1,\"d\",\"e\")))),\"?\")","v":"?"},null,null,null,"-"]
[null,null,null,"2006 / 42","1.3.",{"$f":"Language!A$102","v":"Protection against mechanical hazards"},"x","x","x",null,null,null,null,null,null,null,null,null,null,null,null,null,null,null,null,null,null,null,null,null,null,null,null,null,null,null,null,null,null,null,null,null,null,null,null,null,null,null,null,null,null,null,null,null,{"$f":"IF((Table_RiskAssessment[[#This Row],[S2]]* Table_RiskAssessment[[#This Row],[F2]]* Table_RiskAssessment[[#This Row],[P2]]>0),IF(Table_RiskAssessment[[#This Row],[S2]]=1,IF(Table_RiskAssessment[[#This Row],[F2]]=1,IF(Table_RiskAssessment[[#This Row],[P2]]=1,\"a\",IF(Table_RiskAssessment[[#This Row],[W2]]=1,\"a\",\"b\")),IF(Table_RiskAssessment[[#This Row],[P2]]=1,IF(Table_RiskAssessment[[#This Row],[W2]]=1,\"a\",\"b\"),IF(Table_RiskAssessment[[#This Row],[W2]]=1,\"b\",\"c\"))),IF(Table_RiskAssessment[[#This Row],[F2]]=1,IF(Table_RiskAssessment[[#This Row],[P2]]=1,IF(Table_RiskAssessment[[#This Row],[W2]]=1,\"b\",\"c\"),IF(Table_RiskAssessment[[#This Row],[W2]]=1,\"c\",\"d\")),IF(Table_RiskAssessment[[#This Row],[P2]]=1,IF(Table_RiskAssessment[[#This Row],[W2]]=1,\"c\",\"d\"),IF(Table_RiskAssessment[[#This Row],[W2]]=1,\"d\",\"e\")))),\"?\")","v":"?"},null,null,null,"-"]
[null,null,null,"2006 / 42","1.3.1.",{"$f":"Language!A$103","v":"Risk of loss of stability"},"x","","x",null,null,null,null,null,null,null,null,null,null,null,null,null,null,null,null,null,null,null,null,null,null,null,null,null,null,null,null,null,null,null,null,null,null,null,null,null,null,null,null,null,null,null,null,null,{"$f":"IF((Table_RiskAssessment[[#This Row],[S2]]* Table_RiskAssessment[[#This Row],[F2]]* Table_RiskAssessment[[#This Row],[P2]]>0),IF(Table_RiskAssessment[[#This Row],[S2]]=1,IF(Table_RiskAssessment[[#This Row],[F2]]=1,IF(Table_RiskAssessment[[#This Row],[P2]]=1,\"a\",IF(Table_RiskAssessment[[#This Row],[W2]]=1,\"a\",\"b\")),IF(Table_RiskAssessment[[#This Row],[P2]]=1,IF(Table_RiskAssessment[[#This Row],[W2]]=1,\"a\",\"b\"),IF(Table_RiskAssessment[[#This Row],[W2]]=1,\"b\",\"c\"))),IF(Table_RiskAssessment[[#This Row],[F2]]=1,IF(Table_RiskAssessment[[#This Row],[P2]]=1,IF(Table_RiskAssessment[[#This Row],[W2]]=1,\"b\",\"c\"),IF(Table_RiskAssessment[[#This Row],[W2]]=1,\"c\",\"d\")),IF(Table_RiskAssessment[[#This Row],[P2]]=1,IF(Table_RiskAssessment[[#This Row],[W2]]=1,\"c\",\"d\"),IF(Table_RiskAssessment[[#This Row],[W2]]=1,\"d\",\"e\")))),\"?\")","v":"?"},null,null,null,"-"]
[null,null,null,"2006 / 42","1.3.2.",{"$f":"Language!A$104","v":"Risk of break-up during operation"},"x","","x",null,null,null,null,"---",null,null,null,null,null,null,null,null,null,null,null,null,null,null,null,null,null,null,null,null,null,null,null,null,null,null,null,null,null,null,"---",null,null,null,null,null,null,null,null,null,{"$f":"IF((Table_RiskAssessment[[#This Row],[S2]]* Table_RiskAssessment[[#This Row],[F2]]* Table_RiskAssessment[[#This Row],[P2]]>0),IF(Table_RiskAssessment[[#This Row],[S2]]=1,IF(Table_RiskAssessment[[#This Row],[F2]]=1,IF(Table_RiskAssessment[[#This Row],[P2]]=1,\"a\",IF(Table_RiskAssessment[[#This Row],[W2]]=1,\"a\",\"b\")),IF(Table_RiskAssessment[[#This Row],[P2]]=1,IF(Table_RiskAssessment[[#This Row],[W2]]=1,\"a\",\"b\"),IF(Table_RiskAssessment[[#This Row],[W2]]=1,\"b\",\"c\"))),IF(Table_RiskAssessment[[#This Row],[F2]]=1,IF(Table_RiskAssessment[[#This Row],[P2]]=1,IF(Table_RiskAssessment[[#This Row],[W2]]=1,\"b\",\"c\"),IF(Table_RiskAssessment[[#This Row],[W2]]=1,\"c\",\"d\")),IF(Table_RiskAssessment[[#This Row],[P2]]=1,IF(Table_RiskAssessment[[#This Row],[W2]]=1,\"c\",\"d\"),IF(Table_RiskAssessment[[#This Row],[W2]]=1,\"d\",\"e\")))),\"?\")","v":"?"},null,null,null,"-"]
[null,null,null,"2006 / 42","1.3.3.",{"$f":"Language!A$105","v":"Risks due to falling or ejected objects"},"x","","x",null,null,null,null,null,null,null,null,null,null,null,null,null,null,null,null,null,null,null,null,null,null,null,null,null,null,null,null,null,null,null,null,null,null,null,null,null,null,null,null,null,null,null,null,null,{"$f":"IF((Table_RiskAssessment[[#This Row],[S2]]* Table_RiskAssessment[[#This Row],[F2]]* Table_RiskAssessment[[#This Row],[P2]]>0),IF(Table_RiskAssessment[[#This Row],[S2]]=1,IF(Table_RiskAssessment[[#This Row],[F2]]=1,IF(Table_RiskAssessment[[#This Row],[P2]]=1,\"a\",IF(Table_RiskAssessment[[#This Row],[W2]]=1,\"a\",\"b\")),IF(Table_RiskAssessment[[#This Row],[P2]]=1,IF(Table_RiskAssessment[[#This Row],[W2]]=1,\"a\",\"b\"),IF(Table_RiskAssessment[[#This Row],[W2]]=1,\"b\",\"c\"))),IF(Table_RiskAssessment[[#This Row],[F2]]=1,IF(Table_RiskAssessment[[#This Row],[P2]]=1,IF(Table_RiskAssessment[[#This Row],[W2]]=1,\"b\",\"c\"),IF(Table_RiskAssessment[[#This Row],[W2]]=1,\"c\",\"d\")),IF(Table_RiskAssessment[[#This Row],[P2]]=1,IF(Table_RiskAssessment[[#This Row],[W2]]=1,\"c\",\"d\"),IF(Table_RiskAssessment[[#This Row],[W2]]=1,\"d\",\"e\")))),\"?\")","v":"?"},null,null,null,"-"]
[null,null,null,"2006 / 42","1.3.4.",{"$f":"Language!A$106","v":"Risks due to surfaces, edges or angles"},"x","","x",null,null,null,null,null,null,null,null,null,null,null,null,null,null,null,null,null,null,null,null,null,null,null,null,null,null,null,null,null,null,null,null,null,null,null,null,null,null,null,null,null,null,null,null,null,{"$f":"IF((Table_RiskAssessment[[#This Row],[S2]]* Table_RiskAssessment[[#This Row],[F2]]* Table_RiskAssessment[[#This Row],[P2]]>0),IF(Table_RiskAssessment[[#This Row],[S2]]=1,IF(Table_RiskAssessment[[#This Row],[F2]]=1,IF(Table_RiskAssessment[[#This Row],[P2]]=1,\"a\",IF(Table_RiskAssessment[[#This Row],[W2]]=1,\"a\",\"b\")),IF(Table_RiskAssessment[[#This Row],[P2]]=1,IF(Table_RiskAssessment[[#This Row],[W2]]=1,\"a\",\"b\"),IF(Table_RiskAssessment[[#This Row],[W2]]=1,\"b\",\"c\"))),IF(Table_RiskAssessment[[#This Row],[F2]]=1,IF(Table_RiskAssessment[[#This Row],[P2]]=1,IF(Table_RiskAssessment[[#This Row],[W2]]=1,\"b\",\"c\"),IF(Table_RiskAssessment[[#This Row],[W2]]=1,\"c\",\"d\")),IF(Table_RiskAssessment[[#This Row],[P2]]=1,IF(Table_RiskAssessment[[#This Row],[W2]]=1,\"c\",\"d\"),IF(Table_RiskAssessment[[#This Row],[W2]]=1,\"d\",\"e\")))),\"?\")","v":"?"},null,null,null,"-"]
[null,null,null,"2006 / 42","1.3.5.",{"$f":"Language!A$107","v":"Risks related to combined machinery"},"x","","x",null,null,null,null,null,null,null,null,null,null,null,null,null,null,null,null,null,null,null,null,null,null,null,null,null,null,null,null,null,null,null,null,null,null,null,null,null,null,null,null,null,null,null,null,null,{"$f":"IF((Table_RiskAssessment[[#This Row],[S2]]* Table_RiskAssessment[[#This Row],[F2]]* Table_RiskAssessment[[#This Row],[P2]]>0),IF(Table_RiskAssessment[[#This Row],[S2]]=1,IF(Table_RiskAssessment[[#This Row],[F2]]=1,IF(Table_RiskAssessment[[#This Row],[P2]]=1,\"a\",IF(Table_RiskAssessment[[#This Row],[W2]]=1,\"a\",\"b\")),IF(Table_RiskAssessment[[#This Row],[P2]]=1,IF(Table_RiskAssessment[[#This Row],[W2]]=1,\"a\",\"b\"),IF(Table_RiskAssessment[[#This Row],[W2]]=1,\"b\",\"c\"))),IF(Table_RiskAssessment[[#This Row],[F2]]=1,IF(Table_RiskAssessment[[#This Row],[P2]]=1,IF(Table_RiskAssessment[[#This Row],[W2]]=1,\"b\",\"c\"),IF(Table_RiskAssessment[[#This Row],[W2]]=1,\"c\",\"d\")),IF(Table_RiskAssessment[[#This Row],[P2]]=1,IF(Table_RiskAssessment[[#This Row],[W2]]=1,\"c\",\"d\"),IF(Table_RiskAssessment[[#This Row],[W2]]=1,\"d\",\"e\")))),\"?\")","v":"?"},null,null,null,"-"]
[null,null,null,"2006 / 42","1.3.6.",{"$f":"Language!A$108","v":"Risks related to variations in operating conditions"},"x","","x",null,null,null,null,null,null,null,null,null,null,null,null,null,null,null,null,null,null,null,null,null,null,null,null,null,null,null,null,null,null,null,null,null,null,null,null,null,null,null,null,null,null,null,null,null,{"$f":"IF((Table_RiskAssessment[[#This Row],[S2]]* Table_RiskAssessment[[#This Row],[F2]]* Table_RiskAssessment[[#This Row],[P2]]>0),IF(Table_RiskAssessment[[#This Row],[S2]]=1,IF(Table_RiskAssessment[[#This Row],[F2]]=1,IF(Table_RiskAssessment[[#This Row],[P2]]=1,\"a\",IF(Table_RiskAssessment[[#This Row],[W2]]=1,\"a\",\"b\")),IF(Table_RiskAssessment[[#This Row],[P2]]=1,IF(Table_RiskAssessment[[#This Row],[W2]]=1,\"a\",\"b\"),IF(Table_RiskAssessment[[#This Row],[W2]]=1,\"b\",\"c\"))),IF(Table_RiskAssessment[[#This Row],[F2]]=1,IF(Table_RiskAssessment[[#This Row],[P2]]=1,IF(Table_RiskAssessment[[#This Row],[W2]]=1,\"b\",\"c\"),IF(Table_RiskAssessment[[#This Row],[W2]]=1,\"c\",\"d\")),IF(Table_RiskAssessment[[#This Row],[P2]]=1,IF(Table_RiskAssessment[[#This Row],[W2]]=1,\"c\",\"d\"),IF(Table_RiskAssessment[[#This Row],[W2]]=1,\"d\",\"e\")))),\"?\")","v":"?"},null,null,null,"-"]
[null,null,null,"2006 / 42","1.3.7.",{"$f":"Language!A$109","v":"Risks related to moving parts"},"x","","x",null,null,null,null,"---",null,null,null,null,null,null,null,null,null,null,null,null,null,null,null,null,null,null,null,null,null,null,null,null,null,null,null,null,null,null,"---",null,null,null,null,null,null,null,null,null,{"$f":"IF((Table_RiskAssessment[[#This Row],[S2]]* Table_RiskAssessment[[#This Row],[F2]]* Table_RiskAssessment[[#This Row],[P2]]>0),IF(Table_RiskAssessment[[#This Row],[S2]]=1,IF(Table_RiskAssessment[[#This Row],[F2]]=1,IF(Table_RiskAssessment[[#This Row],[P2]]=1,\"a\",IF(Table_RiskAssessment[[#This Row],[W2]]=1,\"a\",\"b\")),IF(Table_RiskAssessment[[#This Row],[P2]]=1,IF(Table_RiskAssessment[[#This Row],[W2]]=1,\"a\",\"b\"),IF(Table_RiskAssessment[[#This Row],[W2]]=1,\"b\",\"c\"))),IF(Table_RiskAssessment[[#This Row],[F2]]=1,IF(Table_RiskAssessment[[#This Row],[P2]]=1,IF(Table_RiskAssessment[[#This Row],[W2]]=1,\"b\",\"c\"),IF(Table_RiskAssessment[[#This Row],[W2]]=1,\"c\",\"d\")),IF(Table_RiskAssessment[[#This Row],[P2]]=1,IF(Table_RiskAssessment[[#This Row],[W2]]=1,\"c\",\"d\"),IF(Table_RiskAssessment[[#This Row],[W2]]=1,\"d\",\"e\")))),\"?\")","v":"?"},null,null,null,"-"]
[null,null,null,"2006 / 42","1.3.8.",{"$f":"Language!A$110","v":"Choice of protection against risks arising from moving parts"},"x","x","x",null,null,null,null,null,null,null,null,null,null,null,null,null,null,null,null,null,null,null,null,null,null,null,null,null,null,null,null,null,null,null,null,null,null,null,null,null,null,null,null,null,null,null,null,null,{"$f":"IF((Table_RiskAssessment[[#This Row],[S2]]* Table_RiskAssessment[[#This Row],[F2]]* Table_RiskAssessment[[#This Row],[P2]]>0),IF(Table_RiskAssessment[[#This Row],[S2]]=1,IF(Table_RiskAssessment[[#This Row],[F2]]=1,IF(Table_RiskAssessment[[#This Row],[P2]]=1,\"a\",IF(Table_RiskAssessment[[#This Row],[W2]]=1,\"a\",\"b\")),IF(Table_RiskAssessment[[#This Row],[P2]]=1,IF(Table_RiskAssessment[[#This Row],[W2]]=1,\"a\",\"b\"),IF(Table_RiskAssessment[[#This Row],[W2]]=1,\"b\",\"c\"))),IF(Table_RiskAssessment[[#This Row],[F2]]=1,IF(Table_RiskAssessment[[#This Row],[P2]]=1,IF(Table_RiskAssessment[[#This Row],[W2]]=1,\"b\",\"c\"),IF(Table_RiskAssessment[[#This Row],[W2]]=1,\"c\",\"d\")),IF(Table_RiskAssessment[[#This Row],[P2]]=1,IF(Table_RiskAssessment[[#This Row],[W2]]=1,\"c\",\"d\"),IF(Table_RiskAssessment[[#This Row],[W2]]=1,\"d\",\"e\")))),\"?\")","v":"?"},null,null,null,"-"]
[null,null,null,"2006 / 42","1.3.8.1.",{"$f":"Language!A$111","v":"Moving transmission parts"},"x","","x",null,null,null,null,null,null,null,null,null,null,null,null,null,null,null,null,null,null,null,null,null,null,null,null,null,null,null,null,null,null,null,null,null,null,null,null,null,null,null,null,null,null,null,null,null,{"$f":"IF((Table_RiskAssessment[[#This Row],[S2]]* Table_RiskAssessment[[#This Row],[F2]]* Table_RiskAssessment[[#This Row],[P2]]>0),IF(Table_RiskAssessment[[#This Row],[S2]]=1,IF(Table_RiskAssessment[[#This Row],[F2]]=1,IF(Table_RiskAssessment[[#This Row],[P2]]=1,\"a\",IF(Table_RiskAssessment[[#This Row],[W2]]=1,\"a\",\"b\")),IF(Table_RiskAssessment[[#This Row],[P2]]=1,IF(Table_RiskAssessment[[#This Row],[W2]]=1,\"a\",\"b\"),IF(Table_RiskAssessment[[#This Row],[W2]]=1,\"b\",\"c\"))),IF(Table_RiskAssessment[[#This Row],[F2]]=1,IF(Table_RiskAssessment[[#This Row],[P2]]=1,IF(Table_RiskAssessment[[#This Row],[W2]]=1,\"b\",\"c\"),IF(Table_RiskAssessment[[#This Row],[W2]]=1,\"c\",\"d\")),IF(Table_RiskAssessment[[#This Row],[P2]]=1,IF(Table_RiskAssessment[[#This Row],[W2]]=1,\"c\",\"d\"),IF(Table_RiskAssessment[[#This Row],[W2]]=1,\"d\",\"e\")))),\"?\")","v":"?"},null,null,null,"-"]
[null,null,null,"2006 / 42","1.3.8.2.",{"$f":"Language!A$112","v":"Moving parts involved in the process"},"x","","x",null,null,null,null,null,null,null,null,null,null,null,null,null,null,null,null,null,null,null,null,null,null,null,null,null,null,null,null,null,null,null,null,null,null,null,null,null,null,null,null,null,null,null,null,null,{"$f":"IF((Table_RiskAssessment[[#This Row],[S2]]* Table_RiskAssessment[[#This Row],[F2]]* Table_RiskAssessment[[#This Row],[P2]]>0),IF(Table_RiskAssessment[[#This Row],[S2]]=1,IF(Table_RiskAssessment[[#This Row],[F2]]=1,IF(Table_RiskAssessment[[#This Row],[P2]]=1,\"a\",IF(Table_RiskAssessment[[#This Row],[W2]]=1,\"a\",\"b\")),IF(Table_RiskAssessment[[#This Row],[P2]]=1,IF(Table_RiskAssessment[[#This Row],[W2]]=1,\"a\",\"b\"),IF(Table_RiskAssessment[[#This Row],[W2]]=1,\"b\",\"c\"))),IF(Table_RiskAssessment[[#This Row],[F2]]=1,IF(Table_RiskAssessment[[#This Row],[P2]]=1,IF(Table_RiskAssessment[[#This Row],[W2]]=1,\"b\",\"c\"),IF(Table_RiskAssessment[[#This Row],[W2]]=1,\"c\",\"d\")),IF(Table_RiskAssessment[[#This Row],[P2]]=1,IF(Table_RiskAssessment[[#This Row],[W2]]=1,\"c\",\"d\"),IF(Table_RiskAssessment[[#This Row],[W2]]=1,\"d\",\"e\")))),\"?\")","v":"?"},null,null,null,"-"]
[null,null,null,"2006 / 42","1.3.9.",{"$f":"Language!A$113","v":"Risks of uncontrolled movements"},"x","","x",null,null,null,null,null,null,null,null,null,null,null,null,null,null,null,null,null,null,null,null,null,null,null,null,null,null,null,null,null,null,null,null,null,null,null,null,null,null,null,null,null,null,null,null,null,{"$f":"IF((Table_RiskAssessment[[#This Row],[S2]]* Table_RiskAssessment[[#This Row],[F2]]* Table_RiskAssessment[[#This Row],[P2]]>0),IF(Table_RiskAssessment[[#This Row],[S2]]=1,IF(Table_RiskAssessment[[#This Row],[F2]]=1,IF(Table_RiskAssessment[[#This Row],[P2]]=1,\"a\",IF(Table_RiskAssessment[[#This Row],[W2]]=1,\"a\",\"b\")),IF(Table_RiskAssessment[[#This Row],[P2]]=1,IF(Table_RiskAssessment[[#This Row],[W2]]=1,\"a\",\"b\"),IF(Table_RiskAssessment[[#This Row],[W2]]=1,\"b\",\"c\"))),IF(Table_RiskAssessment[[#This Row],[F2]]=1,IF(Table_RiskAssessment[[#This Row],[P2]]=1,IF(Table_RiskAssessment[[#This Row],[W2]]=1,\"b\",\"c\"),IF(Table_RiskAssessment[[#This Row],[W2]]=1,\"c\",\"d\")),IF(Table_RiskAssessment[[#This Row],[P2]]=1,IF(Table_RiskAssessment[[#This Row],[W2]]=1,\"c\",\"d\"),IF(Table_RiskAssessment[[#This Row],[W2]]=1,\"d\",\"e\")))),\"?\")","v":"?"},null,null,null,"-"]
[null,null,null,"2006 / 42","1.4.",{"$f":"Language!A$114","v":"Required characteristics of guards and protective devices"},"x","x","x",null,null,null,null,null,null,null,null,null,null,null,null,null,null,null,null,null,null,null,null,null,null,null,null,null,null,null,null,null,null,null,null,null,null,null,null,null,null,null,null,null,null,null,null,null,{"$f":"IF((Table_RiskAssessment[[#This Row],[S2]]* Table_RiskAssessment[[#This Row],[F2]]* Table_RiskAssessment[[#This Row],[P2]]>0),IF(Table_RiskAssessment[[#This Row],[S2]]=1,IF(Table_RiskAssessment[[#This Row],[F2]]=1,IF(Table_RiskAssessment[[#This Row],[P2]]=1,\"a\",IF(Table_RiskAssessment[[#This Row],[W2]]=1,\"a\",\"b\")),IF(Table_RiskAssessment[[#This Row],[P2]]=1,IF(Table_RiskAssessment[[#This Row],[W2]]=1,\"a\",\"b\"),IF(Table_RiskAssessment[[#This Row],[W2]]=1,\"b\",\"c\"))),IF(Table_RiskAssessment[[#This Row],[F2]]=1,IF(Table_RiskAssessment[[#This Row],[P2]]=1,IF(Table_RiskAssessment[[#This Row],[W2]]=1,\"b\",\"c\"),IF(Table_RiskAssessment[[#This Row],[W2]]=1,\"c\",\"d\")),IF(Table_RiskAssessment[[#This Row],[P2]]=1,IF(Table_RiskAssessment[[#This Row],[W2]]=1,\"c\",\"d\"),IF(Table_RiskAssessment[[#This Row],[W2]]=1,\"d\",\"e\")))),\"?\")","v":"?"},null,null,null,"-"]
[null,null,null,"2006 / 42","1.4.1.",{"$f":"Language!A$115","v":"General requirements"},"x","","x",null,null,null,null,null,null,null,null,null,null,null,null,null,null,null,null,null,null,null,null,null,null,null,null,null,null,null,null,null,null,null,null,null,null,null,null,null,null,null,null,null,null,null,null,null,{"$f":"IF((Table_RiskAssessment[[#This Row],[S2]]* Table_RiskAssessment[[#This Row],[F2]]* Table_RiskAssessment[[#This Row],[P2]]>0),IF(Table_RiskAssessment[[#This Row],[S2]]=1,IF(Table_RiskAssessment[[#This Row],[F2]]=1,IF(Table_RiskAssessment[[#This Row],[P2]]=1,\"a\",IF(Table_RiskAssessment[[#This Row],[W2]]=1,\"a\",\"b\")),IF(Table_RiskAssessment[[#This Row],[P2]]=1,IF(Table_RiskAssessment[[#This Row],[W2]]=1,\"a\",\"b\"),IF(Table_RiskAssessment[[#This Row],[W2]]=1,\"b\",\"c\"))),IF(Table_RiskAssessment[[#This Row],[F2]]=1,IF(Table_RiskAssessment[[#This Row],[P2]]=1,IF(Table_RiskAssessment[[#This Row],[W2]]=1,\"b\",\"c\"),IF(Table_RiskAssessment[[#This Row],[W2]]=1,\"c\",\"d\")),IF(Table_RiskAssessment[[#This Row],[P2]]=1,IF(Table_RiskAssessment[[#This Row],[W2]]=1,\"c\",\"d\"),IF(Table_RiskAssessment[[#This Row],[W2]]=1,\"d\",\"e\")))),\"?\")","v":"?"},null,null,null,"-"]
[null,null,null,"2006 / 42","1.4.2.",{"$f":"Language!A$116","v":"Special requirements for guards"},"x","x","x",null,null,null,null,"---",null,null,null,null,null,null,null,null,null,null,null,null,null,null,null,null,null,null,null,null,null,null,null,null,null,null,null,null,null,null,"---",null,null,null,null,null,null,null,null,null,{"$f":"IF((Table_RiskAssessment[[#This Row],[S2]]* Table_RiskAssessment[[#This Row],[F2]]* Table_RiskAssessment[[#This Row],[P2]]>0),IF(Table_RiskAssessment[[#This Row],[S2]]=1,IF(Table_RiskAssessment[[#This Row],[F2]]=1,IF(Table_RiskAssessment[[#This Row],[P2]]=1,\"a\",IF(Table_RiskAssessment[[#This Row],[W2]]=1,\"a\",\"b\")),IF(Table_RiskAssessment[[#This Row],[P2]]=1,IF(Table_RiskAssessment[[#This Row],[W2]]=1,\"a\",\"b\"),IF(Table_RiskAssessment[[#This Row],[W2]]=1,\"b\",\"c\"))),IF(Table_RiskAssessment[[#This Row],[F2]]=1,IF(Table_RiskAssessment[[#This Row],[P2]]=1,IF(Table_RiskAssessment[[#This Row],[W2]]=1,\"b\",\"c\"),IF(Table_RiskAssessment[[#This Row],[W2]]=1,\"c\",\"d\")),IF(Table_RiskAssessment[[#This Row],[P2]]=1,IF(Table_RiskAssessment[[#This Row],[W2]]=1,\"c\",\"d\"),IF(Table_RiskAssessment[[#This Row],[W2]]=1,\"d\",\"e\")))),\"?\")","v":"?"},null,null,null,"-"]
[null,null,null,"2006 / 42","1.4.2.1.",{"$f":"Language!A$117","v":"Fixed guards"},"x","","x",null,null,null,null,null,null,null,null,null,null,null,null,null,null,null,null,null,null,null,null,null,null,null,null,null,null,null,null,null,null,null,null,null,null,null,null,null,null,null,null,null,null,null,null,null,{"$f":"IF((Table_RiskAssessment[[#This Row],[S2]]* Table_RiskAssessment[[#This Row],[F2]]* Table_RiskAssessment[[#This Row],[P2]]>0),IF(Table_RiskAssessment[[#This Row],[S2]]=1,IF(Table_RiskAssessment[[#This Row],[F2]]=1,IF(Table_RiskAssessment[[#This Row],[P2]]=1,\"a\",IF(Table_RiskAssessment[[#This Row],[W2]]=1,\"a\",\"b\")),IF(Table_RiskAssessment[[#This Row],[P2]]=1,IF(Table_RiskAssessment[[#This Row],[W2]]=1,\"a\",\"b\"),IF(Table_RiskAssessment[[#This Row],[W2]]=1,\"b\",\"c\"))),IF(Table_RiskAssessment[[#This Row],[F2]]=1,IF(Table_RiskAssessment[[#This Row],[P2]]=1,IF(Table_RiskAssessment[[#This Row],[W2]]=1,\"b\",\"c\"),IF(Table_RiskAssessment[[#This Row],[W2]]=1,\"c\",\"d\")),IF(Table_RiskAssessment[[#This Row],[P2]]=1,IF(Table_RiskAssessment[[#This Row],[W2]]=1,\"c\",\"d\"),IF(Table_RiskAssessment[[#This Row],[W2]]=1,\"d\",\"e\")))),\"?\")","v":"?"},null,null,null,"-"]
[null,null,null,"2006 / 42","1.4.2.2.",{"$f":"Language!A$118","v":"Interlocking movable guards"},"x","","x",null,null,null,null,"---",null,null,null,null,null,null,null,null,null,null,null,null,null,null,null,null,null,null,null,null,null,null,null,null,null,null,null,null,null,null,"---",null,null,null,null,null,null,null,null,null,{"$f":"IF((Table_RiskAssessment[[#This Row],[S2]]* Table_RiskAssessment[[#This Row],[F2]]* Table_RiskAssessment[[#This Row],[P2]]>0),IF(Table_RiskAssessment[[#This Row],[S2]]=1,IF(Table_RiskAssessment[[#This Row],[F2]]=1,IF(Table_RiskAssessment[[#This Row],[P2]]=1,\"a\",IF(Table_RiskAssessment[[#This Row],[W2]]=1,\"a\",\"b\")),IF(Table_RiskAssessment[[#This Row],[P2]]=1,IF(Table_RiskAssessment[[#This Row],[W2]]=1,\"a\",\"b\"),IF(Table_RiskAssessment[[#This Row],[W2]]=1,\"b\",\"c\"))),IF(Table_RiskAssessment[[#This Row],[F2]]=1,IF(Table_RiskAssessment[[#This Row],[P2]]=1,IF(Table_RiskAssessment[[#This Row],[W2]]=1,\"b\",\"c\"),IF(Table_RiskAssessment[[#This Row],[W2]]=1,\"c\",\"d\")),IF(Table_RiskAssessment[[#This Row],[P2]]=1,IF(Table_RiskAssessment[[#This Row],[W2]]=1,\"c\",\"d\"),IF(Table_RiskAssessment[[#This Row],[W2]]=1,\"d\",\"e\")))),\"?\")","v":"?"},null,null,null,"-"]
[null,null,null,"2006 / 42","1.4.2.3.",{"$f":"Language!A$119","v":"Adjustable guards restricting access"},"x","","x",null,null,null,null,null,null,null,null,null,null,null,null,null,null,null,null,null,null,null,null,null,null,null,null,null,null,null,null,null,null,null,null,null,null,null,null,null,null,null,null,null,null,null,null,null,{"$f":"IF((Table_RiskAssessment[[#This Row],[S2]]* Table_RiskAssessment[[#This Row],[F2]]* Table_RiskAssessment[[#This Row],[P2]]>0),IF(Table_RiskAssessment[[#This Row],[S2]]=1,IF(Table_RiskAssessment[[#This Row],[F2]]=1,IF(Table_RiskAssessment[[#This Row],[P2]]=1,\"a\",IF(Table_RiskAssessment[[#This Row],[W2]]=1,\"a\",\"b\")),IF(Table_RiskAssessment[[#This Row],[P2]]=1,IF(Table_RiskAssessment[[#This Row],[W2]]=1,\"a\",\"b\"),IF(Table_RiskAssessment[[#This Row],[W2]]=1,\"b\",\"c\"))),IF(Table_RiskAssessment[[#This Row],[F2]]=1,IF(Table_RiskAssessment[[#This Row],[P2]]=1,IF(Table_RiskAssessment[[#This Row],[W2]]=1,\"b\",\"c\"),IF(Table_RiskAssessment[[#This Row],[W2]]=1,\"c\",\"d\")),IF(Table_RiskAssessment[[#This Row],[P2]]=1,IF(Table_RiskAssessment[[#This Row],[W2]]=1,\"c\",\"d\"),IF(Table_RiskAssessment[[#This Row],[W2]]=1,\"d\",\"e\")))),\"?\")","v":"?"},null,null,null,"-"]
[null,null,null,"2006 / 42","1.4.3.",{"$f":"Language!A$120","v":"Special requirements for protective devices"},"x","","x",null,null,null,null,"---",null,null,null,null,null,null,null,null,null,null,null,null,null,null,null,null,null,null,null,null,null,null,null,null,null,null,null,null,null,null,"---",null,null,null,null,null,null,null,null,null,{"$f":"IF((Table_RiskAssessment[[#This Row],[S2]]* Table_RiskAssessment[[#This Row],[F2]]* Table_RiskAssessment[[#This Row],[P2]]>0),IF(Table_RiskAssessment[[#This Row],[S2]]=1,IF(Table_RiskAssessment[[#This Row],[F2]]=1,IF(Table_RiskAssessment[[#This Row],[P2]]=1,\"a\",IF(Table_RiskAssessment[[#This Row],[W2]]=1,\"a\",\"b\")),IF(Table_RiskAssessment[[#This Row],[P2]]=1,IF(Table_RiskAssessment[[#This Row],[W2]]=1,\"a\",\"b\"),IF(Table_RiskAssessment[[#This Row],[W2]]=1,\"b\",\"c\"))),IF(Table_RiskAssessment[[#This Row],[F2]]=1,IF(Table_RiskAssessment[[#This Row],[P2]]=1,IF(Table_RiskAssessment[[#This Row],[W2]]=1,\"b\",\"c\"),IF(Table_RiskAssessment[[#This Row],[W2]]=1,\"c\",\"d\")),IF(Table_RiskAssessment[[#This Row],[P2]]=1,IF(Table_RiskAssessment[[#This Row],[W2]]=1,\"c\",\"d\"),IF(Table_RiskAssessment[[#This Row],[W2]]=1,\"d\",\"e\")))),\"?\")","v":"?"},null,null,null,"-"]
[null,null,null,"2006 / 42","1.5.",{"$f":"Language!A$121","v":"Risks due to other hazards"},"x","x","x",null,null,null,null,null,null,null,null,null,null,null,null,null,null,null,null,null,null,null,null,null,null,null,null,null,null,null,null,null,null,null,null,null,null,null,null,null,null,null,null,null,null,null,null,null,{"$f":"IF((Table_RiskAssessment[[#This Row],[S2]]* Table_RiskAssessment[[#This Row],[F2]]* Table_RiskAssessment[[#This Row],[P2]]>0),IF(Table_RiskAssessment[[#This Row],[S2]]=1,IF(Table_RiskAssessment[[#This Row],[F2]]=1,IF(Table_RiskAssessment[[#This Row],[P2]]=1,\"a\",IF(Table_RiskAssessment[[#This Row],[W2]]=1,\"a\",\"b\")),IF(Table_RiskAssessment[[#This Row],[P2]]=1,IF(Table_RiskAssessment[[#This Row],[W2]]=1,\"a\",\"b\"),IF(Table_RiskAssessment[[#This Row],[W2]]=1,\"b\",\"c\"))),IF(Table_RiskAssessment[[#This Row],[F2]]=1,IF(Table_RiskAssessment[[#This Row],[P2]]=1,IF(Table_RiskAssessment[[#This Row],[W2]]=1,\"b\",\"c\"),IF(Table_RiskAssessment[[#This Row],[W2]]=1,\"c\",\"d\")),IF(Table_RiskAssessment[[#This Row],[P2]]=1,IF(Table_RiskAssessment[[#This Row],[W2]]=1,\"c\",\"d\"),IF(Table_RiskAssessment[[#This Row],[W2]]=1,\"d\",\"e\")))),\"?\")","v":"?"},null,null,null,"-"]
[null,null,null,"2006 / 42","1.5.01.",{"$f":"Language!A$122","v":"Electricity supply"},"x","","x",null,null,null,null,"---",null,null,null,null,null,null,null,null,null,null,null,null,null,null,null,null,null,null,null,null,null,null,null,null,null,null,null,null,null,null,"---",null,null,null,null,null,null,null,null,null,{"$f":"IF((Table_RiskAssessment[[#This Row],[S2]]* Table_RiskAssessment[[#This Row],[F2]]* Table_RiskAssessment[[#This Row],[P2]]>0),IF(Table_RiskAssessment[[#This Row],[S2]]=1,IF(Table_RiskAssessment[[#This Row],[F2]]=1,IF(Table_RiskAssessment[[#This Row],[P2]]=1,\"a\",IF(Table_RiskAssessment[[#This Row],[W2]]=1,\"a\",\"b\")),IF(Table_RiskAssessment[[#This Row],[P2]]=1,IF(Table_RiskAssessment[[#This Row],[W2]]=1,\"a\",\"b\"),IF(Table_RiskAssessment[[#This Row],[W2]]=1,\"b\",\"c\"))),IF(Table_RiskAssessment[[#This Row],[F2]]=1,IF(Table_RiskAssessment[[#This Row],[P2]]=1,IF(Table_RiskAssessment[[#This Row],[W2]]=1,\"b\",\"c\"),IF(Table_RiskAssessment[[#This Row],[W2]]=1,\"c\",\"d\")),IF(Table_RiskAssessment[[#This Row],[P2]]=1,IF(Table_RiskAssessment[[#This Row],[W2]]=1,\"c\",\"d\"),IF(Table_RiskAssessment[[#This Row],[W2]]=1,\"d\",\"e\")))),\"?\")","v":"?"},null,null,null,"-"]
[null,null,null,"2006 / 42","1.5.02.",{"$f":"Language!A$123","v":"Static electricity"},"x","","x",null,null,null,null,null,null,null,null,null,null,null,null,null,null,null,null,null,null,null,null,null,null,null,null,null,null,null,null,null,null,null,null,null,null,null,null,null,null,null,null,null,null,null,null,null,{"$f":"IF((Table_RiskAssessment[[#This Row],[S2]]* Table_RiskAssessment[[#This Row],[F2]]* Table_RiskAssessment[[#This Row],[P2]]>0),IF(Table_RiskAssessment[[#This Row],[S2]]=1,IF(Table_RiskAssessment[[#This Row],[F2]]=1,IF(Table_RiskAssessment[[#This Row],[P2]]=1,\"a\",IF(Table_RiskAssessment[[#This Row],[W2]]=1,\"a\",\"b\")),IF(Table_RiskAssessment[[#This Row],[P2]]=1,IF(Table_RiskAssessment[[#This Row],[W2]]=1,\"a\",\"b\"),IF(Table_RiskAssessment[[#This Row],[W2]]=1,\"b\",\"c\"))),IF(Table_RiskAssessment[[#This Row],[F2]]=1,IF(Table_RiskAssessment[[#This Row],[P2]]=1,IF(Table_RiskAssessment[[#This Row],[W2]]=1,\"b\",\"c\"),IF(Table_RiskAssessment[[#This Row],[W2]]=1,\"c\",\"d\")),IF(Table_RiskAssessment[[#This Row],[P2]]=1,IF(Table_RiskAssessment[[#This Row],[W2]]=1,\"c\",\"d\"),IF(Table_RiskAssessment[[#This Row],[W2]]=1,\"d\",\"e\")))),\"?\")","v":"?"},null,null,null,"-"]
[null,null,null,"2006 / 42","1.5.03.",{"$f":"Language!A$124","v":"Energy supply other than electricity"},"x","","x",null,null,null,null,"---",null,null,null,null,null,null,null,null,null,null,null,null,null,null,null,null,null,null,null,null,null,null,null,null,null,null,null,null,null,null,"---",null,null,null,null,null,null,null,null,null,{"$f":"IF((Table_RiskAssessment[[#This Row],[S2]]* Table_RiskAssessment[[#This Row],[F2]]* Table_RiskAssessment[[#This Row],[P2]]>0),IF(Table_RiskAssessment[[#This Row],[S2]]=1,IF(Table_RiskAssessment[[#This Row],[F2]]=1,IF(Table_RiskAssessment[[#This Row],[P2]]=1,\"a\",IF(Table_RiskAssessment[[#This Row],[W2]]=1,\"a\",\"b\")),IF(Table_RiskAssessment[[#This Row],[P2]]=1,IF(Table_RiskAssessment[[#This Row],[W2]]=1,\"a\",\"b\"),IF(Table_RiskAssessment[[#This Row],[W2]]=1,\"b\",\"c\"))),IF(Table_RiskAssessment[[#This Row],[F2]]=1,IF(Table_RiskAssessment[[#This Row],[P2]]=1,IF(Table_RiskAssessment[[#This Row],[W2]]=1,\"b\",\"c\"),IF(Table_RiskAssessment[[#This Row],[W2]]=1,\"c\",\"d\")),IF(Table_RiskAssessment[[#This Row],[P2]]=1,IF(Table_RiskAssessment[[#This Row],[W2]]=1,\"c\",\"d\"),IF(Table_RiskAssessment[[#This Row],[W2]]=1,\"d\",\"e\")))),\"?\")","v":"?"},null,null,null,"-"]
[null,null,null,"2006 / 42","1.5.04.",{"$f":"Language!A$125","v":"Errors of fitting"},"x","","x",null,null,null,null,null,null,null,null,null,null,null,null,null,null,null,null,null,null,null,null,null,null,null,null,null,null,null,null,null,null,null,null,null,null,null,null,null,null,null,null,null,null,null,null,null,{"$f":"IF((Table_RiskAssessment[[#This Row],[S2]]* Table_RiskAssessment[[#This Row],[F2]]* Table_RiskAssessment[[#This Row],[P2]]>0),IF(Table_RiskAssessment[[#This Row],[S2]]=1,IF(Table_RiskAssessment[[#This Row],[F2]]=1,IF(Table_RiskAssessment[[#This Row],[P2]]=1,\"a\",IF(Table_RiskAssessment[[#This Row],[W2]]=1,\"a\",\"b\")),IF(Table_RiskAssessment[[#This Row],[P2]]=1,IF(Table_RiskAssessment[[#This Row],[W2]]=1,\"a\",\"b\"),IF(Table_RiskAssessment[[#This Row],[W2]]=1,\"b\",\"c\"))),IF(Table_RiskAssessment[[#This Row],[F2]]=1,IF(Table_RiskAssessment[[#This Row],[P2]]=1,IF(Table_RiskAssessment[[#This Row],[W2]]=1,\"b\",\"c\"),IF(Table_RiskAssessment[[#This Row],[W2]]=1,\"c\",\"d\")),IF(Table_RiskAssessment[[#This Row],[P2]]=1,IF(Table_RiskAssessment[[#This Row],[W2]]=1,\"c\",\"d\"),IF(Table_RiskAssessment[[#This Row],[W2]]=1,\"d\",\"e\")))),\"?\")","v":"?"},null,null,null,"-"]
[null,null,null,"2006 / 42","1.5.05.",{"$f":"Language!A$126","v":"Extreme temperatures"},"x","","x",null,null,null,null,"---",null,null,null,null,null,null,null,null,null,null,null,null,null,null,null,null,null,null,null,null,null,null,null,null,null,null,null,null,null,null,"---",null,null,null,null,null,null,null,null,null,{"$f":"IF((Table_RiskAssessment[[#This Row],[S2]]* Table_RiskAssessment[[#This Row],[F2]]* Table_RiskAssessment[[#This Row],[P2]]>0),IF(Table_RiskAssessment[[#This Row],[S2]]=1,IF(Table_RiskAssessment[[#This Row],[F2]]=1,IF(Table_RiskAssessment[[#This Row],[P2]]=1,\"a\",IF(Table_RiskAssessment[[#This Row],[W2]]=1,\"a\",\"b\")),IF(Table_RiskAssessment[[#This Row],[P2]]=1,IF(Table_RiskAssessment[[#This Row],[W2]]=1,\"a\",\"b\"),IF(Table_RiskAssessment[[#This Row],[W2]]=1,\"b\",\"c\"))),IF(Table_RiskAssessment[[#This Row],[F2]]=1,IF(Table_RiskAssessment[[#This Row],[P2]]=1,IF(Table_RiskAssessment[[#This Row],[W2]]=1,\"b\",\"c\"),IF(Table_RiskAssessment[[#This Row],[W2]]=1,\"c\",\"d\")),IF(Table_RiskAssessment[[#This Row],[P2]]=1,IF(Table_RiskAssessment[[#This Row],[W2]]=1,\"c\",\"d\"),IF(Table_RiskAssessment[[#This Row],[W2]]=1,\"d\",\"e\")))),\"?\")","v":"?"},null,null,null,"-"]
[null,null,null,"2006 / 42","1.5.06.",{"$f":"Language!A$127","v":"Fire"},"x","","x",null,null,null,null,"---",null,null,null,null,null,null,null,null,null,null,null,null,null,null,null,null,null,null,null,null,null,null,null,null,null,null,null,null,null,null,"---",null,null,null,null,null,null,null,null,null,{"$f":"IF((Table_RiskAssessment[[#This Row],[S2]]* Table_RiskAssessment[[#This Row],[F2]]* Table_RiskAssessment[[#This Row],[P2]]>0),IF(Table_RiskAssessment[[#This Row],[S2]]=1,IF(Table_RiskAssessment[[#This Row],[F2]]=1,IF(Table_RiskAssessment[[#This Row],[P2]]=1,\"a\",IF(Table_RiskAssessment[[#This Row],[W2]]=1,\"a\",\"b\")),IF(Table_RiskAssessment[[#This Row],[P2]]=1,IF(Table_RiskAssessment[[#This Row],[W2]]=1,\"a\",\"b\"),IF(Table_RiskAssessment[[#This Row],[W2]]=1,\"b\",\"c\"))),IF(Table_RiskAssessment[[#This Row],[F2]]=1,IF(Table_RiskAssessment[[#This Row],[P2]]=1,IF(Table_RiskAssessment[[#This Row],[W2]]=1,\"b\",\"c\"),IF(Table_RiskAssessment[[#This Row],[W2]]=1,\"c\",\"d\")),IF(Table_RiskAssessment[[#This Row],[P2]]=1,IF(Table_RiskAssessment[[#This Row],[W2]]=1,\"c\",\"d\"),IF(Table_RiskAssessment[[#This Row],[W2]]=1,\"d\",\"e\")))),\"?\")","v":"?"},null,null,null,"-"]
[null,null,null,"2006 / 42","1.5.07.",{"$f":"Language!A$128","v":"Explosion"},"x","","x",null,null,null,null,"---",null,null,null,null,null,null,null,null,null,null,null,null,null,null,null,null,null,null,null,null,null,null,null,null,null,null,null,null,null,null,"---",null,null,null,null,null,null,null,null,null,{"$f":"IF((Table_RiskAssessment[[#This Row],[S2]]* Table_RiskAssessment[[#This Row],[F2]]* Table_RiskAssessment[[#This Row],[P2]]>0),IF(Table_RiskAssessment[[#This Row],[S2]]=1,IF(Table_RiskAssessment[[#This Row],[F2]]=1,IF(Table_RiskAssessment[[#This Row],[P2]]=1,\"a\",IF(Table_RiskAssessment[[#This Row],[W2]]=1,\"a\",\"b\")),IF(Table_RiskAssessment[[#This Row],[P2]]=1,IF(Table_RiskAssessment[[#This Row],[W2]]=1,\"a\",\"b\"),IF(Table_RiskAssessment[[#This Row],[W2]]=1,\"b\",\"c\"))),IF(Table_RiskAssessment[[#This Row],[F2]]=1,IF(Table_RiskAssessment[[#This Row],[P2]]=1,IF(Table_RiskAssessment[[#This Row],[W2]]=1,\"b\",\"c\"),IF(Table_RiskAssessment[[#This Row],[W2]]=1,\"c\",\"d\")),IF(Table_RiskAssessment[[#This Row],[P2]]=1,IF(Table_RiskAssessment[[#This Row],[W2]]=1,\"c\",\"d\"),IF(Table_RiskAssessment[[#This Row],[W2]]=1,\"d\",\"e\")))),\"?\")","v":"?"},null,null,null,"-"]
[null,null,null,"2006 / 42","1.5.08.",{"$f":"Language!A$129","v":"Noise"},"x","","x",null,null,null,null,"---",null,null,null,null,null,null,null,null,null,null,null,null,null,null,null,null,null,null,null,null,null,null,null,null,null,null,null,null,null,null,"---",null,null,null,null,null,null,null,null,null,{"$f":"IF((Table_RiskAssessment[[#This Row],[S2]]* Table_RiskAssessment[[#This Row],[F2]]* Table_RiskAssessment[[#This Row],[P2]]>0),IF(Table_RiskAssessment[[#This Row],[S2]]=1,IF(Table_RiskAssessment[[#This Row],[F2]]=1,IF(Table_RiskAssessment[[#This Row],[P2]]=1,\"a\",IF(Table_RiskAssessment[[#This Row],[W2]]=1,\"a\",\"b\")),IF(Table_RiskAssessment[[#This Row],[P2]]=1,IF(Table_RiskAssessment[[#This Row],[W2]]=1,\"a\",\"b\"),IF(Table_RiskAssessment[[#This Row],[W2]]=1,\"b\",\"c\"))),IF(Table_RiskAssessment[[#This Row],[F2]]=1,IF(Table_RiskAssessment[[#This Row],[P2]]=1,IF(Table_RiskAssessment[[#This Row],[W2]]=1,\"b\",\"c\"),IF(Table_RiskAssessment[[#This Row],[W2]]=1,\"c\",\"d\")),IF(Table_RiskAssessment[[#This Row],[P2]]=1,IF(Table_RiskAssessment[[#This Row],[W2]]=1,\"c\",\"d\"),IF(Table_RiskAssessment[[#This Row],[W2]]=1,\"d\",\"e\")))),\"?\")","v":"?"},null,null,null,"-"]
[null,null,null,"2006 / 42","1.5.09.",{"$f":"Language!A$130","v":"Vibrations"},"x","","x",null,null,null,null,"---",null,null,null,null,null,null,null,null,null,null,null,null,null,null,null,null,null,null,null,null,null,null,null,null,null,null,null,null,null,null,"---",null,null,null,null,null,null,null,null,null,{"$f":"IF((Table_RiskAssessment[[#This Row],[S2]]* Table_RiskAssessment[[#This Row],[F2]]* Table_RiskAssessment[[#This Row],[P2]]>0),IF(Table_RiskAssessment[[#This Row],[S2]]=1,IF(Table_RiskAssessment[[#This Row],[F2]]=1,IF(Table_RiskAssessment[[#This Row],[P2]]=1,\"a\",IF(Table_RiskAssessment[[#This Row],[W2]]=1,\"a\",\"b\")),IF(Table_RiskAssessment[[#This Row],[P2]]=1,IF(Table_RiskAssessment[[#This Row],[W2]]=1,\"a\",\"b\"),IF(Table_RiskAssessment[[#This Row],[W2]]=1,\"b\",\"c\"))),IF(Table_RiskAssessment[[#This Row],[F2]]=1,IF(Table_RiskAssessment[[#This Row],[P2]]=1,IF(Table_RiskAssessment[[#This Row],[W2]]=1,\"b\",\"c\"),IF(Table_RiskAssessment[[#This Row],[W2]]=1,\"c\",\"d\")),IF(Table_RiskAssessment[[#This Row],[P2]]=1,IF(Table_RiskAssessment[[#This Row],[W2]]=1,\"c\",\"d\"),IF(Table_RiskAssessment[[#This Row],[W2]]=1,\"d\",\"e\")))),\"?\")","v":"?"},null,null,null,"-"]
[null,null,null,"2006 / 42","1.5.10.",{"$f":"Language!A$131","v":"Radiation"},"x","","x",null,null,null,null,"---",null,null,null,null,null,null,null,null,null,null,null,null,null,null,null,null,null,null,null,null,null,null,null,null,null,null,null,null,null,null,"---",null,null,null,null,null,null,null,null,null,{"$f":"IF((Table_RiskAssessment[[#This Row],[S2]]* Table_RiskAssessment[[#This Row],[F2]]* Table_RiskAssessment[[#This Row],[P2]]>0),IF(Table_RiskAssessment[[#This Row],[S2]]=1,IF(Table_RiskAssessment[[#This Row],[F2]]=1,IF(Table_RiskAssessment[[#This Row],[P2]]=1,\"a\",IF(Table_RiskAssessment[[#This Row],[W2]]=1,\"a\",\"b\")),IF(Table_RiskAssessment[[#This Row],[P2]]=1,IF(Table_RiskAssessment[[#This Row],[W2]]=1,\"a\",\"b\"),IF(Table_RiskAssessment[[#This Row],[W2]]=1,\"b\",\"c\"))),IF(Table_RiskAssessment[[#This Row],[F2]]=1,IF(Table_RiskAssessment[[#This Row],[P2]]=1,IF(Table_RiskAssessment[[#This Row],[W2]]=1,\"b\",\"c\"),IF(Table_RiskAssessment[[#This Row],[W2]]=1,\"c\",\"d\")),IF(Table_RiskAssessment[[#This Row],[P2]]=1,IF(Table_RiskAssessment[[#This Row],[W2]]=1,\"c\",\"d\"),IF(Table_RiskAssessment[[#This Row],[W2]]=1,\"d\",\"e\")))),\"?\")","v":"?"},null,null,null,"-"]
[null,null,null,"2006 / 42","1.5.11.",{"$f":"Language!A$132","v":"External radiation"},"x","","x",null,null,null,null,null,null,null,null,null,null,null,null,null,null,null,null,null,null,null,null,null,null,null,null,null,null,null,null,null,null,null,null,null,null,null,null,null,null,null,null,null,null,null,null,null,{"$f":"IF((Table_RiskAssessment[[#This Row],[S2]]* Table_RiskAssessment[[#This Row],[F2]]* Table_RiskAssessment[[#This Row],[P2]]>0),IF(Table_RiskAssessment[[#This Row],[S2]]=1,IF(Table_RiskAssessment[[#This Row],[F2]]=1,IF(Table_RiskAssessment[[#This Row],[P2]]=1,\"a\",IF(Table_RiskAssessment[[#This Row],[W2]]=1,\"a\",\"b\")),IF(Table_RiskAssessment[[#This Row],[P2]]=1,IF(Table_RiskAssessment[[#This Row],[W2]]=1,\"a\",\"b\"),IF(Table_RiskAssessment[[#This Row],[W2]]=1,\"b\",\"c\"))),IF(Table_RiskAssessment[[#This Row],[F2]]=1,IF(Table_RiskAssessment[[#This Row],[P2]]=1,IF(Table_RiskAssessment[[#This Row],[W2]]=1,\"b\",\"c\"),IF(Table_RiskAssessment[[#This Row],[W2]]=1,\"c\",\"d\")),IF(Table_RiskAssessment[[#This Row],[P2]]=1,IF(Table_RiskAssessment[[#This Row],[W2]]=1,\"c\",\"d\"),IF(Table_RiskAssessment[[#This Row],[W2]]=1,\"d\",\"e\")))),\"?\")","v":"?"},null,null,null,"-"]
[null,null,null,"2006 / 42","1.5.12.",{"$f":"Language!A$133","v":"Laser radiation"},"x","","x",null,null,null,null,"---",null,null,null,null,null,null,null,null,null,null,null,null,null,null,null,null,null,null,null,null,null,null,null,null,null,null,null,null,null,null,"---",null,null,null,null,null,null,null,null,null,{"$f":"IF((Table_RiskAssessment[[#This Row],[S2]]* Table_RiskAssessment[[#This Row],[F2]]* Table_RiskAssessment[[#This Row],[P2]]>0),IF(Table_RiskAssessment[[#This Row],[S2]]=1,IF(Table_RiskAssessment[[#This Row],[F2]]=1,IF(Table_RiskAssessment[[#This Row],[P2]]=1,\"a\",IF(Table_RiskAssessment[[#This Row],[W2]]=1,\"a\",\"b\")),IF(Table_RiskAssessment[[#This Row],[P2]]=1,IF(Table_RiskAssessment[[#This Row],[W2]]=1,\"a\",\"b\"),IF(Table_RiskAssessment[[#This Row],[W2]]=1,\"b\",\"c\"))),IF(Table_RiskAssessment[[#This Row],[F2]]=1,IF(Table_RiskAssessment[[#This Row],[P2]]=1,IF(Table_RiskAssessment[[#This Row],[W2]]=1,\"b\",\"c\"),IF(Table_RiskAssessment[[#This Row],[W2]]=1,\"c\",\"d\")),IF(Table_RiskAssessment[[#This Row],[P2]]=1,IF(Table_RiskAssessment[[#This Row],[W2]]=1,\"c\",\"d\"),IF(Table_RiskAssessment[[#This Row],[W2]]=1,\"d\",\"e\")))),\"?\")","v":"?"},null,null,null,"-"]
[null,null,null,"2006 / 42","1.5.13.",{"$f":"Language!A$134","v":"Emissions of hazardous materials and substances"},"x","","x",null,null,null,null,"---",null,null,null,null,null,null,null,null,null,null,null,null,null,null,null,null,null,null,null,null,null,null,null,null,null,null,null,null,null,null,"---",null,null,null,null,null,null,null,null,null,{"$f":"IF((Table_RiskAssessment[[#This Row],[S2]]* Table_RiskAssessment[[#This Row],[F2]]* Table_RiskAssessment[[#This Row],[P2]]>0),IF(Table_RiskAssessment[[#This Row],[S2]]=1,IF(Table_RiskAssessment[[#This Row],[F2]]=1,IF(Table_RiskAssessment[[#This Row],[P2]]=1,\"a\",IF(Table_RiskAssessment[[#This Row],[W2]]=1,\"a\",\"b\")),IF(Table_RiskAssessment[[#This Row],[P2]]=1,IF(Table_RiskAssessment[[#This Row],[W2]]=1,\"a\",\"b\"),IF(Table_RiskAssessment[[#This Row],[W2]]=1,\"b\",\"c\"))),IF(Table_RiskAssessment[[#This Row],[F2]]=1,IF(Table_RiskAssessment[[#This Row],[P2]]=1,IF(Table_RiskAssessment[[#This Row],[W2]]=1,\"b\",\"c\"),IF(Table_RiskAssessment[[#This Row],[W2]]=1,\"c\",\"d\")),IF(Table_RiskAssessment[[#This Row],[P2]]=1,IF(Table_RiskAssessment[[#This Row],[W2]]=1,\"c\",\"d\"),IF(Table_RiskAssessment[[#This Row],[W2]]=1,\"d\",\"e\")))),\"?\")","v":"?"},null,null,null,"-"]
[null,null,null,"2006 / 42","1.5.14.",{"$f":"Language!A$135","v":"Risk of being trapped in a machine"},"x","","x",null,null,null,null,null,null,null,null,null,null,null,null,null,null,null,null,null,null,null,null,null,null,null,null,null,null,null,null,null,null,null,null,null,null,null,null,null,null,null,null,null,null,null,null,null,{"$f":"IF((Table_RiskAssessment[[#This Row],[S2]]* Table_RiskAssessment[[#This Row],[F2]]* Table_RiskAssessment[[#This Row],[P2]]>0),IF(Table_RiskAssessment[[#This Row],[S2]]=1,IF(Table_RiskAssessment[[#This Row],[F2]]=1,IF(Table_RiskAssessment[[#This Row],[P2]]=1,\"a\",IF(Table_RiskAssessment[[#This Row],[W2]]=1,\"a\",\"b\")),IF(Table_RiskAssessment[[#This Row],[P2]]=1,IF(Table_RiskAssessment[[#This Row],[W2]]=1,\"a\",\"b\"),IF(Table_RiskAssessment[[#This Row],[W2]]=1,\"b\",\"c\"))),IF(Table_RiskAssessment[[#This Row],[F2]]=1,IF(Table_RiskAssessment[[#This Row],[P2]]=1,IF(Table_RiskAssessment[[#This Row],[W2]]=1,\"b\",\"c\"),IF(Table_RiskAssessment[[#This Row],[W2]]=1,\"c\",\"d\")),IF(Table_RiskAssessment[[#This Row],[P2]]=1,IF(Table_RiskAssessment[[#This Row],[W2]]=1,\"c\",\"d\"),IF(Table_RiskAssessment[[#This Row],[W2]]=1,\"d\",\"e\")))),\"?\")","v":"?"},null,null,null,"-"]
[null,null,null,"2006 / 42","1.5.15.",{"$f":"Language!A$136","v":"Risk of slipping, tripping or falling"},"x","","x",null,null,null,null,null,null,null,null,null,null,null,null,null,null,null,null,null,null,null,null,null,null,null,null,null,null,null,null,null,null,null,null,null,null,null,null,null,null,null,null,null,null,null,null,null,{"$f":"IF((Table_RiskAssessment[[#This Row],[S2]]* Table_RiskAssessment[[#This Row],[F2]]* Table_RiskAssessment[[#This Row],[P2]]>0),IF(Table_RiskAssessment[[#This Row],[S2]]=1,IF(Table_RiskAssessment[[#This Row],[F2]]=1,IF(Table_RiskAssessment[[#This Row],[P2]]=1,\"a\",IF(Table_RiskAssessment[[#This Row],[W2]]=1,\"a\",\"b\")),IF(Table_RiskAssessment[[#This Row],[P2]]=1,IF(Table_RiskAssessment[[#This Row],[W2]]=1,\"a\",\"b\"),IF(Table_RiskAssessment[[#This Row],[W2]]=1,\"b\",\"c\"))),IF(Table_RiskAssessment[[#This Row],[F2]]=1,IF(Table_RiskAssessment[[#This Row],[P2]]=1,IF(Table_RiskAssessment[[#This Row],[W2]]=1,\"b\",\"c\"),IF(Table_RiskAssessment[[#This Row],[W2]]=1,\"c\",\"d\")),IF(Table_RiskAssessment[[#This Row],[P2]]=1,IF(Table_RiskAssessment[[#This Row],[W2]]=1,\"c\",\"d\"),IF(Table_RiskAssessment[[#This Row],[W2]]=1,\"d\",\"e\")))),\"?\")","v":"?"},null,null,null,"-"]
[null,null,null,"2006 / 42","1.5.16.",{"$f":"Language!A$137","v":"Lightning"},"x","","x",null,null,null,null,null,null,null,null,null,null,null,null,null,null,null,null,null,null,null,null,null,null,null,null,null,null,null,null,null,null,null,null,null,null,null,null,null,null,null,null,null,null,null,null,null,{"$f":"IF((Table_RiskAssessment[[#This Row],[S2]]* Table_RiskAssessment[[#This Row],[F2]]* Table_RiskAssessment[[#This Row],[P2]]>0),IF(Table_RiskAssessment[[#This Row],[S2]]=1,IF(Table_RiskAssessment[[#This Row],[F2]]=1,IF(Table_RiskAssessment[[#This Row],[P2]]=1,\"a\",IF(Table_RiskAssessment[[#This Row],[W2]]=1,\"a\",\"b\")),IF(Table_RiskAssessment[[#This Row],[P2]]=1,IF(Table_RiskAssessment[[#This Row],[W2]]=1,\"a\",\"b\"),IF(Table_RiskAssessment[[#This Row],[W2]]=1,\"b\",\"c\"))),IF(Table_RiskAssessment[[#This Row],[F2]]=1,IF(Table_RiskAssessment[[#This Row],[P2]]=1,IF(Table_RiskAssessment[[#This Row],[W2]]=1,\"b\",\"c\"),IF(Table_RiskAssessment[[#This Row],[W2]]=1,\"c\",\"d\")),IF(Table_RiskAssessment[[#This Row],[P2]]=1,IF(Table_RiskAssessment[[#This Row],[W2]]=1,\"c\",\"d\"),IF(Table_RiskAssessment[[#This Row],[W2]]=1,\"d\",\"e\")))),\"?\")","v":"?"},null,null,null,"-"]
[null,null,null,"2006 / 42","1.6.",{"$f":"Language!A$138","v":"Maintenance"},"x","x","x",null,null,null,null,null,null,null,null,null,null,null,null,null,null,null,null,null,null,null,null,null,null,null,null,null,null,null,null,null,null,null,null,null,null,null,null,null,null,null,null,null,null,null,null,null,{"$f":"IF((Table_RiskAssessment[[#This Row],[S2]]* Table_RiskAssessment[[#This Row],[F2]]* Table_RiskAssessment[[#This Row],[P2]]>0),IF(Table_RiskAssessment[[#This Row],[S2]]=1,IF(Table_RiskAssessment[[#This Row],[F2]]=1,IF(Table_RiskAssessment[[#This Row],[P2]]=1,\"a\",IF(Table_RiskAssessment[[#This Row],[W2]]=1,\"a\",\"b\")),IF(Table_RiskAssessment[[#This Row],[P2]]=1,IF(Table_RiskAssessment[[#This Row],[W2]]=1,\"a\",\"b\"),IF(Table_RiskAssessment[[#This Row],[W2]]=1,\"b\",\"c\"))),IF(Table_RiskAssessment[[#This Row],[F2]]=1,IF(Table_RiskAssessment[[#This Row],[P2]]=1,IF(Table_RiskAssessment[[#This Row],[W2]]=1,\"b\",\"c\"),IF(Table_RiskAssessment[[#This Row],[W2]]=1,\"c\",\"d\")),IF(Table_RiskAssessment[[#This Row],[P2]]=1,IF(Table_RiskAssessment[[#This Row],[W2]]=1,\"c\",\"d\"),IF(Table_RiskAssessment[[#This Row],[W2]]=1,\"d\",\"e\")))),\"?\")","v":"?"},null,null,null,"-"]
[null,null,null,"2006 / 42","1.6.1.",{"$f":"Language!A$139","v":"Machinery maintenance"},"x","","x",null,null,null,null,null,null,null,null,null,null,null,null,null,null,null,null,null,null,null,null,null,null,null,null,null,null,null,null,null,null,null,null,null,null,null,null,null,null,null,null,null,null,null,null,null,{"$f":"IF((Table_RiskAssessment[[#This Row],[S2]]* Table_RiskAssessment[[#This Row],[F2]]* Table_RiskAssessment[[#This Row],[P2]]>0),IF(Table_RiskAssessment[[#This Row],[S2]]=1,IF(Table_RiskAssessment[[#This Row],[F2]]=1,IF(Table_RiskAssessment[[#This Row],[P2]]=1,\"a\",IF(Table_RiskAssessment[[#This Row],[W2]]=1,\"a\",\"b\")),IF(Table_RiskAssessment[[#This Row],[P2]]=1,IF(Table_RiskAssessment[[#This Row],[W2]]=1,\"a\",\"b\"),IF(Table_RiskAssessment[[#This Row],[W2]]=1,\"b\",\"c\"))),IF(Table_RiskAssessment[[#This Row],[F2]]=1,IF(Table_RiskAssessment[[#This Row],[P2]]=1,IF(Table_RiskAssessment[[#This Row],[W2]]=1,\"b\",\"c\"),IF(Table_RiskAssessment[[#This Row],[W2]]=1,\"c\",\"d\")),IF(Table_RiskAssessment[[#This Row],[P2]]=1,IF(Table_RiskAssessment[[#This Row],[W2]]=1,\"c\",\"d\"),IF(Table_RiskAssessment[[#This Row],[W2]]=1,\"d\",\"e\")))),\"?\")","v":"?"},null,null,null,"-"]
[null,null,null,"2006 / 42","1.6.2.",{"$f":"Language!A$140","v":"Access to operating positions and servicing points"},"x","","x",null,null,null,null,"---",null,null,null,null,null,null,null,null,null,null,null,null,null,null,null,null,null,null,null,null,null,null,null,null,null,null,null,null,null,null,"---",null,null,null,null,null,null,null,null,null,{"$f":"IF((Table_RiskAssessment[[#This Row],[S2]]* Table_RiskAssessment[[#This Row],[F2]]* Table_RiskAssessment[[#This Row],[P2]]>0),IF(Table_RiskAssessment[[#This Row],[S2]]=1,IF(Table_RiskAssessment[[#This Row],[F2]]=1,IF(Table_RiskAssessment[[#This Row],[P2]]=1,\"a\",IF(Table_RiskAssessment[[#This Row],[W2]]=1,\"a\",\"b\")),IF(Table_RiskAssessment[[#This Row],[P2]]=1,IF(Table_RiskAssessment[[#This Row],[W2]]=1,\"a\",\"b\"),IF(Table_RiskAssessment[[#This Row],[W2]]=1,\"b\",\"c\"))),IF(Table_RiskAssessment[[#This Row],[F2]]=1,IF(Table_RiskAssessment[[#This Row],[P2]]=1,IF(Table_RiskAssessment[[#This Row],[W2]]=1,\"b\",\"c\"),IF(Table_RiskAssessment[[#This Row],[W2]]=1,\"c\",\"d\")),IF(Table_RiskAssessment[[#This Row],[P2]]=1,IF(Table_RiskAssessment[[#This Row],[W2]]=1,\"c\",\"d\"),IF(Table_RiskAssessment[[#This Row],[W2]]=1,\"d\",\"e\")))),\"?\")","v":"?"},null,null,null,"-"]
[null,null,null,"2006 / 42","1.6.3.",{"$f":"Language!A$141","v":"Isolation of energy sources"},"x","","x",null,null,null,null,null,null,null,null,null,null,null,null,null,null,null,null,null,null,null,null,null,null,null,null,null,null,null,null,null,null,null,null,null,null,null,null,null,null,null,null,null,null,null,null,null,{"$f":"IF((Table_RiskAssessment[[#This Row],[S2]]* Table_RiskAssessment[[#This Row],[F2]]* Table_RiskAssessment[[#This Row],[P2]]>0),IF(Table_RiskAssessment[[#This Row],[S2]]=1,IF(Table_RiskAssessment[[#This Row],[F2]]=1,IF(Table_RiskAssessment[[#This Row],[P2]]=1,\"a\",IF(Table_RiskAssessment[[#This Row],[W2]]=1,\"a\",\"b\")),IF(Table_RiskAssessment[[#This Row],[P2]]=1,IF(Table_RiskAssessment[[#This Row],[W2]]=1,\"a\",\"b\"),IF(Table_RiskAssessment[[#This Row],[W2]]=1,\"b\",\"c\"))),IF(Table_RiskAssessment[[#This Row],[F2]]=1,IF(Table_RiskAssessment[[#This Row],[P2]]=1,IF(Table_RiskAssessment[[#This Row],[W2]]=1,\"b\",\"c\"),IF(Table_RiskAssessment[[#This Row],[W2]]=1,\"c\",\"d\")),IF(Table_RiskAssessment[[#This Row],[P2]]=1,IF(Table_RiskAssessment[[#This Row],[W2]]=1,\"c\",\"d\"),IF(Table_RiskAssessment[[#This Row],[W2]]=1,\"d\",\"e\")))),\"?\")","v":"?"},null,null,null,"-"]
[null,null,null,"2006 / 42","1.6.4.",{"$f":"Language!A$142","v":"Operator intervention"},"x","","x",null,null,null,null,null,null,null,null,null,null,null,null,null,null,null,null,null,null,null,null,null,null,null,null,null,null,null,null,null,null,null,null,null,null,null,null,null,null,null,null,null,null,null,null,null,{"$f":"IF((Table_RiskAssessment[[#This Row],[S2]]* Table_RiskAssessment[[#This Row],[F2]]* Table_RiskAssessment[[#This Row],[P2]]>0),IF(Table_RiskAssessment[[#This Row],[S2]]=1,IF(Table_RiskAssessment[[#This Row],[F2]]=1,IF(Table_RiskAssessment[[#This Row],[P2]]=1,\"a\",IF(Table_RiskAssessment[[#This Row],[W2]]=1,\"a\",\"b\")),IF(Table_RiskAssessment[[#This Row],[P2]]=1,IF(Table_RiskAssessment[[#This Row],[W2]]=1,\"a\",\"b\"),IF(Table_RiskAssessment[[#This Row],[W2]]=1,\"b\",\"c\"))),IF(Table_RiskAssessment[[#This Row],[F2]]=1,IF(Table_RiskAssessment[[#This Row],[P2]]=1,IF(Table_RiskAssessment[[#This Row],[W2]]=1,\"b\",\"c\"),IF(Table_RiskAssessment[[#This Row],[W2]]=1,\"c\",\"d\")),IF(Table_RiskAssessment[[#This Row],[P2]]=1,IF(Table_RiskAssessment[[#This Row],[W2]]=1,\"c\",\"d\"),IF(Table_RiskAssessment[[#This Row],[W2]]=1,\"d\",\"e\")))),\"?\")","v":"?"},null,null,null,"-"]
[null,null,null,"2006 / 42","1.6.5.",{"$f":"Language!A$143","v":"Cleaning of internal parts"},"x","","x",null,null,null,null,null,null,null,null,null,null,null,null,null,null,null,null,null,null,null,null,null,null,null,null,null,null,null,null,null,null,null,null,null,null,null,null,null,null,null,null,null,null,null,null,null,{"$f":"IF((Table_RiskAssessment[[#This Row],[S2]]* Table_RiskAssessment[[#This Row],[F2]]* Table_RiskAssessment[[#This Row],[P2]]>0),IF(Table_RiskAssessment[[#This Row],[S2]]=1,IF(Table_RiskAssessment[[#This Row],[F2]]=1,IF(Table_RiskAssessment[[#This Row],[P2]]=1,\"a\",IF(Table_RiskAssessment[[#This Row],[W2]]=1,\"a\",\"b\")),IF(Table_RiskAssessment[[#This Row],[P2]]=1,IF(Table_RiskAssessment[[#This Row],[W2]]=1,\"a\",\"b\"),IF(Table_RiskAssessment[[#This Row],[W2]]=1,\"b\",\"c\"))),IF(Table_RiskAssessment[[#This Row],[F2]]=1,IF(Table_RiskAssessment[[#This Row],[P2]]=1,IF(Table_RiskAssessment[[#This Row],[W2]]=1,\"b\",\"c\"),IF(Table_RiskAssessment[[#This Row],[W2]]=1,\"c\",\"d\")),IF(Table_RiskAssessment[[#This Row],[P2]]=1,IF(Table_RiskAssessment[[#This Row],[W2]]=1,\"c\",\"d\"),IF(Table_RiskAssessment[[#This Row],[W2]]=1,\"d\",\"e\")))),\"?\")","v":"?"},null,null,null,"-"]
[null,null,null,"2006 / 42","1.7.",{"$f":"Language!A$144","v":"Information"},"x","x","x",null,null,null,null,null,null,null,null,null,null,null,null,null,null,null,null,null,null,null,null,null,null,null,null,null,null,null,null,null,null,null,null,null,null,null,null,null,null,null,null,null,null,null,null,null,{"$f":"IF((Table_RiskAssessment[[#This Row],[S2]]* Table_RiskAssessment[[#This Row],[F2]]* Table_RiskAssessment[[#This Row],[P2]]>0),IF(Table_RiskAssessment[[#This Row],[S2]]=1,IF(Table_RiskAssessment[[#This Row],[F2]]=1,IF(Table_RiskAssessment[[#This Row],[P2]]=1,\"a\",IF(Table_RiskAssessment[[#This Row],[W2]]=1,\"a\",\"b\")),IF(Table_RiskAssessment[[#This Row],[P2]]=1,IF(Table_RiskAssessment[[#This Row],[W2]]=1,\"a\",\"b\"),IF(Table_RiskAssessment[[#This Row],[W2]]=1,\"b\",\"c\"))),IF(Table_RiskAssessment[[#This Row],[F2]]=1,IF(Table_RiskAssessment[[#This Row],[P2]]=1,IF(Table_RiskAssessment[[#This Row],[W2]]=1,\"b\",\"c\"),IF(Table_RiskAssessment[[#This Row],[W2]]=1,\"c\",\"d\")),IF(Table_RiskAssessment[[#This Row],[P2]]=1,IF(Table_RiskAssessment[[#This Row],[W2]]=1,\"c\",\"d\"),IF(Table_RiskAssessment[[#This Row],[W2]]=1,\"d\",\"e\")))),\"?\")","v":"?"},null,null,null,"-"]
[null,null,null,"2006 / 42","1.7.1.",{"$f":"Language!A$145","v":"Information and warnings on the machinery"},"x","","x",null,null,null,null,null,null,null,null,null,null,null,null,null,null,null,null,null,null,null,null,null,null,null,null,null,null,null,null,null,null,null,null,null,null,null,null,null,null,null,null,null,null,null,null,null,{"$f":"IF((Table_RiskAssessment[[#This Row],[S2]]* Table_RiskAssessment[[#This Row],[F2]]* Table_RiskAssessment[[#This Row],[P2]]>0),IF(Table_RiskAssessment[[#This Row],[S2]]=1,IF(Table_RiskAssessment[[#This Row],[F2]]=1,IF(Table_RiskAssessment[[#This Row],[P2]]=1,\"a\",IF(Table_RiskAssessment[[#This Row],[W2]]=1,\"a\",\"b\")),IF(Table_RiskAssessment[[#This Row],[P2]]=1,IF(Table_RiskAssessment[[#This Row],[W2]]=1,\"a\",\"b\"),IF(Table_RiskAssessment[[#This Row],[W2]]=1,\"b\",\"c\"))),IF(Table_RiskAssessment[[#This Row],[F2]]=1,IF(Table_RiskAssessment[[#This Row],[P2]]=1,IF(Table_RiskAssessment[[#This Row],[W2]]=1,\"b\",\"c\"),IF(Table_RiskAssessment[[#This Row],[W2]]=1,\"c\",\"d\")),IF(Table_RiskAssessment[[#This Row],[P2]]=1,IF(Table_RiskAssessment[[#This Row],[W2]]=1,\"c\",\"d\"),IF(Table_RiskAssessment[[#This Row],[W2]]=1,\"d\",\"e\")))),\"?\")","v":"?"},null,null,null,"-"]
[null,null,null,"2006 / 42","1.7.1.1.",{"$f":"Language!A$146","v":"Information and information devices"},"x","","x",null,null,null,null,null,null,null,null,null,null,null,null,null,null,null,null,null,null,null,null,null,null,null,null,null,null,null,null,null,null,null,null,null,null,null,null,null,null,null,null,null,null,null,null,null,{"$f":"IF((Table_RiskAssessment[[#This Row],[S2]]* Table_RiskAssessment[[#This Row],[F2]]* Table_RiskAssessment[[#This Row],[P2]]>0),IF(Table_RiskAssessment[[#This Row],[S2]]=1,IF(Table_RiskAssessment[[#This Row],[F2]]=1,IF(Table_RiskAssessment[[#This Row],[P2]]=1,\"a\",IF(Table_RiskAssessment[[#This Row],[W2]]=1,\"a\",\"b\")),IF(Table_RiskAssessment[[#This Row],[P2]]=1,IF(Table_RiskAssessment[[#This Row],[W2]]=1,\"a\",\"b\"),IF(Table_RiskAssessment[[#This Row],[W2]]=1,\"b\",\"c\"))),IF(Table_RiskAssessment[[#This Row],[F2]]=1,IF(Table_RiskAssessment[[#This Row],[P2]]=1,IF(Table_RiskAssessment[[#This Row],[W2]]=1,\"b\",\"c\"),IF(Table_RiskAssessment[[#This Row],[W2]]=1,\"c\",\"d\")),IF(Table_RiskAssessment[[#This Row],[P2]]=1,IF(Table_RiskAssessment[[#This Row],[W2]]=1,\"c\",\"d\"),IF(Table_RiskAssessment[[#This Row],[W2]]=1,\"d\",\"e\")))),\"?\")","v":"?"},null,null,null,"-"]
[null,null,null,"2006 / 42","1.7.1.2.",{"$f":"Language!A$147","v":"Warning devices"},"x","","x",null,null,null,null,null,null,null,null,null,null,null,null,null,null,null,null,null,null,null,null,null,null,null,null,null,null,null,null,null,null,null,null,null,null,null,null,null,null,null,null,null,null,null,null,null,{"$f":"IF((Table_RiskAssessment[[#This Row],[S2]]* Table_RiskAssessment[[#This Row],[F2]]* Table_RiskAssessment[[#This Row],[P2]]>0),IF(Table_RiskAssessment[[#This Row],[S2]]=1,IF(Table_RiskAssessment[[#This Row],[F2]]=1,IF(Table_RiskAssessment[[#This Row],[P2]]=1,\"a\",IF(Table_RiskAssessment[[#This Row],[W2]]=1,\"a\",\"b\")),IF(Table_RiskAssessment[[#This Row],[P2]]=1,IF(Table_RiskAssessment[[#This Row],[W2]]=1,\"a\",\"b\"),IF(Table_RiskAssessment[[#This Row],[W2]]=1,\"b\",\"c\"))),IF(Table_RiskAssessment[[#This Row],[F2]]=1,IF(Table_RiskAssessment[[#This Row],[P2]]=1,IF(Table_RiskAssessment[[#This Row],[W2]]=1,\"b\",\"c\"),IF(Table_RiskAssessment[[#This Row],[W2]]=1,\"c\",\"d\")),IF(Table_RiskAssessment[[#This Row],[P2]]=1,IF(Table_RiskAssessment[[#This Row],[W2]]=1,\"c\",\"d\"),IF(Table_RiskAssessment[[#This Row],[W2]]=1,\"d\",\"e\")))),\"?\")","v":"?"},null,null,null,"-"]
[null,null,null,"2006 / 42","1.7.2.",{"$f":"Language!A$148","v":"Warning of residual risks"},"x","","x",null,null,null,null,"---",null,null,null,null,null,null,null,null,null,null,null,null,null,null,null,null,null,null,null,null,null,null,null,null,null,null,null,null,null,null,"---",null,null,null,null,null,null,null,null,null,{"$f":"IF((Table_RiskAssessment[[#This Row],[S2]]* Table_RiskAssessment[[#This Row],[F2]]* Table_RiskAssessment[[#This Row],[P2]]>0),IF(Table_RiskAssessment[[#This Row],[S2]]=1,IF(Table_RiskAssessment[[#This Row],[F2]]=1,IF(Table_RiskAssessment[[#This Row],[P2]]=1,\"a\",IF(Table_RiskAssessment[[#This Row],[W2]]=1,\"a\",\"b\")),IF(Table_RiskAssessment[[#This Row],[P2]]=1,IF(Table_RiskAssessment[[#This Row],[W2]]=1,\"a\",\"b\"),IF(Table_RiskAssessment[[#This Row],[W2]]=1,\"b\",\"c\"))),IF(Table_RiskAssessment[[#This Row],[F2]]=1,IF(Table_RiskAssessment[[#This Row],[P2]]=1,IF(Table_RiskAssessment[[#This Row],[W2]]=1,\"b\",\"c\"),IF(Table_RiskAssessment[[#This Row],[W2]]=1,\"c\",\"d\")),IF(Table_RiskAssessment[[#This Row],[P2]]=1,IF(Table_RiskAssessment[[#This Row],[W2]]=1,\"c\",\"d\"),IF(Table_RiskAssessment[[#This Row],[W2]]=1,\"d\",\"e\")))),\"?\")","v":"?"},null,null,null,"-"]
[null,null,null,"2006 / 42","1.7.3.",{"$f":"Language!A$149","v":"Marking of machinery"},"x","","x",null,null,null,null,null,null,null,null,null,null,null,null,null,null,null,null,null,null,null,null,null,null,null,null,null,null,null,null,null,null,null,null,null,null,null,null,null,null,null,null,null,null,null,null,null,{"$f":"IF((Table_RiskAssessment[[#This Row],[S2]]* Table_RiskAssessment[[#This Row],[F2]]* Table_RiskAssessment[[#This Row],[P2]]>0),IF(Table_RiskAssessment[[#This Row],[S2]]=1,IF(Table_RiskAssessment[[#This Row],[F2]]=1,IF(Table_RiskAssessment[[#This Row],[P2]]=1,\"a\",IF(Table_RiskAssessment[[#This Row],[W2]]=1,\"a\",\"b\")),IF(Table_RiskAssessment[[#This Row],[P2]]=1,IF(Table_RiskAssessment[[#This Row],[W2]]=1,\"a\",\"b\"),IF(Table_RiskAssessment[[#This Row],[W2]]=1,\"b\",\"c\"))),IF(Table_RiskAssessment[[#This Row],[F2]]=1,IF(Table_RiskAssessment[[#This Row],[P2]]=1,IF(Table_RiskAssessment[[#This Row],[W2]]=1,\"b\",\"c\"),IF(Table_RiskAssessment[[#This Row],[W2]]=1,\"c\",\"d\")),IF(Table_RiskAssessment[[#This Row],[P2]]=1,IF(Table_RiskAssessment[[#This Row],[W2]]=1,\"c\",\"d\"),IF(Table_RiskAssessment[[#This Row],[W2]]=1,\"d\",\"e\")))),\"?\")","v":"?"},null,null,null,"-"]
[null,null,null,"2006 / 42","1.7.4.",{"$f":"Language!A$150","v":"Instructions"},"x","","x",null,null,null,null,null,null,null,null,null,null,null,null,null,null,null,null,null,null,null,null,null,null,null,null,null,null,null,null,null,null,null,null,null,null,null,null,null,null,null,null,null,null,null,null,null,{"$f":"IF((Table_RiskAssessment[[#This Row],[S2]]* Table_RiskAssessment[[#This Row],[F2]]* Table_RiskAssessment[[#This Row],[P2]]>0),IF(Table_RiskAssessment[[#This Row],[S2]]=1,IF(Table_RiskAssessment[[#This Row],[F2]]=1,IF(Table_RiskAssessment[[#This Row],[P2]]=1,\"a\",IF(Table_RiskAssessment[[#This Row],[W2]]=1,\"a\",\"b\")),IF(Table_RiskAssessment[[#This Row],[P2]]=1,IF(Table_RiskAssessment[[#This Row],[W2]]=1,\"a\",\"b\"),IF(Table_RiskAssessment[[#This Row],[W2]]=1,\"b\",\"c\"))),IF(Table_RiskAssessment[[#This Row],[F2]]=1,IF(Table_RiskAssessment[[#This Row],[P2]]=1,IF(Table_RiskAssessment[[#This Row],[W2]]=1,\"b\",\"c\"),IF(Table_RiskAssessment[[#This Row],[W2]]=1,\"c\",\"d\")),IF(Table_RiskAssessment[[#This Row],[P2]]=1,IF(Table_RiskAssessment[[#This Row],[W2]]=1,\"c\",\"d\"),IF(Table_RiskAssessment[[#This Row],[W2]]=1,\"d\",\"e\")))),\"?\")","v":"?"},null,null,null,"-"]
[null,null,null,"2006 / 42","1.7.4.1.",{"$f":"Language!A$151","v":"General principles for the drafting of instructions"},"x","","x",null,null,null,null,null,null,null,null,null,null,null,null,null,null,null,null,null,null,null,null,null,null,null,null,null,null,null,null,null,null,null,null,null,null,null,null,null,null,null,null,null,null,null,null,null,{"$f":"IF((Table_RiskAssessment[[#This Row],[S2]]* Table_RiskAssessment[[#This Row],[F2]]* Table_RiskAssessment[[#This Row],[P2]]>0),IF(Table_RiskAssessment[[#This Row],[S2]]=1,IF(Table_RiskAssessment[[#This Row],[F2]]=1,IF(Table_RiskAssessment[[#This Row],[P2]]=1,\"a\",IF(Table_RiskAssessment[[#This Row],[W2]]=1,\"a\",\"b\")),IF(Table_RiskAssessment[[#This Row],[P2]]=1,IF(Table_RiskAssessment[[#This Row],[W2]]=1,\"a\",\"b\"),IF(Table_RiskAssessment[[#This Row],[W2]]=1,\"b\",\"c\"))),IF(Table_RiskAssessment[[#This Row],[F2]]=1,IF(Table_RiskAssessment[[#This Row],[P2]]=1,IF(Table_RiskAssessment[[#This Row],[W2]]=1,\"b\",\"c\"),IF(Table_RiskAssessment[[#This Row],[W2]]=1,\"c\",\"d\")),IF(Table_RiskAssessment[[#This Row],[P2]]=1,IF(Table_RiskAssessment[[#This Row],[W2]]=1,\"c\",\"d\"),IF(Table_RiskAssessment[[#This Row],[W2]]=1,\"d\",\"e\")))),\"?\")","v":"?"},null,null,null,"-"]
[null,null,null,"2006 / 42","1.7.4.2.",{"$f":"Language!A$152","v":"Contents of the instructions"},"x","","x",null,null,null,null,"---",null,null,null,null,null,null,null,null,null,null,null,null,null,null,null,null,null,null,null,null,null,null,null,null,null,null,null,null,null,null,"---",null,null,null,null,null,null,null,null,null,{"$f":"IF((Table_RiskAssessment[[#This Row],[S2]]* Table_RiskAssessment[[#This Row],[F2]]* Table_RiskAssessment[[#This Row],[P2]]>0),IF(Table_RiskAssessment[[#This Row],[S2]]=1,IF(Table_RiskAssessment[[#This Row],[F2]]=1,IF(Table_RiskAssessment[[#This Row],[P2]]=1,\"a\",IF(Table_RiskAssessment[[#This Row],[W2]]=1,\"a\",\"b\")),IF(Table_RiskAssessment[[#This Row],[P2]]=1,IF(Table_RiskAssessment[[#This Row],[W2]]=1,\"a\",\"b\"),IF(Table_RiskAssessment[[#This Row],[W2]]=1,\"b\",\"c\"))),IF(Table_RiskAssessment[[#This Row],[F2]]=1,IF(Table_RiskAssessment[[#This Row],[P2]]=1,IF(Table_RiskAssessment[[#This Row],[W2]]=1,\"b\",\"c\"),IF(Table_RiskAssessment[[#This Row],[W2]]=1,\"c\",\"d\")),IF(Table_RiskAssessment[[#This Row],[P2]]=1,IF(Table_RiskAssessment[[#This Row],[W2]]=1,\"c\",\"d\"),IF(Table_RiskAssessment[[#This Row],[W2]]=1,\"d\",\"e\")))),\"?\")","v":"?"},null,null,null,"-"]
[null,null,null,"2006 / 42","1.7.4.3.",{"$f":"Language!A$153","v":"Sales literature"},"x","","x",null,null,null,null,null,null,null,null,null,null,null,null,null,null,null,null,null,null,null,null,null,null,null,null,null,null,null,null,null,null,null,null,null,null,null,null,null,null,null,null,null,null,null,null,null,{"$f":"IF((Table_RiskAssessment[[#This Row],[S2]]* Table_RiskAssessment[[#This Row],[F2]]* Table_RiskAssessment[[#This Row],[P2]]>0),IF(Table_RiskAssessment[[#This Row],[S2]]=1,IF(Table_RiskAssessment[[#This Row],[F2]]=1,IF(Table_RiskAssessment[[#This Row],[P2]]=1,\"a\",IF(Table_RiskAssessment[[#This Row],[W2]]=1,\"a\",\"b\")),IF(Table_RiskAssessment[[#This Row],[P2]]=1,IF(Table_RiskAssessment[[#This Row],[W2]]=1,\"a\",\"b\"),IF(Table_RiskAssessment[[#This Row],[W2]]=1,\"b\",\"c\"))),IF(Table_RiskAssessment[[#This Row],[F2]]=1,IF(Table_RiskAssessment[[#This Row],[P2]]=1,IF(Table_RiskAssessment[[#This Row],[W2]]=1,\"b\",\"c\"),IF(Table_RiskAssessment[[#This Row],[W2]]=1,\"c\",\"d\")),IF(Table_RiskAssessment[[#This Row],[P2]]=1,IF(Table_RiskAssessment[[#This Row],[W2]]=1,\"c\",\"d\"),IF(Table_RiskAssessment[[#This Row],[W2]]=1,\"d\",\"e\")))),\"?\")","v":"?"},null,null,null,"-"]
[null,null,null,"2006 / 42","2.",{"$f":"Language!A$154","v":"Supplementary essential health and safety requirements for certain categories of machinery"},"x","x","x",null,null,null,null,null,null,null,null,null,null,null,null,null,null,null,null,null,null,null,null,null,null,null,null,null,null,null,null,null,null,null,null,null,null,null,null,null,null,null,null,null,null,null,null,null,{"$f":"IF((Table_RiskAssessment[[#This Row],[S2]]* Table_RiskAssessment[[#This Row],[F2]]* Table_RiskAssessment[[#This Row],[P2]]>0),IF(Table_RiskAssessment[[#This Row],[S2]]=1,IF(Table_RiskAssessment[[#This Row],[F2]]=1,IF(Table_RiskAssessment[[#This Row],[P2]]=1,\"a\",IF(Table_RiskAssessment[[#This Row],[W2]]=1,\"a\",\"b\")),IF(Table_RiskAssessment[[#This Row],[P2]]=1,IF(Table_RiskAssessment[[#This Row],[W2]]=1,\"a\",\"b\"),IF(Table_RiskAssessment[[#This Row],[W2]]=1,\"b\",\"c\"))),IF(Table_RiskAssessment[[#This Row],[F2]]=1,IF(Table_RiskAssessment[[#This Row],[P2]]=1,IF(Table_RiskAssessment[[#This Row],[W2]]=1,\"b\",\"c\"),IF(Table_RiskAssessment[[#This Row],[W2]]=1,\"c\",\"d\")),IF(Table_RiskAssessment[[#This Row],[P2]]=1,IF(Table_RiskAssessment[[#This Row],[W2]]=1,\"c\",\"d\"),IF(Table_RiskAssessment[[#This Row],[W2]]=1,\"d\",\"e\")))),\"?\")","v":"?"},null,null,null,"-"]
[null,null,null,"2006 / 42","2.1.",{"$f":"Language!A$155","v":"Foodstuffs machinery and machinery for cosmetics or pharmaceutical products"},"x","x","x",null,null,null,null,"---",null,null,null,null,null,null,null,null,null,null,null,null,null,null,null,null,null,null,null,null,null,null,null,null,null,null,null,null,null,null,"---",null,null,null,null,null,null,null,null,null,{"$f":"IF((Table_RiskAssessment[[#This Row],[S2]]* Table_RiskAssessment[[#This Row],[F2]]* Table_RiskAssessment[[#This Row],[P2]]>0),IF(Table_RiskAssessment[[#This Row],[S2]]=1,IF(Table_RiskAssessment[[#This Row],[F2]]=1,IF(Table_RiskAssessment[[#This Row],[P2]]=1,\"a\",IF(Table_RiskAssessment[[#This Row],[W2]]=1,\"a\",\"b\")),IF(Table_RiskAssessment[[#This Row],[P2]]=1,IF(Table_RiskAssessment[[#This Row],[W2]]=1,\"a\",\"b\"),IF(Table_RiskAssessment[[#This Row],[W2]]=1,\"b\",\"c\"))),IF(Table_RiskAssessment[[#This Row],[F2]]=1,IF(Table_RiskAssessment[[#This Row],[P2]]=1,IF(Table_RiskAssessment[[#This Row],[W2]]=1,\"b\",\"c\"),IF(Table_RiskAssessment[[#This Row],[W2]]=1,\"c\",\"d\")),IF(Table_RiskAssessment[[#This Row],[P2]]=1,IF(Table_RiskAssessment[[#This Row],[W2]]=1,\"c\",\"d\"),IF(Table_RiskAssessment[[#This Row],[W2]]=1,\"d\",\"e\")))),\"?\")","v":"?"},null,null,null,"-"]
[null,null,null,"2006 / 42","2.1.1.",{"$f":"Language!A$156","v":"General"},"x","","x",null,null,null,null,null,null,null,null,null,null,null,null,null,null,null,null,null,null,null,null,null,null,null,null,null,null,null,null,null,null,null,null,null,null,null,null,null,null,null,null,null,null,null,null,null,{"$f":"IF((Table_RiskAssessment[[#This Row],[S2]]* Table_RiskAssessment[[#This Row],[F2]]* Table_RiskAssessment[[#This Row],[P2]]>0),IF(Table_RiskAssessment[[#This Row],[S2]]=1,IF(Table_RiskAssessment[[#This Row],[F2]]=1,IF(Table_RiskAssessment[[#This Row],[P2]]=1,\"a\",IF(Table_RiskAssessment[[#This Row],[W2]]=1,\"a\",\"b\")),IF(Table_RiskAssessment[[#This Row],[P2]]=1,IF(Table_RiskAssessment[[#This Row],[W2]]=1,\"a\",\"b\"),IF(Table_RiskAssessment[[#This Row],[W2]]=1,\"b\",\"c\"))),IF(Table_RiskAssessment[[#This Row],[F2]]=1,IF(Table_RiskAssessment[[#This Row],[P2]]=1,IF(Table_RiskAssessment[[#This Row],[W2]]=1,\"b\",\"c\"),IF(Table_RiskAssessment[[#This Row],[W2]]=1,\"c\",\"d\")),IF(Table_RiskAssessment[[#This Row],[P2]]=1,IF(Table_RiskAssessment[[#This Row],[W2]]=1,\"c\",\"d\"),IF(Table_RiskAssessment[[#This Row],[W2]]=1,\"d\",\"e\")))),\"?\")","v":"?"},null,null,null,"-"]
[null,null,null,"2006 / 42","2.1.2.",{"$f":"Language!A$157","v":"Instructions"},"x","","x",null,null,null,null,null,null,null,null,null,null,null,null,null,null,null,null,null,null,null,null,null,null,null,null,null,null,null,null,null,null,null,null,null,null,null,null,null,null,null,null,null,null,null,null,null,{"$f":"IF((Table_RiskAssessment[[#This Row],[S2]]* Table_RiskAssessment[[#This Row],[F2]]* Table_RiskAssessment[[#This Row],[P2]]>0),IF(Table_RiskAssessment[[#This Row],[S2]]=1,IF(Table_RiskAssessment[[#This Row],[F2]]=1,IF(Table_RiskAssessment[[#This Row],[P2]]=1,\"a\",IF(Table_RiskAssessment[[#This Row],[W2]]=1,\"a\",\"b\")),IF(Table_RiskAssessment[[#This Row],[P2]]=1,IF(Table_RiskAssessment[[#This Row],[W2]]=1,\"a\",\"b\"),IF(Table_RiskAssessment[[#This Row],[W2]]=1,\"b\",\"c\"))),IF(Table_RiskAssessment[[#This Row],[F2]]=1,IF(Table_RiskAssessment[[#This Row],[P2]]=1,IF(Table_RiskAssessment[[#This Row],[W2]]=1,\"b\",\"c\"),IF(Table_RiskAssessment[[#This Row],[W2]]=1,\"c\",\"d\")),IF(Table_RiskAssessment[[#This Row],[P2]]=1,IF(Table_RiskAssessment[[#This Row],[W2]]=1,\"c\",\"d\"),IF(Table_RiskAssessment[[#This Row],[W2]]=1,\"d\",\"e\")))),\"?\")","v":"?"},null,null,null,"-"]
[null,null,null,"2006 / 42","2.2.",{"$f":"Language!A$158","v":"Portable hand-held and/or hand-guided machinery"},"x","x","x",null,null,null,null,null,null,null,null,null,null,null,null,null,null,null,null,null,null,null,null,null,null,null,null,null,null,null,null,null,null,null,null,null,null,null,null,null,null,null,null,null,null,null,null,null,{"$f":"IF((Table_RiskAssessment[[#This Row],[S2]]* Table_RiskAssessment[[#This Row],[F2]]* Table_RiskAssessment[[#This Row],[P2]]>0),IF(Table_RiskAssessment[[#This Row],[S2]]=1,IF(Table_RiskAssessment[[#This Row],[F2]]=1,IF(Table_RiskAssessment[[#This Row],[P2]]=1,\"a\",IF(Table_RiskAssessment[[#This Row],[W2]]=1,\"a\",\"b\")),IF(Table_RiskAssessment[[#This Row],[P2]]=1,IF(Table_RiskAssessment[[#This Row],[W2]]=1,\"a\",\"b\"),IF(Table_RiskAssessment[[#This Row],[W2]]=1,\"b\",\"c\"))),IF(Table_RiskAssessment[[#This Row],[F2]]=1,IF(Table_RiskAssessment[[#This Row],[P2]]=1,IF(Table_RiskAssessment[[#This Row],[W2]]=1,\"b\",\"c\"),IF(Table_RiskAssessment[[#This Row],[W2]]=1,\"c\",\"d\")),IF(Table_RiskAssessment[[#This Row],[P2]]=1,IF(Table_RiskAssessment[[#This Row],[W2]]=1,\"c\",\"d\"),IF(Table_RiskAssessment[[#This Row],[W2]]=1,\"d\",\"e\")))),\"?\")","v":"?"},null,null,null,"-"]
[null,null,null,"2006 / 42","2.2.1.",{"$f":"Language!A$159","v":"General"},"x","","x",null,null,null,null,null,null,null,null,null,null,null,null,null,null,null,null,null,null,null,null,null,null,null,null,null,null,null,null,null,null,null,null,null,null,null,null,null,null,null,null,null,null,null,null,null,{"$f":"IF((Table_RiskAssessment[[#This Row],[S2]]* Table_RiskAssessment[[#This Row],[F2]]* Table_RiskAssessment[[#This Row],[P2]]>0),IF(Table_RiskAssessment[[#This Row],[S2]]=1,IF(Table_RiskAssessment[[#This Row],[F2]]=1,IF(Table_RiskAssessment[[#This Row],[P2]]=1,\"a\",IF(Table_RiskAssessment[[#This Row],[W2]]=1,\"a\",\"b\")),IF(Table_RiskAssessment[[#This Row],[P2]]=1,IF(Table_RiskAssessment[[#This Row],[W2]]=1,\"a\",\"b\"),IF(Table_RiskAssessment[[#This Row],[W2]]=1,\"b\",\"c\"))),IF(Table_RiskAssessment[[#This Row],[F2]]=1,IF(Table_RiskAssessment[[#This Row],[P2]]=1,IF(Table_RiskAssessment[[#This Row],[W2]]=1,\"b\",\"c\"),IF(Table_RiskAssessment[[#This Row],[W2]]=1,\"c\",\"d\")),IF(Table_RiskAssessment[[#This Row],[P2]]=1,IF(Table_RiskAssessment[[#This Row],[W2]]=1,\"c\",\"d\"),IF(Table_RiskAssessment[[#This Row],[W2]]=1,\"d\",\"e\")))),\"?\")","v":"?"},null,null,null,"-"]
[null,null,null,"2006 / 42","2.2.1.1.",{"$f":"Language!A$160","v":"Instructions"},"x","","x",null,null,null,null,null,null,null,null,null,null,null,null,null,null,null,null,null,null,null,null,null,null,null,null,null,null,null,null,null,null,null,null,null,null,null,null,null,null,null,null,null,null,null,null,null,{"$f":"IF((Table_RiskAssessment[[#This Row],[S2]]* Table_RiskAssessment[[#This Row],[F2]]* Table_RiskAssessment[[#This Row],[P2]]>0),IF(Table_RiskAssessment[[#This Row],[S2]]=1,IF(Table_RiskAssessment[[#This Row],[F2]]=1,IF(Table_RiskAssessment[[#This Row],[P2]]=1,\"a\",IF(Table_RiskAssessment[[#This Row],[W2]]=1,\"a\",\"b\")),IF(Table_RiskAssessment[[#This Row],[P2]]=1,IF(Table_RiskAssessment[[#This Row],[W2]]=1,\"a\",\"b\"),IF(Table_RiskAssessment[[#This Row],[W2]]=1,\"b\",\"c\"))),IF(Table_RiskAssessment[[#This Row],[F2]]=1,IF(Table_RiskAssessment[[#This Row],[P2]]=1,IF(Table_RiskAssessment[[#This Row],[W2]]=1,\"b\",\"c\"),IF(Table_RiskAssessment[[#This Row],[W2]]=1,\"c\",\"d\")),IF(Table_RiskAssessment[[#This Row],[P2]]=1,IF(Table_RiskAssessment[[#This Row],[W2]]=1,\"c\",\"d\"),IF(Table_RiskAssessment[[#This Row],[W2]]=1,\"d\",\"e\")))),\"?\")","v":"?"},null,null,null,"-"]
[null,null,null,"2006 / 42","2.2.2.",{"$f":"Language!A$161","v":"Portable fixing and other impact machinery"},"x","x","x",null,null,null,null,null,null,null,null,null,null,null,null,null,null,null,null,null,null,null,null,null,null,null,null,null,null,null,null,null,null,null,null,null,null,null,null,null,null,null,null,null,null,null,null,null,{"$f":"IF((Table_RiskAssessment[[#This Row],[S2]]* Table_RiskAssessment[[#This Row],[F2]]* Table_RiskAssessment[[#This Row],[P2]]>0),IF(Table_RiskAssessment[[#This Row],[S2]]=1,IF(Table_RiskAssessment[[#This Row],[F2]]=1,IF(Table_RiskAssessment[[#This Row],[P2]]=1,\"a\",IF(Table_RiskAssessment[[#This Row],[W2]]=1,\"a\",\"b\")),IF(Table_RiskAssessment[[#This Row],[P2]]=1,IF(Table_RiskAssessment[[#This Row],[W2]]=1,\"a\",\"b\"),IF(Table_RiskAssessment[[#This Row],[W2]]=1,\"b\",\"c\"))),IF(Table_RiskAssessment[[#This Row],[F2]]=1,IF(Table_RiskAssessment[[#This Row],[P2]]=1,IF(Table_RiskAssessment[[#This Row],[W2]]=1,\"b\",\"c\"),IF(Table_RiskAssessment[[#This Row],[W2]]=1,\"c\",\"d\")),IF(Table_RiskAssessment[[#This Row],[P2]]=1,IF(Table_RiskAssessment[[#This Row],[W2]]=1,\"c\",\"d\"),IF(Table_RiskAssessment[[#This Row],[W2]]=1,\"d\",\"e\")))),\"?\")","v":"?"},null,null,null,"-"]
[null,null,null,"2006 / 42","2.2.2.1.",{"$f":"Language!A$162","v":"General"},"x","","x",null,null,null,null,null,null,null,null,null,null,null,null,null,null,null,null,null,null,null,null,null,null,null,null,null,null,null,null,null,null,null,null,null,null,null,null,null,null,null,null,null,null,null,null,null,{"$f":"IF((Table_RiskAssessment[[#This Row],[S2]]* Table_RiskAssessment[[#This Row],[F2]]* Table_RiskAssessment[[#This Row],[P2]]>0),IF(Table_RiskAssessment[[#This Row],[S2]]=1,IF(Table_RiskAssessment[[#This Row],[F2]]=1,IF(Table_RiskAssessment[[#This Row],[P2]]=1,\"a\",IF(Table_RiskAssessment[[#This Row],[W2]]=1,\"a\",\"b\")),IF(Table_RiskAssessment[[#This Row],[P2]]=1,IF(Table_RiskAssessment[[#This Row],[W2]]=1,\"a\",\"b\"),IF(Table_RiskAssessment[[#This Row],[W2]]=1,\"b\",\"c\"))),IF(Table_RiskAssessment[[#This Row],[F2]]=1,IF(Table_RiskAssessment[[#This Row],[P2]]=1,IF(Table_RiskAssessment[[#This Row],[W2]]=1,\"b\",\"c\"),IF(Table_RiskAssessment[[#This Row],[W2]]=1,\"c\",\"d\")),IF(Table_RiskAssessment[[#This Row],[P2]]=1,IF(Table_RiskAssessment[[#This Row],[W2]]=1,\"c\",\"d\"),IF(Table_RiskAssessment[[#This Row],[W2]]=1,\"d\",\"e\")))),\"?\")","v":"?"},null,null,null,"-"]
[null,null,null,"2006 / 42","2.2.2.2.",{"$f":"Language!A$163","v":"Instructions"},"x","","x",null,null,null,null,null,null,null,null,null,null,null,null,null,null,null,null,null,null,null,null,null,null,null,null,null,null,null,null,null,null,null,null,null,null,null,null,null,null,null,null,null,null,null,null,null,{"$f":"IF((Table_RiskAssessment[[#This Row],[S2]]* Table_RiskAssessment[[#This Row],[F2]]* Table_RiskAssessment[[#This Row],[P2]]>0),IF(Table_RiskAssessment[[#This Row],[S2]]=1,IF(Table_RiskAssessment[[#This Row],[F2]]=1,IF(Table_RiskAssessment[[#This Row],[P2]]=1,\"a\",IF(Table_RiskAssessment[[#This Row],[W2]]=1,\"a\",\"b\")),IF(Table_RiskAssessment[[#This Row],[P2]]=1,IF(Table_RiskAssessment[[#This Row],[W2]]=1,\"a\",\"b\"),IF(Table_RiskAssessment[[#This Row],[W2]]=1,\"b\",\"c\"))),IF(Table_RiskAssessment[[#This Row],[F2]]=1,IF(Table_RiskAssessment[[#This Row],[P2]]=1,IF(Table_RiskAssessment[[#This Row],[W2]]=1,\"b\",\"c\"),IF(Table_RiskAssessment[[#This Row],[W2]]=1,\"c\",\"d\")),IF(Table_RiskAssessment[[#This Row],[P2]]=1,IF(Table_RiskAssessment[[#This Row],[W2]]=1,\"c\",\"d\"),IF(Table_RiskAssessment[[#This Row],[W2]]=1,\"d\",\"e\")))),\"?\")","v":"?"},null,null,null,"-"]
[null,null,null,"2006 / 42","2.3.",{"$f":"Language!A$164","v":"Machinery for working wood and material with similar physical characteristics"},"x","","x",null,null,null,null,null,null,null,null,null,null,null,null,null,null,null,null,null,null,null,null,null,null,null,null,null,null,null,null,null,null,null,null,null,null,null,null,null,null,null,null,null,null,null,null,null,{"$f":"IF((Table_RiskAssessment[[#This Row],[S2]]* Table_RiskAssessment[[#This Row],[F2]]* Table_RiskAssessment[[#This Row],[P2]]>0),IF(Table_RiskAssessment[[#This Row],[S2]]=1,IF(Table_RiskAssessment[[#This Row],[F2]]=1,IF(Table_RiskAssessment[[#This Row],[P2]]=1,\"a\",IF(Table_RiskAssessment[[#This Row],[W2]]=1,\"a\",\"b\")),IF(Table_RiskAssessment[[#This Row],[P2]]=1,IF(Table_RiskAssessment[[#This Row],[W2]]=1,\"a\",\"b\"),IF(Table_RiskAssessment[[#This Row],[W2]]=1,\"b\",\"c\"))),IF(Table_RiskAssessment[[#This Row],[F2]]=1,IF(Table_RiskAssessment[[#This Row],[P2]]=1,IF(Table_RiskAssessment[[#This Row],[W2]]=1,\"b\",\"c\"),IF(Table_RiskAssessment[[#This Row],[W2]]=1,\"c\",\"d\")),IF(Table_RiskAssessment[[#This Row],[P2]]=1,IF(Table_RiskAssessment[[#This Row],[W2]]=1,\"c\",\"d\"),IF(Table_RiskAssessment[[#This Row],[W2]]=1,\"d\",\"e\")))),\"?\")","v":"?"},null,null,null,"-"]
[null,null,null,"2006 / 42","2.4.",{"$f":"Language!A$165","v":"Machinery for pesticide application"},"x","x","x",null,null,null,null,null,null,null,null,null,null,null,null,null,null,null,null,null,null,null,null,null,null,null,null,null,null,null,null,null,null,null,null,null,null,null,null,null,null,null,null,null,null,null,null,null,{"$f":"IF((Table_RiskAssessment[[#This Row],[S2]]* Table_RiskAssessment[[#This Row],[F2]]* Table_RiskAssessment[[#This Row],[P2]]>0),IF(Table_RiskAssessment[[#This Row],[S2]]=1,IF(Table_RiskAssessment[[#This Row],[F2]]=1,IF(Table_RiskAssessment[[#This Row],[P2]]=1,\"a\",IF(Table_RiskAssessment[[#This Row],[W2]]=1,\"a\",\"b\")),IF(Table_RiskAssessment[[#This Row],[P2]]=1,IF(Table_RiskAssessment[[#This Row],[W2]]=1,\"a\",\"b\"),IF(Table_RiskAssessment[[#This Row],[W2]]=1,\"b\",\"c\"))),IF(Table_RiskAssessment[[#This Row],[F2]]=1,IF(Table_RiskAssessment[[#This Row],[P2]]=1,IF(Table_RiskAssessment[[#This Row],[W2]]=1,\"b\",\"c\"),IF(Table_RiskAssessment[[#This Row],[W2]]=1,\"c\",\"d\")),IF(Table_RiskAssessment[[#This Row],[P2]]=1,IF(Table_RiskAssessment[[#This Row],[W2]]=1,\"c\",\"d\"),IF(Table_RiskAssessment[[#This Row],[W2]]=1,\"d\",\"e\")))),\"?\")","v":"?"},null,null,null,"-"]
[null,null,null,"2006 / 42","2.4.01.",{"$f":"Language!A$166","v":"Definitions"},"x","","x",null,null,null,null,null,null,null,null,null,null,null,null,null,null,null,null,null,null,null,null,null,null,null,null,null,null,null,null,null,null,null,null,null,null,null,null,null,null,null,null,null,null,null,null,null,{"$f":"IF((Table_RiskAssessment[[#This Row],[S2]]* Table_RiskAssessment[[#This Row],[F2]]* Table_RiskAssessment[[#This Row],[P2]]>0),IF(Table_RiskAssessment[[#This Row],[S2]]=1,IF(Table_RiskAssessment[[#This Row],[F2]]=1,IF(Table_RiskAssessment[[#This Row],[P2]]=1,\"a\",IF(Table_RiskAssessment[[#This Row],[W2]]=1,\"a\",\"b\")),IF(Table_RiskAssessment[[#This Row],[P2]]=1,IF(Table_RiskAssessment[[#This Row],[W2]]=1,\"a\",\"b\"),IF(Table_RiskAssessment[[#This Row],[W2]]=1,\"b\",\"c\"))),IF(Table_RiskAssessment[[#This Row],[F2]]=1,IF(Table_RiskAssessment[[#This Row],[P2]]=1,IF(Table_RiskAssessment[[#This Row],[W2]]=1,\"b\",\"c\"),IF(Table_RiskAssessment[[#This Row],[W2]]=1,\"c\",\"d\")),IF(Table_RiskAssessment[[#This Row],[P2]]=1,IF(Table_RiskAssessment[[#This Row],[W2]]=1,\"c\",\"d\"),IF(Table_RiskAssessment[[#This Row],[W2]]=1,\"d\",\"e\")))),\"?\")","v":"?"},null,null,null,"-"]
[null,null,null,"2006 / 42","2.4.02.",{"$f":"Language!A$167","v":"General"},"x","","x",null,null,null,null,null,null,null,null,null,null,null,null,null,null,null,null,null,null,null,null,null,null,null,null,null,null,null,null,null,null,null,null,null,null,null,null,null,null,null,null,null,null,null,null,null,{"$f":"IF((Table_RiskAssessment[[#This Row],[S2]]* Table_RiskAssessment[[#This Row],[F2]]* Table_RiskAssessment[[#This Row],[P2]]>0),IF(Table_RiskAssessment[[#This Row],[S2]]=1,IF(Table_RiskAssessment[[#This Row],[F2]]=1,IF(Table_RiskAssessment[[#This Row],[P2]]=1,\"a\",IF(Table_RiskAssessment[[#This Row],[W2]]=1,\"a\",\"b\")),IF(Table_RiskAssessment[[#This Row],[P2]]=1,IF(Table_RiskAssessment[[#This Row],[W2]]=1,\"a\",\"b\"),IF(Table_RiskAssessment[[#This Row],[W2]]=1,\"b\",\"c\"))),IF(Table_RiskAssessment[[#This Row],[F2]]=1,IF(Table_RiskAssessment[[#This Row],[P2]]=1,IF(Table_RiskAssessment[[#This Row],[W2]]=1,\"b\",\"c\"),IF(Table_RiskAssessment[[#This Row],[W2]]=1,\"c\",\"d\")),IF(Table_RiskAssessment[[#This Row],[P2]]=1,IF(Table_RiskAssessment[[#This Row],[W2]]=1,\"c\",\"d\"),IF(Table_RiskAssessment[[#This Row],[W2]]=1,\"d\",\"e\")))),\"?\")","v":"?"},null,null,null,"-"]
[null,null,null,"2006 / 42","2.4.03.",{"$f":"Language!A$168","v":"Controls and monitoring"},"x","","x",null,null,null,null,null,null,null,null,null,null,null,null,null,null,null,null,null,null,null,null,null,null,null,null,null,null,null,null,null,null,null,null,null,null,null,null,null,null,null,null,null,null,null,null,null,{"$f":"IF((Table_RiskAssessment[[#This Row],[S2]]* Table_RiskAssessment[[#This Row],[F2]]* Table_RiskAssessment[[#This Row],[P2]]>0),IF(Table_RiskAssessment[[#This Row],[S2]]=1,IF(Table_RiskAssessment[[#This Row],[F2]]=1,IF(Table_RiskAssessment[[#This Row],[P2]]=1,\"a\",IF(Table_RiskAssessment[[#This Row],[W2]]=1,\"a\",\"b\")),IF(Table_RiskAssessment[[#This Row],[P2]]=1,IF(Table_RiskAssessment[[#This Row],[W2]]=1,\"a\",\"b\"),IF(Table_RiskAssessment[[#This Row],[W2]]=1,\"b\",\"c\"))),IF(Table_RiskAssessment[[#This Row],[F2]]=1,IF(Table_RiskAssessment[[#This Row],[P2]]=1,IF(Table_RiskAssessment[[#This Row],[W2]]=1,\"b\",\"c\"),IF(Table_RiskAssessment[[#This Row],[W2]]=1,\"c\",\"d\")),IF(Table_RiskAssessment[[#This Row],[P2]]=1,IF(Table_RiskAssessment[[#This Row],[W2]]=1,\"c\",\"d\"),IF(Table_RiskAssessment[[#This Row],[W2]]=1,\"d\",\"e\")))),\"?\")","v":"?"},null,null,null,"-"]
[null,null,null,"2006 / 42","2.4.04.",{"$f":"Language!A$169","v":"Filling and emptying"},"x","","x",null,null,null,null,null,null,null,null,null,null,null,null,null,null,null,null,null,null,null,null,null,null,null,null,null,null,null,null,null,null,null,null,null,null,null,null,null,null,null,null,null,null,null,null,null,{"$f":"IF((Table_RiskAssessment[[#This Row],[S2]]* Table_RiskAssessment[[#This Row],[F2]]* Table_RiskAssessment[[#This Row],[P2]]>0),IF(Table_RiskAssessment[[#This Row],[S2]]=1,IF(Table_RiskAssessment[[#This Row],[F2]]=1,IF(Table_RiskAssessment[[#This Row],[P2]]=1,\"a\",IF(Table_RiskAssessment[[#This Row],[W2]]=1,\"a\",\"b\")),IF(Table_RiskAssessment[[#This Row],[P2]]=1,IF(Table_RiskAssessment[[#This Row],[W2]]=1,\"a\",\"b\"),IF(Table_RiskAssessment[[#This Row],[W2]]=1,\"b\",\"c\"))),IF(Table_RiskAssessment[[#This Row],[F2]]=1,IF(Table_RiskAssessment[[#This Row],[P2]]=1,IF(Table_RiskAssessment[[#This Row],[W2]]=1,\"b\",\"c\"),IF(Table_RiskAssessment[[#This Row],[W2]]=1,\"c\",\"d\")),IF(Table_RiskAssessment[[#This Row],[P2]]=1,IF(Table_RiskAssessment[[#This Row],[W2]]=1,\"c\",\"d\"),IF(Table_RiskAssessment[[#This Row],[W2]]=1,\"d\",\"e\")))),\"?\")","v":"?"},null,null,null,"-"]
[null,null,null,"2006 / 42","2.4.05.",{"$f":"Language!A$170","v":"Application of pesticides"},"x","x","x",null,null,null,null,null,null,null,null,null,null,null,null,null,null,null,null,null,null,null,null,null,null,null,null,null,null,null,null,null,null,null,null,null,null,null,null,null,null,null,null,null,null,null,null,null,{"$f":"IF((Table_RiskAssessment[[#This Row],[S2]]* Table_RiskAssessment[[#This Row],[F2]]* Table_RiskAssessment[[#This Row],[P2]]>0),IF(Table_RiskAssessment[[#This Row],[S2]]=1,IF(Table_RiskAssessment[[#This Row],[F2]]=1,IF(Table_RiskAssessment[[#This Row],[P2]]=1,\"a\",IF(Table_RiskAssessment[[#This Row],[W2]]=1,\"a\",\"b\")),IF(Table_RiskAssessment[[#This Row],[P2]]=1,IF(Table_RiskAssessment[[#This Row],[W2]]=1,\"a\",\"b\"),IF(Table_RiskAssessment[[#This Row],[W2]]=1,\"b\",\"c\"))),IF(Table_RiskAssessment[[#This Row],[F2]]=1,IF(Table_RiskAssessment[[#This Row],[P2]]=1,IF(Table_RiskAssessment[[#This Row],[W2]]=1,\"b\",\"c\"),IF(Table_RiskAssessment[[#This Row],[W2]]=1,\"c\",\"d\")),IF(Table_RiskAssessment[[#This Row],[P2]]=1,IF(Table_RiskAssessment[[#This Row],[W2]]=1,\"c\",\"d\"),IF(Table_RiskAssessment[[#This Row],[W2]]=1,\"d\",\"e\")))),\"?\")","v":"?"},null,null,null,"-"]
[null,null,null,"2006 / 42","2.4.05.1.",{"$f":"Language!A$171","v":"Application rate"},"x","","x",null,null,null,null,null,null,null,null,null,null,null,null,null,null,null,null,null,null,null,null,null,null,null,null,null,null,null,null,null,null,null,null,null,null,null,null,null,null,null,null,null,null,null,null,null,{"$f":"IF((Table_RiskAssessment[[#This Row],[S2]]* Table_RiskAssessment[[#This Row],[F2]]* Table_RiskAssessment[[#This Row],[P2]]>0),IF(Table_RiskAssessment[[#This Row],[S2]]=1,IF(Table_RiskAssessment[[#This Row],[F2]]=1,IF(Table_RiskAssessment[[#This Row],[P2]]=1,\"a\",IF(Table_RiskAssessment[[#This Row],[W2]]=1,\"a\",\"b\")),IF(Table_RiskAssessment[[#This Row],[P2]]=1,IF(Table_RiskAssessment[[#This Row],[W2]]=1,\"a\",\"b\"),IF(Table_RiskAssessment[[#This Row],[W2]]=1,\"b\",\"c\"))),IF(Table_RiskAssessment[[#This Row],[F2]]=1,IF(Table_RiskAssessment[[#This Row],[P2]]=1,IF(Table_RiskAssessment[[#This Row],[W2]]=1,\"b\",\"c\"),IF(Table_RiskAssessment[[#This Row],[W2]]=1,\"c\",\"d\")),IF(Table_RiskAssessment[[#This Row],[P2]]=1,IF(Table_RiskAssessment[[#This Row],[W2]]=1,\"c\",\"d\"),IF(Table_RiskAssessment[[#This Row],[W2]]=1,\"d\",\"e\")))),\"?\")","v":"?"},null,null,null,"-"]
[null,null,null,"2006 / 42","2.4.05.2.",{"$f":"Language!A$172","v":"Distribution, deposition and drift of pesticide"},"x","","x",null,null,null,null,null,null,null,null,null,null,null,null,null,null,null,null,null,null,null,null,null,null,null,null,null,null,null,null,null,null,null,null,null,null,null,null,null,null,null,null,null,null,null,null,null,{"$f":"IF((Table_RiskAssessment[[#This Row],[S2]]* Table_RiskAssessment[[#This Row],[F2]]* Table_RiskAssessment[[#This Row],[P2]]>0),IF(Table_RiskAssessment[[#This Row],[S2]]=1,IF(Table_RiskAssessment[[#This Row],[F2]]=1,IF(Table_RiskAssessment[[#This Row],[P2]]=1,\"a\",IF(Table_RiskAssessment[[#This Row],[W2]]=1,\"a\",\"b\")),IF(Table_RiskAssessment[[#This Row],[P2]]=1,IF(Table_RiskAssessment[[#This Row],[W2]]=1,\"a\",\"b\"),IF(Table_RiskAssessment[[#This Row],[W2]]=1,\"b\",\"c\"))),IF(Table_RiskAssessment[[#This Row],[F2]]=1,IF(Table_RiskAssessment[[#This Row],[P2]]=1,IF(Table_RiskAssessment[[#This Row],[W2]]=1,\"b\",\"c\"),IF(Table_RiskAssessment[[#This Row],[W2]]=1,\"c\",\"d\")),IF(Table_RiskAssessment[[#This Row],[P2]]=1,IF(Table_RiskAssessment[[#This Row],[W2]]=1,\"c\",\"d\"),IF(Table_RiskAssessment[[#This Row],[W2]]=1,\"d\",\"e\")))),\"?\")","v":"?"},null,null,null,"-"]
[null,null,null,"2006 / 42","2.4.05.3.",{"$f":"Language!A$173","v":"Tests"},"x","","x",null,null,null,null,null,null,null,null,null,null,null,null,null,null,null,null,null,null,null,null,null,null,null,null,null,null,null,null,null,null,null,null,null,null,null,null,null,null,null,null,null,null,null,null,null,{"$f":"IF((Table_RiskAssessment[[#This Row],[S2]]* Table_RiskAssessment[[#This Row],[F2]]* Table_RiskAssessment[[#This Row],[P2]]>0),IF(Table_RiskAssessment[[#This Row],[S2]]=1,IF(Table_RiskAssessment[[#This Row],[F2]]=1,IF(Table_RiskAssessment[[#This Row],[P2]]=1,\"a\",IF(Table_RiskAssessment[[#This Row],[W2]]=1,\"a\",\"b\")),IF(Table_RiskAssessment[[#This Row],[P2]]=1,IF(Table_RiskAssessment[[#This Row],[W2]]=1,\"a\",\"b\"),IF(Table_RiskAssessment[[#This Row],[W2]]=1,\"b\",\"c\"))),IF(Table_RiskAssessment[[#This Row],[F2]]=1,IF(Table_RiskAssessment[[#This Row],[P2]]=1,IF(Table_RiskAssessment[[#This Row],[W2]]=1,\"b\",\"c\"),IF(Table_RiskAssessment[[#This Row],[W2]]=1,\"c\",\"d\")),IF(Table_RiskAssessment[[#This Row],[P2]]=1,IF(Table_RiskAssessment[[#This Row],[W2]]=1,\"c\",\"d\"),IF(Table_RiskAssessment[[#This Row],[W2]]=1,\"d\",\"e\")))),\"?\")","v":"?"},null,null,null,"-"]
[null,null,null,"2006 / 42","2.4.05.4.",{"$f":"Language!A$174","v":"Losses during stoppage"},"x","","x",null,null,null,null,null,null,null,null,null,null,null,null,null,null,null,null,null,null,null,null,null,null,null,null,null,null,null,null,null,null,null,null,null,null,null,null,null,null,null,null,null,null,null,null,null,{"$f":"IF((Table_RiskAssessment[[#This Row],[S2]]* Table_RiskAssessment[[#This Row],[F2]]* Table_RiskAssessment[[#This Row],[P2]]>0),IF(Table_RiskAssessment[[#This Row],[S2]]=1,IF(Table_RiskAssessment[[#This Row],[F2]]=1,IF(Table_RiskAssessment[[#This Row],[P2]]=1,\"a\",IF(Table_RiskAssessment[[#This Row],[W2]]=1,\"a\",\"b\")),IF(Table_RiskAssessment[[#This Row],[P2]]=1,IF(Table_RiskAssessment[[#This Row],[W2]]=1,\"a\",\"b\"),IF(Table_RiskAssessment[[#This Row],[W2]]=1,\"b\",\"c\"))),IF(Table_RiskAssessment[[#This Row],[F2]]=1,IF(Table_RiskAssessment[[#This Row],[P2]]=1,IF(Table_RiskAssessment[[#This Row],[W2]]=1,\"b\",\"c\"),IF(Table_RiskAssessment[[#This Row],[W2]]=1,\"c\",\"d\")),IF(Table_RiskAssessment[[#This Row],[P2]]=1,IF(Table_RiskAssessment[[#This Row],[W2]]=1,\"c\",\"d\"),IF(Table_RiskAssessment[[#This Row],[W2]]=1,\"d\",\"e\")))),\"?\")","v":"?"},null,null,null,"-"]
[null,null,null,"2006 / 42","2.4.06.",{"$f":"Language!A$175","v":"Maintenance"},"x","x","x",null,null,null,null,null,null,null,null,null,null,null,null,null,null,null,null,null,null,null,null,null,null,null,null,null,null,null,null,null,null,null,null,null,null,null,null,null,null,null,null,null,null,null,null,null,{"$f":"IF((Table_RiskAssessment[[#This Row],[S2]]* Table_RiskAssessment[[#This Row],[F2]]* Table_RiskAssessment[[#This Row],[P2]]>0),IF(Table_RiskAssessment[[#This Row],[S2]]=1,IF(Table_RiskAssessment[[#This Row],[F2]]=1,IF(Table_RiskAssessment[[#This Row],[P2]]=1,\"a\",IF(Table_RiskAssessment[[#This Row],[W2]]=1,\"a\",\"b\")),IF(Table_RiskAssessment[[#This Row],[P2]]=1,IF(Table_RiskAssessment[[#This Row],[W2]]=1,\"a\",\"b\"),IF(Table_RiskAssessment[[#This Row],[W2]]=1,\"b\",\"c\"))),IF(Table_RiskAssessment[[#This Row],[F2]]=1,IF(Table_RiskAssessment[[#This Row],[P2]]=1,IF(Table_RiskAssessment[[#This Row],[W2]]=1,\"b\",\"c\"),IF(Table_RiskAssessment[[#This Row],[W2]]=1,\"c\",\"d\")),IF(Table_RiskAssessment[[#This Row],[P2]]=1,IF(Table_RiskAssessment[[#This Row],[W2]]=1,\"c\",\"d\"),IF(Table_RiskAssessment[[#This Row],[W2]]=1,\"d\",\"e\")))),\"?\")","v":"?"},null,null,null,"-"]
[null,null,null,"2006 / 42","2.4.06.1.",{"$f":"Language!A$176","v":"Cleaning"},"x","","x",null,null,null,null,null,null,null,null,null,null,null,null,null,null,null,null,null,null,null,null,null,null,null,null,null,null,null,null,null,null,null,null,null,null,null,null,null,null,null,null,null,null,null,null,null,{"$f":"IF((Table_RiskAssessment[[#This Row],[S2]]* Table_RiskAssessment[[#This Row],[F2]]* Table_RiskAssessment[[#This Row],[P2]]>0),IF(Table_RiskAssessment[[#This Row],[S2]]=1,IF(Table_RiskAssessment[[#This Row],[F2]]=1,IF(Table_RiskAssessment[[#This Row],[P2]]=1,\"a\",IF(Table_RiskAssessment[[#This Row],[W2]]=1,\"a\",\"b\")),IF(Table_RiskAssessment[[#This Row],[P2]]=1,IF(Table_RiskAssessment[[#This Row],[W2]]=1,\"a\",\"b\"),IF(Table_RiskAssessment[[#This Row],[W2]]=1,\"b\",\"c\"))),IF(Table_RiskAssessment[[#This Row],[F2]]=1,IF(Table_RiskAssessment[[#This Row],[P2]]=1,IF(Table_RiskAssessment[[#This Row],[W2]]=1,\"b\",\"c\"),IF(Table_RiskAssessment[[#This Row],[W2]]=1,\"c\",\"d\")),IF(Table_RiskAssessment[[#This Row],[P2]]=1,IF(Table_RiskAssessment[[#This Row],[W2]]=1,\"c\",\"d\"),IF(Table_RiskAssessment[[#This Row],[W2]]=1,\"d\",\"e\")))),\"?\")","v":"?"},null,null,null,"-"]
[null,null,null,"2006 / 42","2.4.06.2.",{"$f":"Language!A$177","v":"Servicing"},"x","","x",null,null,null,null,null,null,null,null,null,null,null,null,null,null,null,null,null,null,null,null,null,null,null,null,null,null,null,null,null,null,null,null,null,null,null,null,null,null,null,null,null,null,null,null,null,{"$f":"IF((Table_RiskAssessment[[#This Row],[S2]]* Table_RiskAssessment[[#This Row],[F2]]* Table_RiskAssessment[[#This Row],[P2]]>0),IF(Table_RiskAssessment[[#This Row],[S2]]=1,IF(Table_RiskAssessment[[#This Row],[F2]]=1,IF(Table_RiskAssessment[[#This Row],[P2]]=1,\"a\",IF(Table_RiskAssessment[[#This Row],[W2]]=1,\"a\",\"b\")),IF(Table_RiskAssessment[[#This Row],[P2]]=1,IF(Table_RiskAssessment[[#This Row],[W2]]=1,\"a\",\"b\"),IF(Table_RiskAssessment[[#This Row],[W2]]=1,\"b\",\"c\"))),IF(Table_RiskAssessment[[#This Row],[F2]]=1,IF(Table_RiskAssessment[[#This Row],[P2]]=1,IF(Table_RiskAssessment[[#This Row],[W2]]=1,\"b\",\"c\"),IF(Table_RiskAssessment[[#This Row],[W2]]=1,\"c\",\"d\")),IF(Table_RiskAssessment[[#This Row],[P2]]=1,IF(Table_RiskAssessment[[#This Row],[W2]]=1,\"c\",\"d\"),IF(Table_RiskAssessment[[#This Row],[W2]]=1,\"d\",\"e\")))),\"?\")","v":"?"},null,null,null,"-"]
[null,null,null,"2006 / 42","2.4.07.",{"$f":"Language!A$178","v":"Inspections"},"x","","x",null,null,null,null,null,null,null,null,null,null,null,null,null,null,null,null,null,null,null,null,null,null,null,null,null,null,null,null,null,null,null,null,null,null,null,null,null,null,null,null,null,null,null,null,null,{"$f":"IF((Table_RiskAssessment[[#This Row],[S2]]* Table_RiskAssessment[[#This Row],[F2]]* Table_RiskAssessment[[#This Row],[P2]]>0),IF(Table_RiskAssessment[[#This Row],[S2]]=1,IF(Table_RiskAssessment[[#This Row],[F2]]=1,IF(Table_RiskAssessment[[#This Row],[P2]]=1,\"a\",IF(Table_RiskAssessment[[#This Row],[W2]]=1,\"a\",\"b\")),IF(Table_RiskAssessment[[#This Row],[P2]]=1,IF(Table_RiskAssessment[[#This Row],[W2]]=1,\"a\",\"b\"),IF(Table_RiskAssessment[[#This Row],[W2]]=1,\"b\",\"c\"))),IF(Table_RiskAssessment[[#This Row],[F2]]=1,IF(Table_RiskAssessment[[#This Row],[P2]]=1,IF(Table_RiskAssessment[[#This Row],[W2]]=1,\"b\",\"c\"),IF(Table_RiskAssessment[[#This Row],[W2]]=1,\"c\",\"d\")),IF(Table_RiskAssessment[[#This Row],[P2]]=1,IF(Table_RiskAssessment[[#This Row],[W2]]=1,\"c\",\"d\"),IF(Table_RiskAssessment[[#This Row],[W2]]=1,\"d\",\"e\")))),\"?\")","v":"?"},null,null,null,"-"]
[null,null,null,"2006 / 42","2.4.08.",{"$f":"Language!A$179","v":"Marking of nozzles, strainers and filters"},"x","","x",null,null,null,null,null,null,null,null,null,null,null,null,null,null,null,null,null,null,null,null,null,null,null,null,null,null,null,null,null,null,null,null,null,null,null,null,null,null,null,null,null,null,null,null,null,{"$f":"IF((Table_RiskAssessment[[#This Row],[S2]]* Table_RiskAssessment[[#This Row],[F2]]* Table_RiskAssessment[[#This Row],[P2]]>0),IF(Table_RiskAssessment[[#This Row],[S2]]=1,IF(Table_RiskAssessment[[#This Row],[F2]]=1,IF(Table_RiskAssessment[[#This Row],[P2]]=1,\"a\",IF(Table_RiskAssessment[[#This Row],[W2]]=1,\"a\",\"b\")),IF(Table_RiskAssessment[[#This Row],[P2]]=1,IF(Table_RiskAssessment[[#This Row],[W2]]=1,\"a\",\"b\"),IF(Table_RiskAssessment[[#This Row],[W2]]=1,\"b\",\"c\"))),IF(Table_RiskAssessment[[#This Row],[F2]]=1,IF(Table_RiskAssessment[[#This Row],[P2]]=1,IF(Table_RiskAssessment[[#This Row],[W2]]=1,\"b\",\"c\"),IF(Table_RiskAssessment[[#This Row],[W2]]=1,\"c\",\"d\")),IF(Table_RiskAssessment[[#This Row],[P2]]=1,IF(Table_RiskAssessment[[#This Row],[W2]]=1,\"c\",\"d\"),IF(Table_RiskAssessment[[#This Row],[W2]]=1,\"d\",\"e\")))),\"?\")","v":"?"},null,null,null,"-"]
[null,null,null,"2006 / 42","2.4.09.",{"$f":"Language!A$180","v":"Indication of pesticide in use"},"x","","x",null,null,null,null,null,null,null,null,null,null,null,null,null,null,null,null,null,null,null,null,null,null,null,null,null,null,null,null,null,null,null,null,null,null,null,null,null,null,null,null,null,null,null,null,null,{"$f":"IF((Table_RiskAssessment[[#This Row],[S2]]* Table_RiskAssessment[[#This Row],[F2]]* Table_RiskAssessment[[#This Row],[P2]]>0),IF(Table_RiskAssessment[[#This Row],[S2]]=1,IF(Table_RiskAssessment[[#This Row],[F2]]=1,IF(Table_RiskAssessment[[#This Row],[P2]]=1,\"a\",IF(Table_RiskAssessment[[#This Row],[W2]]=1,\"a\",\"b\")),IF(Table_RiskAssessment[[#This Row],[P2]]=1,IF(Table_RiskAssessment[[#This Row],[W2]]=1,\"a\",\"b\"),IF(Table_RiskAssessment[[#This Row],[W2]]=1,\"b\",\"c\"))),IF(Table_RiskAssessment[[#This Row],[F2]]=1,IF(Table_RiskAssessment[[#This Row],[P2]]=1,IF(Table_RiskAssessment[[#This Row],[W2]]=1,\"b\",\"c\"),IF(Table_RiskAssessment[[#This Row],[W2]]=1,\"c\",\"d\")),IF(Table_RiskAssessment[[#This Row],[P2]]=1,IF(Table_RiskAssessment[[#This Row],[W2]]=1,\"c\",\"d\"),IF(Table_RiskAssessment[[#This Row],[W2]]=1,\"d\",\"e\")))),\"?\")","v":"?"},null,null,null,"-"]
[null,null,null,"2006 / 42","2.4.10.",{"$f":"Language!A$181","v":"Instructions"},"x","","x",null,null,null,null,null,null,null,null,null,null,null,null,null,null,null,null,null,null,null,null,null,null,null,null,null,null,null,null,null,null,null,null,null,null,null,null,null,null,null,null,null,null,null,null,null,{"$f":"IF((Table_RiskAssessment[[#This Row],[S2]]* Table_RiskAssessment[[#This Row],[F2]]* Table_RiskAssessment[[#This Row],[P2]]>0),IF(Table_RiskAssessment[[#This Row],[S2]]=1,IF(Table_RiskAssessment[[#This Row],[F2]]=1,IF(Table_RiskAssessment[[#This Row],[P2]]=1,\"a\",IF(Table_RiskAssessment[[#This Row],[W2]]=1,\"a\",\"b\")),IF(Table_RiskAssessment[[#This Row],[P2]]=1,IF(Table_RiskAssessment[[#This Row],[W2]]=1,\"a\",\"b\"),IF(Table_RiskAssessment[[#This Row],[W2]]=1,\"b\",\"c\"))),IF(Table_RiskAssessment[[#This Row],[F2]]=1,IF(Table_RiskAssessment[[#This Row],[P2]]=1,IF(Table_RiskAssessment[[#This Row],[W2]]=1,\"b\",\"c\"),IF(Table_RiskAssessment[[#This Row],[W2]]=1,\"c\",\"d\")),IF(Table_RiskAssessment[[#This Row],[P2]]=1,IF(Table_RiskAssessment[[#This Row],[W2]]=1,\"c\",\"d\"),IF(Table_RiskAssessment[[#This Row],[W2]]=1,\"d\",\"e\")))),\"?\")","v":"?"},null,null,null,"-"]
[null,null,null,"2006 / 42","3.",{"$f":"Language!A$182","v":"Supplementary essential health and safety requirements to offset hazards due to the mobility of machinery"},"x","x","x",null,null,null,null,null,null,null,null,null,null,null,null,null,null,null,null,null,null,null,null,null,null,null,null,null,null,null,null,null,null,null,null,null,null,null,null,null,null,null,null,null,null,null,null,null,{"$f":"IF((Table_RiskAssessment[[#This Row],[S2]]* Table_RiskAssessment[[#This Row],[F2]]* Table_RiskAssessment[[#This Row],[P2]]>0),IF(Table_RiskAssessment[[#This Row],[S2]]=1,IF(Table_RiskAssessment[[#This Row],[F2]]=1,IF(Table_RiskAssessment[[#This Row],[P2]]=1,\"a\",IF(Table_RiskAssessment[[#This Row],[W2]]=1,\"a\",\"b\")),IF(Table_RiskAssessment[[#This Row],[P2]]=1,IF(Table_RiskAssessment[[#This Row],[W2]]=1,\"a\",\"b\"),IF(Table_RiskAssessment[[#This Row],[W2]]=1,\"b\",\"c\"))),IF(Table_RiskAssessment[[#This Row],[F2]]=1,IF(Table_RiskAssessment[[#This Row],[P2]]=1,IF(Table_RiskAssessment[[#This Row],[W2]]=1,\"b\",\"c\"),IF(Table_RiskAssessment[[#This Row],[W2]]=1,\"c\",\"d\")),IF(Table_RiskAssessment[[#This Row],[P2]]=1,IF(Table_RiskAssessment[[#This Row],[W2]]=1,\"c\",\"d\"),IF(Table_RiskAssessment[[#This Row],[W2]]=1,\"d\",\"e\")))),\"?\")","v":"?"},null,null,null,"-"]
[null,null,null,"2006 / 42","3.1.",{"$f":"Language!A$183","v":"General"},"x","x","x",null,null,null,null,null,null,null,null,null,null,null,null,null,null,null,null,null,null,null,null,null,null,null,null,null,null,null,null,null,null,null,null,null,null,null,null,null,null,null,null,null,null,null,null,null,{"$f":"IF((Table_RiskAssessment[[#This Row],[S2]]* Table_RiskAssessment[[#This Row],[F2]]* Table_RiskAssessment[[#This Row],[P2]]>0),IF(Table_RiskAssessment[[#This Row],[S2]]=1,IF(Table_RiskAssessment[[#This Row],[F2]]=1,IF(Table_RiskAssessment[[#This Row],[P2]]=1,\"a\",IF(Table_RiskAssessment[[#This Row],[W2]]=1,\"a\",\"b\")),IF(Table_RiskAssessment[[#This Row],[P2]]=1,IF(Table_RiskAssessment[[#This Row],[W2]]=1,\"a\",\"b\"),IF(Table_RiskAssessment[[#This Row],[W2]]=1,\"b\",\"c\"))),IF(Table_RiskAssessment[[#This Row],[F2]]=1,IF(Table_RiskAssessment[[#This Row],[P2]]=1,IF(Table_RiskAssessment[[#This Row],[W2]]=1,\"b\",\"c\"),IF(Table_RiskAssessment[[#This Row],[W2]]=1,\"c\",\"d\")),IF(Table_RiskAssessment[[#This Row],[P2]]=1,IF(Table_RiskAssessment[[#This Row],[W2]]=1,\"c\",\"d\"),IF(Table_RiskAssessment[[#This Row],[W2]]=1,\"d\",\"e\")))),\"?\")","v":"?"},null,null,null,"-"]
[null,null,null,"2006 / 42","3.1.1.",{"$f":"Language!A$184","v":"Definitions"},"x","","x",null,null,null,null,null,null,null,null,null,null,null,null,null,null,null,null,null,null,null,null,null,null,null,null,null,null,null,null,null,null,null,null,null,null,null,null,null,null,null,null,null,null,null,null,null,{"$f":"IF((Table_RiskAssessment[[#This Row],[S2]]* Table_RiskAssessment[[#This Row],[F2]]* Table_RiskAssessment[[#This Row],[P2]]>0),IF(Table_RiskAssessment[[#This Row],[S2]]=1,IF(Table_RiskAssessment[[#This Row],[F2]]=1,IF(Table_RiskAssessment[[#This Row],[P2]]=1,\"a\",IF(Table_RiskAssessment[[#This Row],[W2]]=1,\"a\",\"b\")),IF(Table_RiskAssessment[[#This Row],[P2]]=1,IF(Table_RiskAssessment[[#This Row],[W2]]=1,\"a\",\"b\"),IF(Table_RiskAssessment[[#This Row],[W2]]=1,\"b\",\"c\"))),IF(Table_RiskAssessment[[#This Row],[F2]]=1,IF(Table_RiskAssessment[[#This Row],[P2]]=1,IF(Table_RiskAssessment[[#This Row],[W2]]=1,\"b\",\"c\"),IF(Table_RiskAssessment[[#This Row],[W2]]=1,\"c\",\"d\")),IF(Table_RiskAssessment[[#This Row],[P2]]=1,IF(Table_RiskAssessment[[#This Row],[W2]]=1,\"c\",\"d\"),IF(Table_RiskAssessment[[#This Row],[W2]]=1,\"d\",\"e\")))),\"?\")","v":"?"},null,null,null,"-"]
[null,null,null,"2006 / 42","3.2.",{"$f":"Language!A$185","v":"Work positions"},"x","x","x",null,null,null,null,null,null,null,null,null,null,null,null,null,null,null,null,null,null,null,null,null,null,null,null,null,null,null,null,null,null,null,null,null,null,null,null,null,null,null,null,null,null,null,null,null,{"$f":"IF((Table_RiskAssessment[[#This Row],[S2]]* Table_RiskAssessment[[#This Row],[F2]]* Table_RiskAssessment[[#This Row],[P2]]>0),IF(Table_RiskAssessment[[#This Row],[S2]]=1,IF(Table_RiskAssessment[[#This Row],[F2]]=1,IF(Table_RiskAssessment[[#This Row],[P2]]=1,\"a\",IF(Table_RiskAssessment[[#This Row],[W2]]=1,\"a\",\"b\")),IF(Table_RiskAssessment[[#This Row],[P2]]=1,IF(Table_RiskAssessment[[#This Row],[W2]]=1,\"a\",\"b\"),IF(Table_RiskAssessment[[#This Row],[W2]]=1,\"b\",\"c\"))),IF(Table_RiskAssessment[[#This Row],[F2]]=1,IF(Table_RiskAssessment[[#This Row],[P2]]=1,IF(Table_RiskAssessment[[#This Row],[W2]]=1,\"b\",\"c\"),IF(Table_RiskAssessment[[#This Row],[W2]]=1,\"c\",\"d\")),IF(Table_RiskAssessment[[#This Row],[P2]]=1,IF(Table_RiskAssessment[[#This Row],[W2]]=1,\"c\",\"d\"),IF(Table_RiskAssessment[[#This Row],[W2]]=1,\"d\",\"e\")))),\"?\")","v":"?"},null,null,null,"-"]
[null,null,null,"2006 / 42","3.2.1.",{"$f":"Language!A$186","v":"Driving position"},"x","","x",null,null,null,null,null,null,null,null,null,null,null,null,null,null,null,null,null,null,null,null,null,null,null,null,null,null,null,null,null,null,null,null,null,null,null,null,null,null,null,null,null,null,null,null,null,{"$f":"IF((Table_RiskAssessment[[#This Row],[S2]]* Table_RiskAssessment[[#This Row],[F2]]* Table_RiskAssessment[[#This Row],[P2]]>0),IF(Table_RiskAssessment[[#This Row],[S2]]=1,IF(Table_RiskAssessment[[#This Row],[F2]]=1,IF(Table_RiskAssessment[[#This Row],[P2]]=1,\"a\",IF(Table_RiskAssessment[[#This Row],[W2]]=1,\"a\",\"b\")),IF(Table_RiskAssessment[[#This Row],[P2]]=1,IF(Table_RiskAssessment[[#This Row],[W2]]=1,\"a\",\"b\"),IF(Table_RiskAssessment[[#This Row],[W2]]=1,\"b\",\"c\"))),IF(Table_RiskAssessment[[#This Row],[F2]]=1,IF(Table_RiskAssessment[[#This Row],[P2]]=1,IF(Table_RiskAssessment[[#This Row],[W2]]=1,\"b\",\"c\"),IF(Table_RiskAssessment[[#This Row],[W2]]=1,\"c\",\"d\")),IF(Table_RiskAssessment[[#This Row],[P2]]=1,IF(Table_RiskAssessment[[#This Row],[W2]]=1,\"c\",\"d\"),IF(Table_RiskAssessment[[#This Row],[W2]]=1,\"d\",\"e\")))),\"?\")","v":"?"},null,null,null,"-"]
[null,null,null,"2006 / 42","3.2.2.",{"$f":"Language!A$187","v":"Seating"},"x","","x",null,null,null,null,null,null,null,null,null,null,null,null,null,null,null,null,null,null,null,null,null,null,null,null,null,null,null,null,null,null,null,null,null,null,null,null,null,null,null,null,null,null,null,null,null,{"$f":"IF((Table_RiskAssessment[[#This Row],[S2]]* Table_RiskAssessment[[#This Row],[F2]]* Table_RiskAssessment[[#This Row],[P2]]>0),IF(Table_RiskAssessment[[#This Row],[S2]]=1,IF(Table_RiskAssessment[[#This Row],[F2]]=1,IF(Table_RiskAssessment[[#This Row],[P2]]=1,\"a\",IF(Table_RiskAssessment[[#This Row],[W2]]=1,\"a\",\"b\")),IF(Table_RiskAssessment[[#This Row],[P2]]=1,IF(Table_RiskAssessment[[#This Row],[W2]]=1,\"a\",\"b\"),IF(Table_RiskAssessment[[#This Row],[W2]]=1,\"b\",\"c\"))),IF(Table_RiskAssessment[[#This Row],[F2]]=1,IF(Table_RiskAssessment[[#This Row],[P2]]=1,IF(Table_RiskAssessment[[#This Row],[W2]]=1,\"b\",\"c\"),IF(Table_RiskAssessment[[#This Row],[W2]]=1,\"c\",\"d\")),IF(Table_RiskAssessment[[#This Row],[P2]]=1,IF(Table_RiskAssessment[[#This Row],[W2]]=1,\"c\",\"d\"),IF(Table_RiskAssessment[[#This Row],[W2]]=1,\"d\",\"e\")))),\"?\")","v":"?"},null,null,null,"-"]
[null,null,null,"2006 / 42","3.2.3.",{"$f":"Language!A$188","v":"Positions for other persons"},"x","","x",null,null,null,null,null,null,null,null,null,null,null,null,null,null,null,null,null,null,null,null,null,null,null,null,null,null,null,null,null,null,null,null,null,null,null,null,null,null,null,null,null,null,null,null,null,{"$f":"IF((Table_RiskAssessment[[#This Row],[S2]]* Table_RiskAssessment[[#This Row],[F2]]* Table_RiskAssessment[[#This Row],[P2]]>0),IF(Table_RiskAssessment[[#This Row],[S2]]=1,IF(Table_RiskAssessment[[#This Row],[F2]]=1,IF(Table_RiskAssessment[[#This Row],[P2]]=1,\"a\",IF(Table_RiskAssessment[[#This Row],[W2]]=1,\"a\",\"b\")),IF(Table_RiskAssessment[[#This Row],[P2]]=1,IF(Table_RiskAssessment[[#This Row],[W2]]=1,\"a\",\"b\"),IF(Table_RiskAssessment[[#This Row],[W2]]=1,\"b\",\"c\"))),IF(Table_RiskAssessment[[#This Row],[F2]]=1,IF(Table_RiskAssessment[[#This Row],[P2]]=1,IF(Table_RiskAssessment[[#This Row],[W2]]=1,\"b\",\"c\"),IF(Table_RiskAssessment[[#This Row],[W2]]=1,\"c\",\"d\")),IF(Table_RiskAssessment[[#This Row],[P2]]=1,IF(Table_RiskAssessment[[#This Row],[W2]]=1,\"c\",\"d\"),IF(Table_RiskAssessment[[#This Row],[W2]]=1,\"d\",\"e\")))),\"?\")","v":"?"},null,null,null,"-"]
[null,null,null,"2006 / 42","3.3.",{"$f":"Language!A$189","v":"Control systems"},"x","x","x",null,null,null,null,null,null,null,null,null,null,null,null,null,null,null,null,null,null,null,null,null,null,null,null,null,null,null,null,null,null,null,null,null,null,null,null,null,null,null,null,null,null,null,null,null,{"$f":"IF((Table_RiskAssessment[[#This Row],[S2]]* Table_RiskAssessment[[#This Row],[F2]]* Table_RiskAssessment[[#This Row],[P2]]>0),IF(Table_RiskAssessment[[#This Row],[S2]]=1,IF(Table_RiskAssessment[[#This Row],[F2]]=1,IF(Table_RiskAssessment[[#This Row],[P2]]=1,\"a\",IF(Table_RiskAssessment[[#This Row],[W2]]=1,\"a\",\"b\")),IF(Table_RiskAssessment[[#This Row],[P2]]=1,IF(Table_RiskAssessment[[#This Row],[W2]]=1,\"a\",\"b\"),IF(Table_RiskAssessment[[#This Row],[W2]]=1,\"b\",\"c\"))),IF(Table_RiskAssessment[[#This Row],[F2]]=1,IF(Table_RiskAssessment[[#This Row],[P2]]=1,IF(Table_RiskAssessment[[#This Row],[W2]]=1,\"b\",\"c\"),IF(Table_RiskAssessment[[#This Row],[W2]]=1,\"c\",\"d\")),IF(Table_RiskAssessment[[#This Row],[P2]]=1,IF(Table_RiskAssessment[[#This Row],[W2]]=1,\"c\",\"d\"),IF(Table_RiskAssessment[[#This Row],[W2]]=1,\"d\",\"e\")))),\"?\")","v":"?"},null,null,null,"-"]
[null,null,null,"2006 / 42","3.3.1.",{"$f":"Language!A$190","v":"Control devices"},"x","","x",null,null,null,null,null,null,null,null,null,null,null,null,null,null,null,null,null,null,null,null,null,null,null,null,null,null,null,null,null,null,null,null,null,null,null,null,null,null,null,null,null,null,null,null,null,{"$f":"IF((Table_RiskAssessment[[#This Row],[S2]]* Table_RiskAssessment[[#This Row],[F2]]* Table_RiskAssessment[[#This Row],[P2]]>0),IF(Table_RiskAssessment[[#This Row],[S2]]=1,IF(Table_RiskAssessment[[#This Row],[F2]]=1,IF(Table_RiskAssessment[[#This Row],[P2]]=1,\"a\",IF(Table_RiskAssessment[[#This Row],[W2]]=1,\"a\",\"b\")),IF(Table_RiskAssessment[[#This Row],[P2]]=1,IF(Table_RiskAssessment[[#This Row],[W2]]=1,\"a\",\"b\"),IF(Table_RiskAssessment[[#This Row],[W2]]=1,\"b\",\"c\"))),IF(Table_RiskAssessment[[#This Row],[F2]]=1,IF(Table_RiskAssessment[[#This Row],[P2]]=1,IF(Table_RiskAssessment[[#This Row],[W2]]=1,\"b\",\"c\"),IF(Table_RiskAssessment[[#This Row],[W2]]=1,\"c\",\"d\")),IF(Table_RiskAssessment[[#This Row],[P2]]=1,IF(Table_RiskAssessment[[#This Row],[W2]]=1,\"c\",\"d\"),IF(Table_RiskAssessment[[#This Row],[W2]]=1,\"d\",\"e\")))),\"?\")","v":"?"},null,null,null,"-"]
[null,null,null,"2006 / 42","3.3.2.",{"$f":"Language!A$191","v":"Starting/moving"},"x","","x",null,null,null,null,null,null,null,null,null,null,null,null,null,null,null,null,null,null,null,null,null,null,null,null,null,null,null,null,null,null,null,null,null,null,null,null,null,null,null,null,null,null,null,null,null,{"$f":"IF((Table_RiskAssessment[[#This Row],[S2]]* Table_RiskAssessment[[#This Row],[F2]]* Table_RiskAssessment[[#This Row],[P2]]>0),IF(Table_RiskAssessment[[#This Row],[S2]]=1,IF(Table_RiskAssessment[[#This Row],[F2]]=1,IF(Table_RiskAssessment[[#This Row],[P2]]=1,\"a\",IF(Table_RiskAssessment[[#This Row],[W2]]=1,\"a\",\"b\")),IF(Table_RiskAssessment[[#This Row],[P2]]=1,IF(Table_RiskAssessment[[#This Row],[W2]]=1,\"a\",\"b\"),IF(Table_RiskAssessment[[#This Row],[W2]]=1,\"b\",\"c\"))),IF(Table_RiskAssessment[[#This Row],[F2]]=1,IF(Table_RiskAssessment[[#This Row],[P2]]=1,IF(Table_RiskAssessment[[#This Row],[W2]]=1,\"b\",\"c\"),IF(Table_RiskAssessment[[#This Row],[W2]]=1,\"c\",\"d\")),IF(Table_RiskAssessment[[#This Row],[P2]]=1,IF(Table_RiskAssessment[[#This Row],[W2]]=1,\"c\",\"d\"),IF(Table_RiskAssessment[[#This Row],[W2]]=1,\"d\",\"e\")))),\"?\")","v":"?"},null,null,null,"-"]
[null,null,null,"2006 / 42","3.3.3.",{"$f":"Language!A$192","v":"Travelling function"},"x","","x",null,null,null,null,null,null,null,null,null,null,null,null,null,null,null,null,null,null,null,null,null,null,null,null,null,null,null,null,null,null,null,null,null,null,null,null,null,null,null,null,null,null,null,null,null,{"$f":"IF((Table_RiskAssessment[[#This Row],[S2]]* Table_RiskAssessment[[#This Row],[F2]]* Table_RiskAssessment[[#This Row],[P2]]>0),IF(Table_RiskAssessment[[#This Row],[S2]]=1,IF(Table_RiskAssessment[[#This Row],[F2]]=1,IF(Table_RiskAssessment[[#This Row],[P2]]=1,\"a\",IF(Table_RiskAssessment[[#This Row],[W2]]=1,\"a\",\"b\")),IF(Table_RiskAssessment[[#This Row],[P2]]=1,IF(Table_RiskAssessment[[#This Row],[W2]]=1,\"a\",\"b\"),IF(Table_RiskAssessment[[#This Row],[W2]]=1,\"b\",\"c\"))),IF(Table_RiskAssessment[[#This Row],[F2]]=1,IF(Table_RiskAssessment[[#This Row],[P2]]=1,IF(Table_RiskAssessment[[#This Row],[W2]]=1,\"b\",\"c\"),IF(Table_RiskAssessment[[#This Row],[W2]]=1,\"c\",\"d\")),IF(Table_RiskAssessment[[#This Row],[P2]]=1,IF(Table_RiskAssessment[[#This Row],[W2]]=1,\"c\",\"d\"),IF(Table_RiskAssessment[[#This Row],[W2]]=1,\"d\",\"e\")))),\"?\")","v":"?"},null,null,null,"-"]
[null,null,null,"2006 / 42","3.3.4.",{"$f":"Language!A$193","v":"Movement of pedestrian-controlled machinery"},"x","","x",null,null,null,null,null,null,null,null,null,null,null,null,null,null,null,null,null,null,null,null,null,null,null,null,null,null,null,null,null,null,null,null,null,null,null,null,null,null,null,null,null,null,null,null,null,{"$f":"IF((Table_RiskAssessment[[#This Row],[S2]]* Table_RiskAssessment[[#This Row],[F2]]* Table_RiskAssessment[[#This Row],[P2]]>0),IF(Table_RiskAssessment[[#This Row],[S2]]=1,IF(Table_RiskAssessment[[#This Row],[F2]]=1,IF(Table_RiskAssessment[[#This Row],[P2]]=1,\"a\",IF(Table_RiskAssessment[[#This Row],[W2]]=1,\"a\",\"b\")),IF(Table_RiskAssessment[[#This Row],[P2]]=1,IF(Table_RiskAssessment[[#This Row],[W2]]=1,\"a\",\"b\"),IF(Table_RiskAssessment[[#This Row],[W2]]=1,\"b\",\"c\"))),IF(Table_RiskAssessment[[#This Row],[F2]]=1,IF(Table_RiskAssessment[[#This Row],[P2]]=1,IF(Table_RiskAssessment[[#This Row],[W2]]=1,\"b\",\"c\"),IF(Table_RiskAssessment[[#This Row],[W2]]=1,\"c\",\"d\")),IF(Table_RiskAssessment[[#This Row],[P2]]=1,IF(Table_RiskAssessment[[#This Row],[W2]]=1,\"c\",\"d\"),IF(Table_RiskAssessment[[#This Row],[W2]]=1,\"d\",\"e\")))),\"?\")","v":"?"},null,null,null,"-"]
[null,null,null,"2006 / 42","3.3.5.",{"$f":"Language!A$194","v":"Control circuit failure"},"x","","x",null,null,null,null,null,null,null,null,null,null,null,null,null,null,null,null,null,null,null,null,null,null,null,null,null,null,null,null,null,null,null,null,null,null,null,null,null,null,null,null,null,null,null,null,null,{"$f":"IF((Table_RiskAssessment[[#This Row],[S2]]* Table_RiskAssessment[[#This Row],[F2]]* Table_RiskAssessment[[#This Row],[P2]]>0),IF(Table_RiskAssessment[[#This Row],[S2]]=1,IF(Table_RiskAssessment[[#This Row],[F2]]=1,IF(Table_RiskAssessment[[#This Row],[P2]]=1,\"a\",IF(Table_RiskAssessment[[#This Row],[W2]]=1,\"a\",\"b\")),IF(Table_RiskAssessment[[#This Row],[P2]]=1,IF(Table_RiskAssessment[[#This Row],[W2]]=1,\"a\",\"b\"),IF(Table_RiskAssessment[[#This Row],[W2]]=1,\"b\",\"c\"))),IF(Table_RiskAssessment[[#This Row],[F2]]=1,IF(Table_RiskAssessment[[#This Row],[P2]]=1,IF(Table_RiskAssessment[[#This Row],[W2]]=1,\"b\",\"c\"),IF(Table_RiskAssessment[[#This Row],[W2]]=1,\"c\",\"d\")),IF(Table_RiskAssessment[[#This Row],[P2]]=1,IF(Table_RiskAssessment[[#This Row],[W2]]=1,\"c\",\"d\"),IF(Table_RiskAssessment[[#This Row],[W2]]=1,\"d\",\"e\")))),\"?\")","v":"?"},null,null,null,"-"]
[null,null,null,"2006 / 42","3.4.",{"$f":"Language!A$195","v":"Protection against mechanical hazards"},"x","x","x",null,null,null,null,null,null,null,null,null,null,null,null,null,null,null,null,null,null,null,null,null,null,null,null,null,null,null,null,null,null,null,null,null,null,null,null,null,null,null,null,null,null,null,null,null,{"$f":"IF((Table_RiskAssessment[[#This Row],[S2]]* Table_RiskAssessment[[#This Row],[F2]]* Table_RiskAssessment[[#This Row],[P2]]>0),IF(Table_RiskAssessment[[#This Row],[S2]]=1,IF(Table_RiskAssessment[[#This Row],[F2]]=1,IF(Table_RiskAssessment[[#This Row],[P2]]=1,\"a\",IF(Table_RiskAssessment[[#This Row],[W2]]=1,\"a\",\"b\")),IF(Table_RiskAssessment[[#This Row],[P2]]=1,IF(Table_RiskAssessment[[#This Row],[W2]]=1,\"a\",\"b\"),IF(Table_RiskAssessment[[#This Row],[W2]]=1,\"b\",\"c\"))),IF(Table_RiskAssessment[[#This Row],[F2]]=1,IF(Table_RiskAssessment[[#This Row],[P2]]=1,IF(Table_RiskAssessment[[#This Row],[W2]]=1,\"b\",\"c\"),IF(Table_RiskAssessment[[#This Row],[W2]]=1,\"c\",\"d\")),IF(Table_RiskAssessment[[#This Row],[P2]]=1,IF(Table_RiskAssessment[[#This Row],[W2]]=1,\"c\",\"d\"),IF(Table_RiskAssessment[[#This Row],[W2]]=1,\"d\",\"e\")))),\"?\")","v":"?"},null,null,null,"-"]
[null,null,null,"2006 / 42","3.4.1.",{"$f":"Language!A$196","v":"Uncontrolled movements"},"x","","x",null,null,null,null,null,null,null,null,null,null,null,null,null,null,null,null,null,null,null,null,null,null,null,null,null,null,null,null,null,null,null,null,null,null,null,null,null,null,null,null,null,null,null,null,null,{"$f":"IF((Table_RiskAssessment[[#This Row],[S2]]* Table_RiskAssessment[[#This Row],[F2]]* Table_RiskAssessment[[#This Row],[P2]]>0),IF(Table_RiskAssessment[[#This Row],[S2]]=1,IF(Table_RiskAssessment[[#This Row],[F2]]=1,IF(Table_RiskAssessment[[#This Row],[P2]]=1,\"a\",IF(Table_RiskAssessment[[#This Row],[W2]]=1,\"a\",\"b\")),IF(Table_RiskAssessment[[#This Row],[P2]]=1,IF(Table_RiskAssessment[[#This Row],[W2]]=1,\"a\",\"b\"),IF(Table_RiskAssessment[[#This Row],[W2]]=1,\"b\",\"c\"))),IF(Table_RiskAssessment[[#This Row],[F2]]=1,IF(Table_RiskAssessment[[#This Row],[P2]]=1,IF(Table_RiskAssessment[[#This Row],[W2]]=1,\"b\",\"c\"),IF(Table_RiskAssessment[[#This Row],[W2]]=1,\"c\",\"d\")),IF(Table_RiskAssessment[[#This Row],[P2]]=1,IF(Table_RiskAssessment[[#This Row],[W2]]=1,\"c\",\"d\"),IF(Table_RiskAssessment[[#This Row],[W2]]=1,\"d\",\"e\")))),\"?\")","v":"?"},null,null,null,"-"]
[null,null,null,"2006 / 42","3.4.2.",{"$f":"Language!A$197","v":"Moving transmission parts"},"x","","x",null,null,null,null,null,null,null,null,null,null,null,null,null,null,null,null,null,null,null,null,null,null,null,null,null,null,null,null,null,null,null,null,null,null,null,null,null,null,null,null,null,null,null,null,null,{"$f":"IF((Table_RiskAssessment[[#This Row],[S2]]* Table_RiskAssessment[[#This Row],[F2]]* Table_RiskAssessment[[#This Row],[P2]]>0),IF(Table_RiskAssessment[[#This Row],[S2]]=1,IF(Table_RiskAssessment[[#This Row],[F2]]=1,IF(Table_RiskAssessment[[#This Row],[P2]]=1,\"a\",IF(Table_RiskAssessment[[#This Row],[W2]]=1,\"a\",\"b\")),IF(Table_RiskAssessment[[#This Row],[P2]]=1,IF(Table_RiskAssessment[[#This Row],[W2]]=1,\"a\",\"b\"),IF(Table_RiskAssessment[[#This Row],[W2]]=1,\"b\",\"c\"))),IF(Table_RiskAssessment[[#This Row],[F2]]=1,IF(Table_RiskAssessment[[#This Row],[P2]]=1,IF(Table_RiskAssessment[[#This Row],[W2]]=1,\"b\",\"c\"),IF(Table_RiskAssessment[[#This Row],[W2]]=1,\"c\",\"d\")),IF(Table_RiskAssessment[[#This Row],[P2]]=1,IF(Table_RiskAssessment[[#This Row],[W2]]=1,\"c\",\"d\"),IF(Table_RiskAssessment[[#This Row],[W2]]=1,\"d\",\"e\")))),\"?\")","v":"?"},null,null,null,"-"]
[null,null,null,"2006 / 42","3.4.3.",{"$f":"Language!A$198","v":"Roll-over and tip-over"},"x","","x",null,null,null,null,null,null,null,null,null,null,null,null,null,null,null,null,null,null,null,null,null,null,null,null,null,null,null,null,null,null,null,null,null,null,null,null,null,null,null,null,null,null,null,null,null,{"$f":"IF((Table_RiskAssessment[[#This Row],[S2]]* Table_RiskAssessment[[#This Row],[F2]]* Table_RiskAssessment[[#This Row],[P2]]>0),IF(Table_RiskAssessment[[#This Row],[S2]]=1,IF(Table_RiskAssessment[[#This Row],[F2]]=1,IF(Table_RiskAssessment[[#This Row],[P2]]=1,\"a\",IF(Table_RiskAssessment[[#This Row],[W2]]=1,\"a\",\"b\")),IF(Table_RiskAssessment[[#This Row],[P2]]=1,IF(Table_RiskAssessment[[#This Row],[W2]]=1,\"a\",\"b\"),IF(Table_RiskAssessment[[#This Row],[W2]]=1,\"b\",\"c\"))),IF(Table_RiskAssessment[[#This Row],[F2]]=1,IF(Table_RiskAssessment[[#This Row],[P2]]=1,IF(Table_RiskAssessment[[#This Row],[W2]]=1,\"b\",\"c\"),IF(Table_RiskAssessment[[#This Row],[W2]]=1,\"c\",\"d\")),IF(Table_RiskAssessment[[#This Row],[P2]]=1,IF(Table_RiskAssessment[[#This Row],[W2]]=1,\"c\",\"d\"),IF(Table_RiskAssessment[[#This Row],[W2]]=1,\"d\",\"e\")))),\"?\")","v":"?"},null,null,null,"-"]
[null,null,null,"2006 / 42","3.4.4.",{"$f":"Language!A$199","v":"Falling objects"},"x","","x",null,null,null,null,null,null,null,null,null,null,null,null,null,null,null,null,null,null,null,null,null,null,null,null,null,null,null,null,null,null,null,null,null,null,null,null,null,null,null,null,null,null,null,null,null,{"$f":"IF((Table_RiskAssessment[[#This Row],[S2]]* Table_RiskAssessment[[#This Row],[F2]]* Table_RiskAssessment[[#This Row],[P2]]>0),IF(Table_RiskAssessment[[#This Row],[S2]]=1,IF(Table_RiskAssessment[[#This Row],[F2]]=1,IF(Table_RiskAssessment[[#This Row],[P2]]=1,\"a\",IF(Table_RiskAssessment[[#This Row],[W2]]=1,\"a\",\"b\")),IF(Table_RiskAssessment[[#This Row],[P2]]=1,IF(Table_RiskAssessment[[#This Row],[W2]]=1,\"a\",\"b\"),IF(Table_RiskAssessment[[#This Row],[W2]]=1,\"b\",\"c\"))),IF(Table_RiskAssessment[[#This Row],[F2]]=1,IF(Table_RiskAssessment[[#This Row],[P2]]=1,IF(Table_RiskAssessment[[#This Row],[W2]]=1,\"b\",\"c\"),IF(Table_RiskAssessment[[#This Row],[W2]]=1,\"c\",\"d\")),IF(Table_RiskAssessment[[#This Row],[P2]]=1,IF(Table_RiskAssessment[[#This Row],[W2]]=1,\"c\",\"d\"),IF(Table_RiskAssessment[[#This Row],[W2]]=1,\"d\",\"e\")))),\"?\")","v":"?"},null,null,null,"-"]
[null,null,null,"2006 / 42","3.4.5.",{"$f":"Language!A$200","v":"Means of access"},"x","","x",null,null,null,null,null,null,null,null,null,null,null,null,null,null,null,null,null,null,null,null,null,null,null,null,null,null,null,null,null,null,null,null,null,null,null,null,null,null,null,null,null,null,null,null,null,{"$f":"IF((Table_RiskAssessment[[#This Row],[S2]]* Table_RiskAssessment[[#This Row],[F2]]* Table_RiskAssessment[[#This Row],[P2]]>0),IF(Table_RiskAssessment[[#This Row],[S2]]=1,IF(Table_RiskAssessment[[#This Row],[F2]]=1,IF(Table_RiskAssessment[[#This Row],[P2]]=1,\"a\",IF(Table_RiskAssessment[[#This Row],[W2]]=1,\"a\",\"b\")),IF(Table_RiskAssessment[[#This Row],[P2]]=1,IF(Table_RiskAssessment[[#This Row],[W2]]=1,\"a\",\"b\"),IF(Table_RiskAssessment[[#This Row],[W2]]=1,\"b\",\"c\"))),IF(Table_RiskAssessment[[#This Row],[F2]]=1,IF(Table_RiskAssessment[[#This Row],[P2]]=1,IF(Table_RiskAssessment[[#This Row],[W2]]=1,\"b\",\"c\"),IF(Table_RiskAssessment[[#This Row],[W2]]=1,\"c\",\"d\")),IF(Table_RiskAssessment[[#This Row],[P2]]=1,IF(Table_RiskAssessment[[#This Row],[W2]]=1,\"c\",\"d\"),IF(Table_RiskAssessment[[#This Row],[W2]]=1,\"d\",\"e\")))),\"?\")","v":"?"},null,null,null,"-"]
[null,null,null,"2006 / 42","3.4.6.",{"$f":"Language!A$201","v":"Towing devices"},"x","","x",null,null,null,null,null,null,null,null,null,null,null,null,null,null,null,null,null,null,null,null,null,null,null,null,null,null,null,null,null,null,null,null,null,null,null,null,null,null,null,null,null,null,null,null,null,{"$f":"IF((Table_RiskAssessment[[#This Row],[S2]]* Table_RiskAssessment[[#This Row],[F2]]* Table_RiskAssessment[[#This Row],[P2]]>0),IF(Table_RiskAssessment[[#This Row],[S2]]=1,IF(Table_RiskAssessment[[#This Row],[F2]]=1,IF(Table_RiskAssessment[[#This Row],[P2]]=1,\"a\",IF(Table_RiskAssessment[[#This Row],[W2]]=1,\"a\",\"b\")),IF(Table_RiskAssessment[[#This Row],[P2]]=1,IF(Table_RiskAssessment[[#This Row],[W2]]=1,\"a\",\"b\"),IF(Table_RiskAssessment[[#This Row],[W2]]=1,\"b\",\"c\"))),IF(Table_RiskAssessment[[#This Row],[F2]]=1,IF(Table_RiskAssessment[[#This Row],[P2]]=1,IF(Table_RiskAssessment[[#This Row],[W2]]=1,\"b\",\"c\"),IF(Table_RiskAssessment[[#This Row],[W2]]=1,\"c\",\"d\")),IF(Table_RiskAssessment[[#This Row],[P2]]=1,IF(Table_RiskAssessment[[#This Row],[W2]]=1,\"c\",\"d\"),IF(Table_RiskAssessment[[#This Row],[W2]]=1,\"d\",\"e\")))),\"?\")","v":"?"},null,null,null,"-"]
[null,null,null,"2006 / 42","3.4.7.",{"$f":"Language!A$202","v":"Transmission of power between self-propelled machinery (or tractor) and recipient machinery"},"x","","x",null,null,null,null,null,null,null,null,null,null,null,null,null,null,null,null,null,null,null,null,null,null,null,null,null,null,null,null,null,null,null,null,null,null,null,null,null,null,null,null,null,null,null,null,null,{"$f":"IF((Table_RiskAssessment[[#This Row],[S2]]* Table_RiskAssessment[[#This Row],[F2]]* Table_RiskAssessment[[#This Row],[P2]]>0),IF(Table_RiskAssessment[[#This Row],[S2]]=1,IF(Table_RiskAssessment[[#This Row],[F2]]=1,IF(Table_RiskAssessment[[#This Row],[P2]]=1,\"a\",IF(Table_RiskAssessment[[#This Row],[W2]]=1,\"a\",\"b\")),IF(Table_RiskAssessment[[#This Row],[P2]]=1,IF(Table_RiskAssessment[[#This Row],[W2]]=1,\"a\",\"b\"),IF(Table_RiskAssessment[[#This Row],[W2]]=1,\"b\",\"c\"))),IF(Table_RiskAssessment[[#This Row],[F2]]=1,IF(Table_RiskAssessment[[#This Row],[P2]]=1,IF(Table_RiskAssessment[[#This Row],[W2]]=1,\"b\",\"c\"),IF(Table_RiskAssessment[[#This Row],[W2]]=1,\"c\",\"d\")),IF(Table_RiskAssessment[[#This Row],[P2]]=1,IF(Table_RiskAssessment[[#This Row],[W2]]=1,\"c\",\"d\"),IF(Table_RiskAssessment[[#This Row],[W2]]=1,\"d\",\"e\")))),\"?\")","v":"?"},null,null,null,"-"]
[null,null,null,"2006 / 42","3.5.",{"$f":"Language!A$203","v":"Protection against other hazards"},"x","x","x",null,null,null,null,null,null,null,null,null,null,null,null,null,null,null,null,null,null,null,null,null,null,null,null,null,null,null,null,null,null,null,null,null,null,null,null,null,null,null,null,null,null,null,null,null,{"$f":"IF((Table_RiskAssessment[[#This Row],[S2]]* Table_RiskAssessment[[#This Row],[F2]]* Table_RiskAssessment[[#This Row],[P2]]>0),IF(Table_RiskAssessment[[#This Row],[S2]]=1,IF(Table_RiskAssessment[[#This Row],[F2]]=1,IF(Table_RiskAssessment[[#This Row],[P2]]=1,\"a\",IF(Table_RiskAssessment[[#This Row],[W2]]=1,\"a\",\"b\")),IF(Table_RiskAssessment[[#This Row],[P2]]=1,IF(Table_RiskAssessment[[#This Row],[W2]]=1,\"a\",\"b\"),IF(Table_RiskAssessment[[#This Row],[W2]]=1,\"b\",\"c\"))),IF(Table_RiskAssessment[[#This Row],[F2]]=1,IF(Table_RiskAssessment[[#This Row],[P2]]=1,IF(Table_RiskAssessment[[#This Row],[W2]]=1,\"b\",\"c\"),IF(Table_RiskAssessment[[#This Row],[W2]]=1,\"c\",\"d\")),IF(Table_RiskAssessment[[#This Row],[P2]]=1,IF(Table_RiskAssessment[[#This Row],[W2]]=1,\"c\",\"d\"),IF(Table_RiskAssessment[[#This Row],[W2]]=1,\"d\",\"e\")))),\"?\")","v":"?"},null,null,null,"-"]
[null,null,null,"2006 / 42","3.5.1.",{"$f":"Language!A$204","v":"Batteries"},"x","","x",null,null,null,null,null,null,null,null,null,null,null,null,null,null,null,null,null,null,null,null,null,null,null,null,null,null,null,null,null,null,null,null,null,null,null,null,null,null,null,null,null,null,null,null,null,{"$f":"IF((Table_RiskAssessment[[#This Row],[S2]]* Table_RiskAssessment[[#This Row],[F2]]* Table_RiskAssessment[[#This Row],[P2]]>0),IF(Table_RiskAssessment[[#This Row],[S2]]=1,IF(Table_RiskAssessment[[#This Row],[F2]]=1,IF(Table_RiskAssessment[[#This Row],[P2]]=1,\"a\",IF(Table_RiskAssessment[[#This Row],[W2]]=1,\"a\",\"b\")),IF(Table_RiskAssessment[[#This Row],[P2]]=1,IF(Table_RiskAssessment[[#This Row],[W2]]=1,\"a\",\"b\"),IF(Table_RiskAssessment[[#This Row],[W2]]=1,\"b\",\"c\"))),IF(Table_RiskAssessment[[#This Row],[F2]]=1,IF(Table_RiskAssessment[[#This Row],[P2]]=1,IF(Table_RiskAssessment[[#This Row],[W2]]=1,\"b\",\"c\"),IF(Table_RiskAssessment[[#This Row],[W2]]=1,\"c\",\"d\")),IF(Table_RiskAssessment[[#This Row],[P2]]=1,IF(Table_RiskAssessment[[#This Row],[W2]]=1,\"c\",\"d\"),IF(Table_RiskAssessment[[#This Row],[W2]]=1,\"d\",\"e\")))),\"?\")","v":"?"},null,null,null,"-"]
[null,null,null,"2006 / 42","3.5.2.",{"$f":"Language!A$205","v":"Fire"},"x","","x",null,null,null,null,null,null,null,null,null,null,null,null,null,null,null,null,null,null,null,null,null,null,null,null,null,null,null,null,null,null,null,null,null,null,null,null,null,null,null,null,null,null,null,null,null,{"$f":"IF((Table_RiskAssessment[[#This Row],[S2]]* Table_RiskAssessment[[#This Row],[F2]]* Table_RiskAssessment[[#This Row],[P2]]>0),IF(Table_RiskAssessment[[#This Row],[S2]]=1,IF(Table_RiskAssessment[[#This Row],[F2]]=1,IF(Table_RiskAssessment[[#This Row],[P2]]=1,\"a\",IF(Table_RiskAssessment[[#This Row],[W2]]=1,\"a\",\"b\")),IF(Table_RiskAssessment[[#This Row],[P2]]=1,IF(Table_RiskAssessment[[#This Row],[W2]]=1,\"a\",\"b\"),IF(Table_RiskAssessment[[#This Row],[W2]]=1,\"b\",\"c\"))),IF(Table_RiskAssessment[[#This Row],[F2]]=1,IF(Table_RiskAssessment[[#This Row],[P2]]=1,IF(Table_RiskAssessment[[#This Row],[W2]]=1,\"b\",\"c\"),IF(Table_RiskAssessment[[#This Row],[W2]]=1,\"c\",\"d\")),IF(Table_RiskAssessment[[#This Row],[P2]]=1,IF(Table_RiskAssessment[[#This Row],[W2]]=1,\"c\",\"d\"),IF(Table_RiskAssessment[[#This Row],[W2]]=1,\"d\",\"e\")))),\"?\")","v":"?"},null,null,null,"-"]
[null,null,null,"2006 / 42","3.5.3.",{"$f":"Language!A$206","v":"Emissions of hazardous substances"},"x","","x",null,null,null,null,null,null,null,null,null,null,null,null,null,null,null,null,null,null,null,null,null,null,null,null,null,null,null,null,null,null,null,null,null,null,null,null,null,null,null,null,null,null,null,null,null,{"$f":"IF((Table_RiskAssessment[[#This Row],[S2]]* Table_RiskAssessment[[#This Row],[F2]]* Table_RiskAssessment[[#This Row],[P2]]>0),IF(Table_RiskAssessment[[#This Row],[S2]]=1,IF(Table_RiskAssessment[[#This Row],[F2]]=1,IF(Table_RiskAssessment[[#This Row],[P2]]=1,\"a\",IF(Table_RiskAssessment[[#This Row],[W2]]=1,\"a\",\"b\")),IF(Table_RiskAssessment[[#This Row],[P2]]=1,IF(Table_RiskAssessment[[#This Row],[W2]]=1,\"a\",\"b\"),IF(Table_RiskAssessment[[#This Row],[W2]]=1,\"b\",\"c\"))),IF(Table_RiskAssessment[[#This Row],[F2]]=1,IF(Table_RiskAssessment[[#This Row],[P2]]=1,IF(Table_RiskAssessment[[#This Row],[W2]]=1,\"b\",\"c\"),IF(Table_RiskAssessment[[#This Row],[W2]]=1,\"c\",\"d\")),IF(Table_RiskAssessment[[#This Row],[P2]]=1,IF(Table_RiskAssessment[[#This Row],[W2]]=1,\"c\",\"d\"),IF(Table_RiskAssessment[[#This Row],[W2]]=1,\"d\",\"e\")))),\"?\")","v":"?"},null,null,null,"-"]
[null,null,null,"2006 / 42","3.6.",{"$f":"Language!A$207","v":"Information and indications"},"x","x","x",null,null,null,null,null,null,null,null,null,null,null,null,null,null,null,null,null,null,null,null,null,null,null,null,null,null,null,null,null,null,null,null,null,null,null,null,null,null,null,null,null,null,null,null,null,{"$f":"IF((Table_RiskAssessment[[#This Row],[S2]]* Table_RiskAssessment[[#This Row],[F2]]* Table_RiskAssessment[[#This Row],[P2]]>0),IF(Table_RiskAssessment[[#This Row],[S2]]=1,IF(Table_RiskAssessment[[#This Row],[F2]]=1,IF(Table_RiskAssessment[[#This Row],[P2]]=1,\"a\",IF(Table_RiskAssessment[[#This Row],[W2]]=1,\"a\",\"b\")),IF(Table_RiskAssessment[[#This Row],[P2]]=1,IF(Table_RiskAssessment[[#This Row],[W2]]=1,\"a\",\"b\"),IF(Table_RiskAssessment[[#This Row],[W2]]=1,\"b\",\"c\"))),IF(Table_RiskAssessment[[#This Row],[F2]]=1,IF(Table_RiskAssessment[[#This Row],[P2]]=1,IF(Table_RiskAssessment[[#This Row],[W2]]=1,\"b\",\"c\"),IF(Table_RiskAssessment[[#This Row],[W2]]=1,\"c\",\"d\")),IF(Table_RiskAssessment[[#This Row],[P2]]=1,IF(Table_RiskAssessment[[#This Row],[W2]]=1,\"c\",\"d\"),IF(Table_RiskAssessment[[#This Row],[W2]]=1,\"d\",\"e\")))),\"?\")","v":"?"},null,null,null,"-"]
[null,null,null,"2006 / 42","3.6.1.",{"$f":"Language!A$208","v":"Signs, signals and warnings"},"x","","x",null,null,null,null,null,null,null,null,null,null,null,null,null,null,null,null,null,null,null,null,null,null,null,null,null,null,null,null,null,null,null,null,null,null,null,null,null,null,null,null,null,null,null,null,null,{"$f":"IF((Table_RiskAssessment[[#This Row],[S2]]* Table_RiskAssessment[[#This Row],[F2]]* Table_RiskAssessment[[#This Row],[P2]]>0),IF(Table_RiskAssessment[[#This Row],[S2]]=1,IF(Table_RiskAssessment[[#This Row],[F2]]=1,IF(Table_RiskAssessment[[#This Row],[P2]]=1,\"a\",IF(Table_RiskAssessment[[#This Row],[W2]]=1,\"a\",\"b\")),IF(Table_RiskAssessment[[#This Row],[P2]]=1,IF(Table_RiskAssessment[[#This Row],[W2]]=1,\"a\",\"b\"),IF(Table_RiskAssessment[[#This Row],[W2]]=1,\"b\",\"c\"))),IF(Table_RiskAssessment[[#This Row],[F2]]=1,IF(Table_RiskAssessment[[#This Row],[P2]]=1,IF(Table_RiskAssessment[[#This Row],[W2]]=1,\"b\",\"c\"),IF(Table_RiskAssessment[[#This Row],[W2]]=1,\"c\",\"d\")),IF(Table_RiskAssessment[[#This Row],[P2]]=1,IF(Table_RiskAssessment[[#This Row],[W2]]=1,\"c\",\"d\"),IF(Table_RiskAssessment[[#This Row],[W2]]=1,\"d\",\"e\")))),\"?\")","v":"?"},null,null,null,"-"]
[null,null,null,"2006 / 42","3.6.2.",{"$f":"Language!A$209","v":"Marking"},"x","","x",null,null,null,null,null,null,null,null,null,null,null,null,null,null,null,null,null,null,null,null,null,null,null,null,null,null,null,null,null,null,null,null,null,null,null,null,null,null,null,null,null,null,null,null,null,{"$f":"IF((Table_RiskAssessment[[#This Row],[S2]]* Table_RiskAssessment[[#This Row],[F2]]* Table_RiskAssessment[[#This Row],[P2]]>0),IF(Table_RiskAssessment[[#This Row],[S2]]=1,IF(Table_RiskAssessment[[#This Row],[F2]]=1,IF(Table_RiskAssessment[[#This Row],[P2]]=1,\"a\",IF(Table_RiskAssessment[[#This Row],[W2]]=1,\"a\",\"b\")),IF(Table_RiskAssessment[[#This Row],[P2]]=1,IF(Table_RiskAssessment[[#This Row],[W2]]=1,\"a\",\"b\"),IF(Table_RiskAssessment[[#This Row],[W2]]=1,\"b\",\"c\"))),IF(Table_RiskAssessment[[#This Row],[F2]]=1,IF(Table_RiskAssessment[[#This Row],[P2]]=1,IF(Table_RiskAssessment[[#This Row],[W2]]=1,\"b\",\"c\"),IF(Table_RiskAssessment[[#This Row],[W2]]=1,\"c\",\"d\")),IF(Table_RiskAssessment[[#This Row],[P2]]=1,IF(Table_RiskAssessment[[#This Row],[W2]]=1,\"c\",\"d\"),IF(Table_RiskAssessment[[#This Row],[W2]]=1,\"d\",\"e\")))),\"?\")","v":"?"},null,null,null,"-"]
[null,null,null,"2006 / 42","3.6.3.",{"$f":"Language!A$210","v":"Instructions"},"x","x","x",null,null,null,null,null,null,null,null,null,null,null,null,null,null,null,null,null,null,null,null,null,null,null,null,null,null,null,null,null,null,null,null,null,null,null,null,null,null,null,null,null,null,null,null,null,{"$f":"IF((Table_RiskAssessment[[#This Row],[S2]]* Table_RiskAssessment[[#This Row],[F2]]* Table_RiskAssessment[[#This Row],[P2]]>0),IF(Table_RiskAssessment[[#This Row],[S2]]=1,IF(Table_RiskAssessment[[#This Row],[F2]]=1,IF(Table_RiskAssessment[[#This Row],[P2]]=1,\"a\",IF(Table_RiskAssessment[[#This Row],[W2]]=1,\"a\",\"b\")),IF(Table_RiskAssessment[[#This Row],[P2]]=1,IF(Table_RiskAssessment[[#This Row],[W2]]=1,\"a\",\"b\"),IF(Table_RiskAssessment[[#This Row],[W2]]=1,\"b\",\"c\"))),IF(Table_RiskAssessment[[#This Row],[F2]]=1,IF(Table_RiskAssessment[[#This Row],[P2]]=1,IF(Table_RiskAssessment[[#This Row],[W2]]=1,\"b\",\"c\"),IF(Table_RiskAssessment[[#This Row],[W2]]=1,\"c\",\"d\")),IF(Table_RiskAssessment[[#This Row],[P2]]=1,IF(Table_RiskAssessment[[#This Row],[W2]]=1,\"c\",\"d\"),IF(Table_RiskAssessment[[#This Row],[W2]]=1,\"d\",\"e\")))),\"?\")","v":"?"},null,null,null,"-"]
[null,null,null,"2006 / 42","3.6.3.1.",{"$f":"Language!A$211","v":"Vibrations"},"x","","x",null,null,null,null,null,null,null,null,null,null,null,null,null,null,null,null,null,null,null,null,null,null,null,null,null,null,null,null,null,null,null,null,null,null,null,null,null,null,null,null,null,null,null,null,null,{"$f":"IF((Table_RiskAssessment[[#This Row],[S2]]* Table_RiskAssessment[[#This Row],[F2]]* Table_RiskAssessment[[#This Row],[P2]]>0),IF(Table_RiskAssessment[[#This Row],[S2]]=1,IF(Table_RiskAssessment[[#This Row],[F2]]=1,IF(Table_RiskAssessment[[#This Row],[P2]]=1,\"a\",IF(Table_RiskAssessment[[#This Row],[W2]]=1,\"a\",\"b\")),IF(Table_RiskAssessment[[#This Row],[P2]]=1,IF(Table_RiskAssessment[[#This Row],[W2]]=1,\"a\",\"b\"),IF(Table_RiskAssessment[[#This Row],[W2]]=1,\"b\",\"c\"))),IF(Table_RiskAssessment[[#This Row],[F2]]=1,IF(Table_RiskAssessment[[#This Row],[P2]]=1,IF(Table_RiskAssessment[[#This Row],[W2]]=1,\"b\",\"c\"),IF(Table_RiskAssessment[[#This Row],[W2]]=1,\"c\",\"d\")),IF(Table_RiskAssessment[[#This Row],[P2]]=1,IF(Table_RiskAssessment[[#This Row],[W2]]=1,\"c\",\"d\"),IF(Table_RiskAssessment[[#This Row],[W2]]=1,\"d\",\"e\")))),\"?\")","v":"?"},null,null,null,"-"]
[null,null,null,"2006 / 42","3.6.3.2.",{"$f":"Language!A$212","v":"Multiple uses"},"x","","x",null,null,null,null,null,null,null,null,null,null,null,null,null,null,null,null,null,null,null,null,null,null,null,null,null,null,null,null,null,null,null,null,null,null,null,null,null,null,null,null,null,null,null,null,null,{"$f":"IF((Table_RiskAssessment[[#This Row],[S2]]* Table_RiskAssessment[[#This Row],[F2]]* Table_RiskAssessment[[#This Row],[P2]]>0),IF(Table_RiskAssessment[[#This Row],[S2]]=1,IF(Table_RiskAssessment[[#This Row],[F2]]=1,IF(Table_RiskAssessment[[#This Row],[P2]]=1,\"a\",IF(Table_RiskAssessment[[#This Row],[W2]]=1,\"a\",\"b\")),IF(Table_RiskAssessment[[#This Row],[P2]]=1,IF(Table_RiskAssessment[[#This Row],[W2]]=1,\"a\",\"b\"),IF(Table_RiskAssessment[[#This Row],[W2]]=1,\"b\",\"c\"))),IF(Table_RiskAssessment[[#This Row],[F2]]=1,IF(Table_RiskAssessment[[#This Row],[P2]]=1,IF(Table_RiskAssessment[[#This Row],[W2]]=1,\"b\",\"c\"),IF(Table_RiskAssessment[[#This Row],[W2]]=1,\"c\",\"d\")),IF(Table_RiskAssessment[[#This Row],[P2]]=1,IF(Table_RiskAssessment[[#This Row],[W2]]=1,\"c\",\"d\"),IF(Table_RiskAssessment[[#This Row],[W2]]=1,\"d\",\"e\")))),\"?\")","v":"?"},null,null,null,"-"]
[null,null,null,"2006 / 42","4.",{"$f":"Language!A$213","v":"Supplementary essential health and safety requirements to offset hazards due to lifting operations"},"x","x","x",null,null,null,null,null,null,null,null,null,null,null,null,null,null,null,null,null,null,null,null,null,null,null,null,null,null,null,null,null,null,null,null,null,null,null,null,null,null,null,null,null,null,null,null,null,{"$f":"IF((Table_RiskAssessment[[#This Row],[S2]]* Table_RiskAssessment[[#This Row],[F2]]* Table_RiskAssessment[[#This Row],[P2]]>0),IF(Table_RiskAssessment[[#This Row],[S2]]=1,IF(Table_RiskAssessment[[#This Row],[F2]]=1,IF(Table_RiskAssessment[[#This Row],[P2]]=1,\"a\",IF(Table_RiskAssessment[[#This Row],[W2]]=1,\"a\",\"b\")),IF(Table_RiskAssessment[[#This Row],[P2]]=1,IF(Table_RiskAssessment[[#This Row],[W2]]=1,\"a\",\"b\"),IF(Table_RiskAssessment[[#This Row],[W2]]=1,\"b\",\"c\"))),IF(Table_RiskAssessment[[#This Row],[F2]]=1,IF(Table_RiskAssessment[[#This Row],[P2]]=1,IF(Table_RiskAssessment[[#This Row],[W2]]=1,\"b\",\"c\"),IF(Table_RiskAssessment[[#This Row],[W2]]=1,\"c\",\"d\")),IF(Table_RiskAssessment[[#This Row],[P2]]=1,IF(Table_RiskAssessment[[#This Row],[W2]]=1,\"c\",\"d\"),IF(Table_RiskAssessment[[#This Row],[W2]]=1,\"d\",\"e\")))),\"?\")","v":"?"},null,null,null,"-"]
[null,null,null,"2006 / 42","4.1.",{"$f":"Language!A$214","v":"General"},"x","x","x",null,null,null,null,null,null,null,null,null,null,null,null,null,null,null,null,null,null,null,null,null,null,null,null,null,null,null,null,null,null,null,null,null,null,null,null,null,null,null,null,null,null,null,null,null,{"$f":"IF((Table_RiskAssessment[[#This Row],[S2]]* Table_RiskAssessment[[#This Row],[F2]]* Table_RiskAssessment[[#This Row],[P2]]>0),IF(Table_RiskAssessment[[#This Row],[S2]]=1,IF(Table_RiskAssessment[[#This Row],[F2]]=1,IF(Table_RiskAssessment[[#This Row],[P2]]=1,\"a\",IF(Table_RiskAssessment[[#This Row],[W2]]=1,\"a\",\"b\")),IF(Table_RiskAssessment[[#This Row],[P2]]=1,IF(Table_RiskAssessment[[#This Row],[W2]]=1,\"a\",\"b\"),IF(Table_RiskAssessment[[#This Row],[W2]]=1,\"b\",\"c\"))),IF(Table_RiskAssessment[[#This Row],[F2]]=1,IF(Table_RiskAssessment[[#This Row],[P2]]=1,IF(Table_RiskAssessment[[#This Row],[W2]]=1,\"b\",\"c\"),IF(Table_RiskAssessment[[#This Row],[W2]]=1,\"c\",\"d\")),IF(Table_RiskAssessment[[#This Row],[P2]]=1,IF(Table_RiskAssessment[[#This Row],[W2]]=1,\"c\",\"d\"),IF(Table_RiskAssessment[[#This Row],[W2]]=1,\"d\",\"e\")))),\"?\")","v":"?"},null,null,null,"-"]
[null,null,null,"2006 / 42","4.1.1.",{"$f":"Language!A$215","v":"Definitions"},"x","","x",null,null,null,null,null,null,null,null,null,null,null,null,null,null,null,null,null,null,null,null,null,null,null,null,null,null,null,null,null,null,null,null,null,null,null,null,null,null,null,null,null,null,null,null,null,{"$f":"IF((Table_RiskAssessment[[#This Row],[S2]]* Table_RiskAssessment[[#This Row],[F2]]* Table_RiskAssessment[[#This Row],[P2]]>0),IF(Table_RiskAssessment[[#This Row],[S2]]=1,IF(Table_RiskAssessment[[#This Row],[F2]]=1,IF(Table_RiskAssessment[[#This Row],[P2]]=1,\"a\",IF(Table_RiskAssessment[[#This Row],[W2]]=1,\"a\",\"b\")),IF(Table_RiskAssessment[[#This Row],[P2]]=1,IF(Table_RiskAssessment[[#This Row],[W2]]=1,\"a\",\"b\"),IF(Table_RiskAssessment[[#This Row],[W2]]=1,\"b\",\"c\"))),IF(Table_RiskAssessment[[#This Row],[F2]]=1,IF(Table_RiskAssessment[[#This Row],[P2]]=1,IF(Table_RiskAssessment[[#This Row],[W2]]=1,\"b\",\"c\"),IF(Table_RiskAssessment[[#This Row],[W2]]=1,\"c\",\"d\")),IF(Table_RiskAssessment[[#This Row],[P2]]=1,IF(Table_RiskAssessment[[#This Row],[W2]]=1,\"c\",\"d\"),IF(Table_RiskAssessment[[#This Row],[W2]]=1,\"d\",\"e\")))),\"?\")","v":"?"},null,null,null,"-"]
[null,null,null,"2006 / 42","4.1.2.",{"$f":"Language!A$216","v":"Protection against mechanical hazards"},"x","x","x",null,null,null,null,null,null,null,null,null,null,null,null,null,null,null,null,null,null,null,null,null,null,null,null,null,null,null,null,null,null,null,null,null,null,null,null,null,null,null,null,null,null,null,null,null,{"$f":"IF((Table_RiskAssessment[[#This Row],[S2]]* Table_RiskAssessment[[#This Row],[F2]]* Table_RiskAssessment[[#This Row],[P2]]>0),IF(Table_RiskAssessment[[#This Row],[S2]]=1,IF(Table_RiskAssessment[[#This Row],[F2]]=1,IF(Table_RiskAssessment[[#This Row],[P2]]=1,\"a\",IF(Table_RiskAssessment[[#This Row],[W2]]=1,\"a\",\"b\")),IF(Table_RiskAssessment[[#This Row],[P2]]=1,IF(Table_RiskAssessment[[#This Row],[W2]]=1,\"a\",\"b\"),IF(Table_RiskAssessment[[#This Row],[W2]]=1,\"b\",\"c\"))),IF(Table_RiskAssessment[[#This Row],[F2]]=1,IF(Table_RiskAssessment[[#This Row],[P2]]=1,IF(Table_RiskAssessment[[#This Row],[W2]]=1,\"b\",\"c\"),IF(Table_RiskAssessment[[#This Row],[W2]]=1,\"c\",\"d\")),IF(Table_RiskAssessment[[#This Row],[P2]]=1,IF(Table_RiskAssessment[[#This Row],[W2]]=1,\"c\",\"d\"),IF(Table_RiskAssessment[[#This Row],[W2]]=1,\"d\",\"e\")))),\"?\")","v":"?"},null,null,null,"-"]
[null,null,null,"2006 / 42","4.1.2.1.",{"$f":"Language!A$217","v":"Risks due to lack of stability"},"x","","x",null,null,null,null,null,null,null,null,null,null,null,null,null,null,null,null,null,null,null,null,null,null,null,null,null,null,null,null,null,null,null,null,null,null,null,null,null,null,null,null,null,null,null,null,null,{"$f":"IF((Table_RiskAssessment[[#This Row],[S2]]* Table_RiskAssessment[[#This Row],[F2]]* Table_RiskAssessment[[#This Row],[P2]]>0),IF(Table_RiskAssessment[[#This Row],[S2]]=1,IF(Table_RiskAssessment[[#This Row],[F2]]=1,IF(Table_RiskAssessment[[#This Row],[P2]]=1,\"a\",IF(Table_RiskAssessment[[#This Row],[W2]]=1,\"a\",\"b\")),IF(Table_RiskAssessment[[#This Row],[P2]]=1,IF(Table_RiskAssessment[[#This Row],[W2]]=1,\"a\",\"b\"),IF(Table_RiskAssessment[[#This Row],[W2]]=1,\"b\",\"c\"))),IF(Table_RiskAssessment[[#This Row],[F2]]=1,IF(Table_RiskAssessment[[#This Row],[P2]]=1,IF(Table_RiskAssessment[[#This Row],[W2]]=1,\"b\",\"c\"),IF(Table_RiskAssessment[[#This Row],[W2]]=1,\"c\",\"d\")),IF(Table_RiskAssessment[[#This Row],[P2]]=1,IF(Table_RiskAssessment[[#This Row],[W2]]=1,\"c\",\"d\"),IF(Table_RiskAssessment[[#This Row],[W2]]=1,\"d\",\"e\")))),\"?\")","v":"?"},null,null,null,"-"]
[null,null,null,"2006 / 42","4.1.2.2.",{"$f":"Language!A$218","v":"Machinery running on guide rails and rail tracks"},"x","","x",null,null,null,null,null,null,null,null,null,null,null,null,null,null,null,null,null,null,null,null,null,null,null,null,null,null,null,null,null,null,null,null,null,null,null,null,null,null,null,null,null,null,null,null,null,{"$f":"IF((Table_RiskAssessment[[#This Row],[S2]]* Table_RiskAssessment[[#This Row],[F2]]* Table_RiskAssessment[[#This Row],[P2]]>0),IF(Table_RiskAssessment[[#This Row],[S2]]=1,IF(Table_RiskAssessment[[#This Row],[F2]]=1,IF(Table_RiskAssessment[[#This Row],[P2]]=1,\"a\",IF(Table_RiskAssessment[[#This Row],[W2]]=1,\"a\",\"b\")),IF(Table_RiskAssessment[[#This Row],[P2]]=1,IF(Table_RiskAssessment[[#This Row],[W2]]=1,\"a\",\"b\"),IF(Table_RiskAssessment[[#This Row],[W2]]=1,\"b\",\"c\"))),IF(Table_RiskAssessment[[#This Row],[F2]]=1,IF(Table_RiskAssessment[[#This Row],[P2]]=1,IF(Table_RiskAssessment[[#This Row],[W2]]=1,\"b\",\"c\"),IF(Table_RiskAssessment[[#This Row],[W2]]=1,\"c\",\"d\")),IF(Table_RiskAssessment[[#This Row],[P2]]=1,IF(Table_RiskAssessment[[#This Row],[W2]]=1,\"c\",\"d\"),IF(Table_RiskAssessment[[#This Row],[W2]]=1,\"d\",\"e\")))),\"?\")","v":"?"},null,null,null,"-"]
[null,null,null,"2006 / 42","4.1.2.3.",{"$f":"Language!A$219","v":"Mechanical strength"},"x","","x",null,null,null,null,null,null,null,null,null,null,null,null,null,null,null,null,null,null,null,null,null,null,null,null,null,null,null,null,null,null,null,null,null,null,null,null,null,null,null,null,null,null,null,null,null,{"$f":"IF((Table_RiskAssessment[[#This Row],[S2]]* Table_RiskAssessment[[#This Row],[F2]]* Table_RiskAssessment[[#This Row],[P2]]>0),IF(Table_RiskAssessment[[#This Row],[S2]]=1,IF(Table_RiskAssessment[[#This Row],[F2]]=1,IF(Table_RiskAssessment[[#This Row],[P2]]=1,\"a\",IF(Table_RiskAssessment[[#This Row],[W2]]=1,\"a\",\"b\")),IF(Table_RiskAssessment[[#This Row],[P2]]=1,IF(Table_RiskAssessment[[#This Row],[W2]]=1,\"a\",\"b\"),IF(Table_RiskAssessment[[#This Row],[W2]]=1,\"b\",\"c\"))),IF(Table_RiskAssessment[[#This Row],[F2]]=1,IF(Table_RiskAssessment[[#This Row],[P2]]=1,IF(Table_RiskAssessment[[#This Row],[W2]]=1,\"b\",\"c\"),IF(Table_RiskAssessment[[#This Row],[W2]]=1,\"c\",\"d\")),IF(Table_RiskAssessment[[#This Row],[P2]]=1,IF(Table_RiskAssessment[[#This Row],[W2]]=1,\"c\",\"d\"),IF(Table_RiskAssessment[[#This Row],[W2]]=1,\"d\",\"e\")))),\"?\")","v":"?"},null,null,null,"-"]
[null,null,null,"2006 / 42","4.1.2.4.",{"$f":"Language!A$220","v":"Pulleys, drums, wheels, ropes and chains"},"x","","x",null,null,null,null,null,null,null,null,null,null,null,null,null,null,null,null,null,null,null,null,null,null,null,null,null,null,null,null,null,null,null,null,null,null,null,null,null,null,null,null,null,null,null,null,null,{"$f":"IF((Table_RiskAssessment[[#This Row],[S2]]* Table_RiskAssessment[[#This Row],[F2]]* Table_RiskAssessment[[#This Row],[P2]]>0),IF(Table_RiskAssessment[[#This Row],[S2]]=1,IF(Table_RiskAssessment[[#This Row],[F2]]=1,IF(Table_RiskAssessment[[#This Row],[P2]]=1,\"a\",IF(Table_RiskAssessment[[#This Row],[W2]]=1,\"a\",\"b\")),IF(Table_RiskAssessment[[#This Row],[P2]]=1,IF(Table_RiskAssessment[[#This Row],[W2]]=1,\"a\",\"b\"),IF(Table_RiskAssessment[[#This Row],[W2]]=1,\"b\",\"c\"))),IF(Table_RiskAssessment[[#This Row],[F2]]=1,IF(Table_RiskAssessment[[#This Row],[P2]]=1,IF(Table_RiskAssessment[[#This Row],[W2]]=1,\"b\",\"c\"),IF(Table_RiskAssessment[[#This Row],[W2]]=1,\"c\",\"d\")),IF(Table_RiskAssessment[[#This Row],[P2]]=1,IF(Table_RiskAssessment[[#This Row],[W2]]=1,\"c\",\"d\"),IF(Table_RiskAssessment[[#This Row],[W2]]=1,\"d\",\"e\")))),\"?\")","v":"?"},null,null,null,"-"]
[null,null,null,"2006 / 42","4.1.2.5.",{"$f":"Language!A$221","v":"Lifting accessories and their components"},"x","","x",null,null,null,null,null,null,null,null,null,null,null,null,null,null,null,null,null,null,null,null,null,null,null,null,null,null,null,null,null,null,null,null,null,null,null,null,null,null,null,null,null,null,null,null,null,{"$f":"IF((Table_RiskAssessment[[#This Row],[S2]]* Table_RiskAssessment[[#This Row],[F2]]* Table_RiskAssessment[[#This Row],[P2]]>0),IF(Table_RiskAssessment[[#This Row],[S2]]=1,IF(Table_RiskAssessment[[#This Row],[F2]]=1,IF(Table_RiskAssessment[[#This Row],[P2]]=1,\"a\",IF(Table_RiskAssessment[[#This Row],[W2]]=1,\"a\",\"b\")),IF(Table_RiskAssessment[[#This Row],[P2]]=1,IF(Table_RiskAssessment[[#This Row],[W2]]=1,\"a\",\"b\"),IF(Table_RiskAssessment[[#This Row],[W2]]=1,\"b\",\"c\"))),IF(Table_RiskAssessment[[#This Row],[F2]]=1,IF(Table_RiskAssessment[[#This Row],[P2]]=1,IF(Table_RiskAssessment[[#This Row],[W2]]=1,\"b\",\"c\"),IF(Table_RiskAssessment[[#This Row],[W2]]=1,\"c\",\"d\")),IF(Table_RiskAssessment[[#This Row],[P2]]=1,IF(Table_RiskAssessment[[#This Row],[W2]]=1,\"c\",\"d\"),IF(Table_RiskAssessment[[#This Row],[W2]]=1,\"d\",\"e\")))),\"?\")","v":"?"},null,null,null,"-"]
[null,null,null,"2006 / 42","4.1.2.6.",{"$f":"Language!A$222","v":"Control of movements"},"x","","x",null,null,null,null,null,null,null,null,null,null,null,null,null,null,null,null,null,null,null,null,null,null,null,null,null,null,null,null,null,null,null,null,null,null,null,null,null,null,null,null,null,null,null,null,null,{"$f":"IF((Table_RiskAssessment[[#This Row],[S2]]* Table_RiskAssessment[[#This Row],[F2]]* Table_RiskAssessment[[#This Row],[P2]]>0),IF(Table_RiskAssessment[[#This Row],[S2]]=1,IF(Table_RiskAssessment[[#This Row],[F2]]=1,IF(Table_RiskAssessment[[#This Row],[P2]]=1,\"a\",IF(Table_RiskAssessment[[#This Row],[W2]]=1,\"a\",\"b\")),IF(Table_RiskAssessment[[#This Row],[P2]]=1,IF(Table_RiskAssessment[[#This Row],[W2]]=1,\"a\",\"b\"),IF(Table_RiskAssessment[[#This Row],[W2]]=1,\"b\",\"c\"))),IF(Table_RiskAssessment[[#This Row],[F2]]=1,IF(Table_RiskAssessment[[#This Row],[P2]]=1,IF(Table_RiskAssessment[[#This Row],[W2]]=1,\"b\",\"c\"),IF(Table_RiskAssessment[[#This Row],[W2]]=1,\"c\",\"d\")),IF(Table_RiskAssessment[[#This Row],[P2]]=1,IF(Table_RiskAssessment[[#This Row],[W2]]=1,\"c\",\"d\"),IF(Table_RiskAssessment[[#This Row],[W2]]=1,\"d\",\"e\")))),\"?\")","v":"?"},null,null,null,"-"]
[null,null,null,"2006 / 42","4.1.2.7.",{"$f":"Language!A$223","v":"Movements of loads during handling"},"x","","x",null,null,null,null,null,null,null,null,null,null,null,null,null,null,null,null,null,null,null,null,null,null,null,null,null,null,null,null,null,null,null,null,null,null,null,null,null,null,null,null,null,null,null,null,null,{"$f":"IF((Table_RiskAssessment[[#This Row],[S2]]* Table_RiskAssessment[[#This Row],[F2]]* Table_RiskAssessment[[#This Row],[P2]]>0),IF(Table_RiskAssessment[[#This Row],[S2]]=1,IF(Table_RiskAssessment[[#This Row],[F2]]=1,IF(Table_RiskAssessment[[#This Row],[P2]]=1,\"a\",IF(Table_RiskAssessment[[#This Row],[W2]]=1,\"a\",\"b\")),IF(Table_RiskAssessment[[#This Row],[P2]]=1,IF(Table_RiskAssessment[[#This Row],[W2]]=1,\"a\",\"b\"),IF(Table_RiskAssessment[[#This Row],[W2]]=1,\"b\",\"c\"))),IF(Table_RiskAssessment[[#This Row],[F2]]=1,IF(Table_RiskAssessment[[#This Row],[P2]]=1,IF(Table_RiskAssessment[[#This Row],[W2]]=1,\"b\",\"c\"),IF(Table_RiskAssessment[[#This Row],[W2]]=1,\"c\",\"d\")),IF(Table_RiskAssessment[[#This Row],[P2]]=1,IF(Table_RiskAssessment[[#This Row],[W2]]=1,\"c\",\"d\"),IF(Table_RiskAssessment[[#This Row],[W2]]=1,\"d\",\"e\")))),\"?\")","v":"?"},null,null,null,"-"]
[null,null,null,"2006 / 42","4.1.2.8.",{"$f":"Language!A$224","v":"Machinery serving fixed landings"},"x","x","x",null,null,null,null,null,null,null,null,null,null,null,null,null,null,null,null,null,null,null,null,null,null,null,null,null,null,null,null,null,null,null,null,null,null,null,null,null,null,null,null,null,null,null,null,null,{"$f":"IF((Table_RiskAssessment[[#This Row],[S2]]* Table_RiskAssessment[[#This Row],[F2]]* Table_RiskAssessment[[#This Row],[P2]]>0),IF(Table_RiskAssessment[[#This Row],[S2]]=1,IF(Table_RiskAssessment[[#This Row],[F2]]=1,IF(Table_RiskAssessment[[#This Row],[P2]]=1,\"a\",IF(Table_RiskAssessment[[#This Row],[W2]]=1,\"a\",\"b\")),IF(Table_RiskAssessment[[#This Row],[P2]]=1,IF(Table_RiskAssessment[[#This Row],[W2]]=1,\"a\",\"b\"),IF(Table_RiskAssessment[[#This Row],[W2]]=1,\"b\",\"c\"))),IF(Table_RiskAssessment[[#This Row],[F2]]=1,IF(Table_RiskAssessment[[#This Row],[P2]]=1,IF(Table_RiskAssessment[[#This Row],[W2]]=1,\"b\",\"c\"),IF(Table_RiskAssessment[[#This Row],[W2]]=1,\"c\",\"d\")),IF(Table_RiskAssessment[[#This Row],[P2]]=1,IF(Table_RiskAssessment[[#This Row],[W2]]=1,\"c\",\"d\"),IF(Table_RiskAssessment[[#This Row],[W2]]=1,\"d\",\"e\")))),\"?\")","v":"?"},null,null,null,"-"]
[null,null,null,"2006 / 42","4.1.2.8.1.",{"$f":"Language!A$225","v":"Movements of the carrier"},"x","","x",null,null,null,null,null,null,null,null,null,null,null,null,null,null,null,null,null,null,null,null,null,null,null,null,null,null,null,null,null,null,null,null,null,null,null,null,null,null,null,null,null,null,null,null,null,{"$f":"IF((Table_RiskAssessment[[#This Row],[S2]]* Table_RiskAssessment[[#This Row],[F2]]* Table_RiskAssessment[[#This Row],[P2]]>0),IF(Table_RiskAssessment[[#This Row],[S2]]=1,IF(Table_RiskAssessment[[#This Row],[F2]]=1,IF(Table_RiskAssessment[[#This Row],[P2]]=1,\"a\",IF(Table_RiskAssessment[[#This Row],[W2]]=1,\"a\",\"b\")),IF(Table_RiskAssessment[[#This Row],[P2]]=1,IF(Table_RiskAssessment[[#This Row],[W2]]=1,\"a\",\"b\"),IF(Table_RiskAssessment[[#This Row],[W2]]=1,\"b\",\"c\"))),IF(Table_RiskAssessment[[#This Row],[F2]]=1,IF(Table_RiskAssessment[[#This Row],[P2]]=1,IF(Table_RiskAssessment[[#This Row],[W2]]=1,\"b\",\"c\"),IF(Table_RiskAssessment[[#This Row],[W2]]=1,\"c\",\"d\")),IF(Table_RiskAssessment[[#This Row],[P2]]=1,IF(Table_RiskAssessment[[#This Row],[W2]]=1,\"c\",\"d\"),IF(Table_RiskAssessment[[#This Row],[W2]]=1,\"d\",\"e\")))),\"?\")","v":"?"},null,null,null,"-"]
[null,null,null,"2006 / 42","4.1.2.8.2.",{"$f":"Language!A$226","v":"Access to the carrier"},"x","","x",null,null,null,null,null,null,null,null,null,null,null,null,null,null,null,null,null,null,null,null,null,null,null,null,null,null,null,null,null,null,null,null,null,null,null,null,null,null,null,null,null,null,null,null,null,{"$f":"IF((Table_RiskAssessment[[#This Row],[S2]]* Table_RiskAssessment[[#This Row],[F2]]* Table_RiskAssessment[[#This Row],[P2]]>0),IF(Table_RiskAssessment[[#This Row],[S2]]=1,IF(Table_RiskAssessment[[#This Row],[F2]]=1,IF(Table_RiskAssessment[[#This Row],[P2]]=1,\"a\",IF(Table_RiskAssessment[[#This Row],[W2]]=1,\"a\",\"b\")),IF(Table_RiskAssessment[[#This Row],[P2]]=1,IF(Table_RiskAssessment[[#This Row],[W2]]=1,\"a\",\"b\"),IF(Table_RiskAssessment[[#This Row],[W2]]=1,\"b\",\"c\"))),IF(Table_RiskAssessment[[#This Row],[F2]]=1,IF(Table_RiskAssessment[[#This Row],[P2]]=1,IF(Table_RiskAssessment[[#This Row],[W2]]=1,\"b\",\"c\"),IF(Table_RiskAssessment[[#This Row],[W2]]=1,\"c\",\"d\")),IF(Table_RiskAssessment[[#This Row],[P2]]=1,IF(Table_RiskAssessment[[#This Row],[W2]]=1,\"c\",\"d\"),IF(Table_RiskAssessment[[#This Row],[W2]]=1,\"d\",\"e\")))),\"?\")","v":"?"},null,null,null,"-"]
[null,null,null,"2006 / 42","4.1.2.8.3.",{"$f":"Language!A$227","v":"Risks due to contact with the moving carrier"},"x","","x",null,null,null,null,null,null,null,null,null,null,null,null,null,null,null,null,null,null,null,null,null,null,null,null,null,null,null,null,null,null,null,null,null,null,null,null,null,null,null,null,null,null,null,null,null,{"$f":"IF((Table_RiskAssessment[[#This Row],[S2]]* Table_RiskAssessment[[#This Row],[F2]]* Table_RiskAssessment[[#This Row],[P2]]>0),IF(Table_RiskAssessment[[#This Row],[S2]]=1,IF(Table_RiskAssessment[[#This Row],[F2]]=1,IF(Table_RiskAssessment[[#This Row],[P2]]=1,\"a\",IF(Table_RiskAssessment[[#This Row],[W2]]=1,\"a\",\"b\")),IF(Table_RiskAssessment[[#This Row],[P2]]=1,IF(Table_RiskAssessment[[#This Row],[W2]]=1,\"a\",\"b\"),IF(Table_RiskAssessment[[#This Row],[W2]]=1,\"b\",\"c\"))),IF(Table_RiskAssessment[[#This Row],[F2]]=1,IF(Table_RiskAssessment[[#This Row],[P2]]=1,IF(Table_RiskAssessment[[#This Row],[W2]]=1,\"b\",\"c\"),IF(Table_RiskAssessment[[#This Row],[W2]]=1,\"c\",\"d\")),IF(Table_RiskAssessment[[#This Row],[P2]]=1,IF(Table_RiskAssessment[[#This Row],[W2]]=1,\"c\",\"d\"),IF(Table_RiskAssessment[[#This Row],[W2]]=1,\"d\",\"e\")))),\"?\")","v":"?"},null,null,null,"-"]
[null,null,null,"2006 / 42","4.1.2.8.4.",{"$f":"Language!A$228","v":"Risk due to the load falling off the carrier"},"x","","x",null,null,null,null,null,null,null,null,null,null,null,null,null,null,null,null,null,null,null,null,null,null,null,null,null,null,null,null,null,null,null,null,null,null,null,null,null,null,null,null,null,null,null,null,null,{"$f":"IF((Table_RiskAssessment[[#This Row],[S2]]* Table_RiskAssessment[[#This Row],[F2]]* Table_RiskAssessment[[#This Row],[P2]]>0),IF(Table_RiskAssessment[[#This Row],[S2]]=1,IF(Table_RiskAssessment[[#This Row],[F2]]=1,IF(Table_RiskAssessment[[#This Row],[P2]]=1,\"a\",IF(Table_RiskAssessment[[#This Row],[W2]]=1,\"a\",\"b\")),IF(Table_RiskAssessment[[#This Row],[P2]]=1,IF(Table_RiskAssessment[[#This Row],[W2]]=1,\"a\",\"b\"),IF(Table_RiskAssessment[[#This Row],[W2]]=1,\"b\",\"c\"))),IF(Table_RiskAssessment[[#This Row],[F2]]=1,IF(Table_RiskAssessment[[#This Row],[P2]]=1,IF(Table_RiskAssessment[[#This Row],[W2]]=1,\"b\",\"c\"),IF(Table_RiskAssessment[[#This Row],[W2]]=1,\"c\",\"d\")),IF(Table_RiskAssessment[[#This Row],[P2]]=1,IF(Table_RiskAssessment[[#This Row],[W2]]=1,\"c\",\"d\"),IF(Table_RiskAssessment[[#This Row],[W2]]=1,\"d\",\"e\")))),\"?\")","v":"?"},null,null,null,"-"]
[null,null,null,"2006 / 42","4.1.2.8.5.",{"$f":"Language!A$229","v":"Landings"},"x","","x",null,null,null,null,null,null,null,null,null,null,null,null,null,null,null,null,null,null,null,null,null,null,null,null,null,null,null,null,null,null,null,null,null,null,null,null,null,null,null,null,null,null,null,null,null,{"$f":"IF((Table_RiskAssessment[[#This Row],[S2]]* Table_RiskAssessment[[#This Row],[F2]]* Table_RiskAssessment[[#This Row],[P2]]>0),IF(Table_RiskAssessment[[#This Row],[S2]]=1,IF(Table_RiskAssessment[[#This Row],[F2]]=1,IF(Table_RiskAssessment[[#This Row],[P2]]=1,\"a\",IF(Table_RiskAssessment[[#This Row],[W2]]=1,\"a\",\"b\")),IF(Table_RiskAssessment[[#This Row],[P2]]=1,IF(Table_RiskAssessment[[#This Row],[W2]]=1,\"a\",\"b\"),IF(Table_RiskAssessment[[#This Row],[W2]]=1,\"b\",\"c\"))),IF(Table_RiskAssessment[[#This Row],[F2]]=1,IF(Table_RiskAssessment[[#This Row],[P2]]=1,IF(Table_RiskAssessment[[#This Row],[W2]]=1,\"b\",\"c\"),IF(Table_RiskAssessment[[#This Row],[W2]]=1,\"c\",\"d\")),IF(Table_RiskAssessment[[#This Row],[P2]]=1,IF(Table_RiskAssessment[[#This Row],[W2]]=1,\"c\",\"d\"),IF(Table_RiskAssessment[[#This Row],[W2]]=1,\"d\",\"e\")))),\"?\")","v":"?"},null,null,null,"-"]
[null,null,null,"2006 / 42","4.1.3.",{"$f":"Language!A$230","v":"Fitness for purpose"},"x","","x",null,null,null,null,null,null,null,null,null,null,null,null,null,null,null,null,null,null,null,null,null,null,null,null,null,null,null,null,null,null,null,null,null,null,null,null,null,null,null,null,null,null,null,null,null,{"$f":"IF((Table_RiskAssessment[[#This Row],[S2]]* Table_RiskAssessment[[#This Row],[F2]]* Table_RiskAssessment[[#This Row],[P2]]>0),IF(Table_RiskAssessment[[#This Row],[S2]]=1,IF(Table_RiskAssessment[[#This Row],[F2]]=1,IF(Table_RiskAssessment[[#This Row],[P2]]=1,\"a\",IF(Table_RiskAssessment[[#This Row],[W2]]=1,\"a\",\"b\")),IF(Table_RiskAssessment[[#This Row],[P2]]=1,IF(Table_RiskAssessment[[#This Row],[W2]]=1,\"a\",\"b\"),IF(Table_RiskAssessment[[#This Row],[W2]]=1,\"b\",\"c\"))),IF(Table_RiskAssessment[[#This Row],[F2]]=1,IF(Table_RiskAssessment[[#This Row],[P2]]=1,IF(Table_RiskAssessment[[#This Row],[W2]]=1,\"b\",\"c\"),IF(Table_RiskAssessment[[#This Row],[W2]]=1,\"c\",\"d\")),IF(Table_RiskAssessment[[#This Row],[P2]]=1,IF(Table_RiskAssessment[[#This Row],[W2]]=1,\"c\",\"d\"),IF(Table_RiskAssessment[[#This Row],[W2]]=1,\"d\",\"e\")))),\"?\")","v":"?"},null,null,null,"-"]
[null,null,null,"2006 / 42","4.2.",{"$f":"Language!A$231","v":"Requirements for machinery whose power source is other than manual effort"},"x","x","x",null,null,null,null,null,null,null,null,null,null,null,null,null,null,null,null,null,null,null,null,null,null,null,null,null,null,null,null,null,null,null,null,null,null,null,null,null,null,null,null,null,null,null,null,null,{"$f":"IF((Table_RiskAssessment[[#This Row],[S2]]* Table_RiskAssessment[[#This Row],[F2]]* Table_RiskAssessment[[#This Row],[P2]]>0),IF(Table_RiskAssessment[[#This Row],[S2]]=1,IF(Table_RiskAssessment[[#This Row],[F2]]=1,IF(Table_RiskAssessment[[#This Row],[P2]]=1,\"a\",IF(Table_RiskAssessment[[#This Row],[W2]]=1,\"a\",\"b\")),IF(Table_RiskAssessment[[#This Row],[P2]]=1,IF(Table_RiskAssessment[[#This Row],[W2]]=1,\"a\",\"b\"),IF(Table_RiskAssessment[[#This Row],[W2]]=1,\"b\",\"c\"))),IF(Table_RiskAssessment[[#This Row],[F2]]=1,IF(Table_RiskAssessment[[#This Row],[P2]]=1,IF(Table_RiskAssessment[[#This Row],[W2]]=1,\"b\",\"c\"),IF(Table_RiskAssessment[[#This Row],[W2]]=1,\"c\",\"d\")),IF(Table_RiskAssessment[[#This Row],[P2]]=1,IF(Table_RiskAssessment[[#This Row],[W2]]=1,\"c\",\"d\"),IF(Table_RiskAssessment[[#This Row],[W2]]=1,\"d\",\"e\")))),\"?\")","v":"?"},null,null,null,"-"]
[null,null,null,"2006 / 42","4.2.1.",{"$f":"Language!A$232","v":"Control of movements"},"x","","x",null,null,null,null,null,null,null,null,null,null,null,null,null,null,null,null,null,null,null,null,null,null,null,null,null,null,null,null,null,null,null,null,null,null,null,null,null,null,null,null,null,null,null,null,null,{"$f":"IF((Table_RiskAssessment[[#This Row],[S2]]* Table_RiskAssessment[[#This Row],[F2]]* Table_RiskAssessment[[#This Row],[P2]]>0),IF(Table_RiskAssessment[[#This Row],[S2]]=1,IF(Table_RiskAssessment[[#This Row],[F2]]=1,IF(Table_RiskAssessment[[#This Row],[P2]]=1,\"a\",IF(Table_RiskAssessment[[#This Row],[W2]]=1,\"a\",\"b\")),IF(Table_RiskAssessment[[#This Row],[P2]]=1,IF(Table_RiskAssessment[[#This Row],[W2]]=1,\"a\",\"b\"),IF(Table_RiskAssessment[[#This Row],[W2]]=1,\"b\",\"c\"))),IF(Table_RiskAssessment[[#This Row],[F2]]=1,IF(Table_RiskAssessment[[#This Row],[P2]]=1,IF(Table_RiskAssessment[[#This Row],[W2]]=1,\"b\",\"c\"),IF(Table_RiskAssessment[[#This Row],[W2]]=1,\"c\",\"d\")),IF(Table_RiskAssessment[[#This Row],[P2]]=1,IF(Table_RiskAssessment[[#This Row],[W2]]=1,\"c\",\"d\"),IF(Table_RiskAssessment[[#This Row],[W2]]=1,\"d\",\"e\")))),\"?\")","v":"?"},null,null,null,"-"]
[null,null,null,"2006 / 42","4.2.2.",{"$f":"Language!A$233","v":"Loading control"},"x","","x",null,null,null,null,null,null,null,null,null,null,null,null,null,null,null,null,null,null,null,null,null,null,null,null,null,null,null,null,null,null,null,null,null,null,null,null,null,null,null,null,null,null,null,null,null,{"$f":"IF((Table_RiskAssessment[[#This Row],[S2]]* Table_RiskAssessment[[#This Row],[F2]]* Table_RiskAssessment[[#This Row],[P2]]>0),IF(Table_RiskAssessment[[#This Row],[S2]]=1,IF(Table_RiskAssessment[[#This Row],[F2]]=1,IF(Table_RiskAssessment[[#This Row],[P2]]=1,\"a\",IF(Table_RiskAssessment[[#This Row],[W2]]=1,\"a\",\"b\")),IF(Table_RiskAssessment[[#This Row],[P2]]=1,IF(Table_RiskAssessment[[#This Row],[W2]]=1,\"a\",\"b\"),IF(Table_RiskAssessment[[#This Row],[W2]]=1,\"b\",\"c\"))),IF(Table_RiskAssessment[[#This Row],[F2]]=1,IF(Table_RiskAssessment[[#This Row],[P2]]=1,IF(Table_RiskAssessment[[#This Row],[W2]]=1,\"b\",\"c\"),IF(Table_RiskAssessment[[#This Row],[W2]]=1,\"c\",\"d\")),IF(Table_RiskAssessment[[#This Row],[P2]]=1,IF(Table_RiskAssessment[[#This Row],[W2]]=1,\"c\",\"d\"),IF(Table_RiskAssessment[[#This Row],[W2]]=1,\"d\",\"e\")))),\"?\")","v":"?"},null,null,null,"-"]
[null,null,null,"2006 / 42","4.2.3.",{"$f":"Language!A$234","v":"Installations guided by ropes"},"x","","x",null,null,null,null,null,null,null,null,null,null,null,null,null,null,null,null,null,null,null,null,null,null,null,null,null,null,null,null,null,null,null,null,null,null,null,null,null,null,null,null,null,null,null,null,null,{"$f":"IF((Table_RiskAssessment[[#This Row],[S2]]* Table_RiskAssessment[[#This Row],[F2]]* Table_RiskAssessment[[#This Row],[P2]]>0),IF(Table_RiskAssessment[[#This Row],[S2]]=1,IF(Table_RiskAssessment[[#This Row],[F2]]=1,IF(Table_RiskAssessment[[#This Row],[P2]]=1,\"a\",IF(Table_RiskAssessment[[#This Row],[W2]]=1,\"a\",\"b\")),IF(Table_RiskAssessment[[#This Row],[P2]]=1,IF(Table_RiskAssessment[[#This Row],[W2]]=1,\"a\",\"b\"),IF(Table_RiskAssessment[[#This Row],[W2]]=1,\"b\",\"c\"))),IF(Table_RiskAssessment[[#This Row],[F2]]=1,IF(Table_RiskAssessment[[#This Row],[P2]]=1,IF(Table_RiskAssessment[[#This Row],[W2]]=1,\"b\",\"c\"),IF(Table_RiskAssessment[[#This Row],[W2]]=1,\"c\",\"d\")),IF(Table_RiskAssessment[[#This Row],[P2]]=1,IF(Table_RiskAssessment[[#This Row],[W2]]=1,\"c\",\"d\"),IF(Table_RiskAssessment[[#This Row],[W2]]=1,\"d\",\"e\")))),\"?\")","v":"?"},null,null,null,"-"]
[null,null,null,"2006 / 42","4.3.",{"$f":"Language!A$235","v":"Information and markings"},"x","x","x",null,null,null,null,null,null,null,null,null,null,null,null,null,null,null,null,null,null,null,null,null,null,null,null,null,null,null,null,null,null,null,null,null,null,null,null,null,null,null,null,null,null,null,null,null,{"$f":"IF((Table_RiskAssessment[[#This Row],[S2]]* Table_RiskAssessment[[#This Row],[F2]]* Table_RiskAssessment[[#This Row],[P2]]>0),IF(Table_RiskAssessment[[#This Row],[S2]]=1,IF(Table_RiskAssessment[[#This Row],[F2]]=1,IF(Table_RiskAssessment[[#This Row],[P2]]=1,\"a\",IF(Table_RiskAssessment[[#This Row],[W2]]=1,\"a\",\"b\")),IF(Table_RiskAssessment[[#This Row],[P2]]=1,IF(Table_RiskAssessment[[#This Row],[W2]]=1,\"a\",\"b\"),IF(Table_RiskAssessment[[#This Row],[W2]]=1,\"b\",\"c\"))),IF(Table_RiskAssessment[[#This Row],[F2]]=1,IF(Table_RiskAssessment[[#This Row],[P2]]=1,IF(Table_RiskAssessment[[#This Row],[W2]]=1,\"b\",\"c\"),IF(Table_RiskAssessment[[#This Row],[W2]]=1,\"c\",\"d\")),IF(Table_RiskAssessment[[#This Row],[P2]]=1,IF(Table_RiskAssessment[[#This Row],[W2]]=1,\"c\",\"d\"),IF(Table_RiskAssessment[[#This Row],[W2]]=1,\"d\",\"e\")))),\"?\")","v":"?"},null,null,null,"-"]
[null,null,null,"2006 / 42","4.3.1.",{"$f":"Language!A$236","v":"Chains, ropes and webbing"},"x","","x",null,null,null,null,null,null,null,null,null,null,null,null,null,null,null,null,null,null,null,null,null,null,null,null,null,null,null,null,null,null,null,null,null,null,null,null,null,null,null,null,null,null,null,null,null,{"$f":"IF((Table_RiskAssessment[[#This Row],[S2]]* Table_RiskAssessment[[#This Row],[F2]]* Table_RiskAssessment[[#This Row],[P2]]>0),IF(Table_RiskAssessment[[#This Row],[S2]]=1,IF(Table_RiskAssessment[[#This Row],[F2]]=1,IF(Table_RiskAssessment[[#This Row],[P2]]=1,\"a\",IF(Table_RiskAssessment[[#This Row],[W2]]=1,\"a\",\"b\")),IF(Table_RiskAssessment[[#This Row],[P2]]=1,IF(Table_RiskAssessment[[#This Row],[W2]]=1,\"a\",\"b\"),IF(Table_RiskAssessment[[#This Row],[W2]]=1,\"b\",\"c\"))),IF(Table_RiskAssessment[[#This Row],[F2]]=1,IF(Table_RiskAssessment[[#This Row],[P2]]=1,IF(Table_RiskAssessment[[#This Row],[W2]]=1,\"b\",\"c\"),IF(Table_RiskAssessment[[#This Row],[W2]]=1,\"c\",\"d\")),IF(Table_RiskAssessment[[#This Row],[P2]]=1,IF(Table_RiskAssessment[[#This Row],[W2]]=1,\"c\",\"d\"),IF(Table_RiskAssessment[[#This Row],[W2]]=1,\"d\",\"e\")))),\"?\")","v":"?"},null,null,null,"-"]
[null,null,null,"2006 / 42","4.3.2.",{"$f":"Language!A$237","v":"Lifting accessories"},"x","","x",null,null,null,null,null,null,null,null,null,null,null,null,null,null,null,null,null,null,null,null,null,null,null,null,null,null,null,null,null,null,null,null,null,null,null,null,null,null,null,null,null,null,null,null,null,{"$f":"IF((Table_RiskAssessment[[#This Row],[S2]]* Table_RiskAssessment[[#This Row],[F2]]* Table_RiskAssessment[[#This Row],[P2]]>0),IF(Table_RiskAssessment[[#This Row],[S2]]=1,IF(Table_RiskAssessment[[#This Row],[F2]]=1,IF(Table_RiskAssessment[[#This Row],[P2]]=1,\"a\",IF(Table_RiskAssessment[[#This Row],[W2]]=1,\"a\",\"b\")),IF(Table_RiskAssessment[[#This Row],[P2]]=1,IF(Table_RiskAssessment[[#This Row],[W2]]=1,\"a\",\"b\"),IF(Table_RiskAssessment[[#This Row],[W2]]=1,\"b\",\"c\"))),IF(Table_RiskAssessment[[#This Row],[F2]]=1,IF(Table_RiskAssessment[[#This Row],[P2]]=1,IF(Table_RiskAssessment[[#This Row],[W2]]=1,\"b\",\"c\"),IF(Table_RiskAssessment[[#This Row],[W2]]=1,\"c\",\"d\")),IF(Table_RiskAssessment[[#This Row],[P2]]=1,IF(Table_RiskAssessment[[#This Row],[W2]]=1,\"c\",\"d\"),IF(Table_RiskAssessment[[#This Row],[W2]]=1,\"d\",\"e\")))),\"?\")","v":"?"},null,null,null,"-"]
[null,null,null,"2006 / 42","4.3.3.",{"$f":"Language!A$238","v":"Lifting machinery"},"x","","x",null,null,null,null,null,null,null,null,null,null,null,null,null,null,null,null,null,null,null,null,null,null,null,null,null,null,null,null,null,null,null,null,null,null,null,null,null,null,null,null,null,null,null,null,null,{"$f":"IF((Table_RiskAssessment[[#This Row],[S2]]* Table_RiskAssessment[[#This Row],[F2]]* Table_RiskAssessment[[#This Row],[P2]]>0),IF(Table_RiskAssessment[[#This Row],[S2]]=1,IF(Table_RiskAssessment[[#This Row],[F2]]=1,IF(Table_RiskAssessment[[#This Row],[P2]]=1,\"a\",IF(Table_RiskAssessment[[#This Row],[W2]]=1,\"a\",\"b\")),IF(Table_RiskAssessment[[#This Row],[P2]]=1,IF(Table_RiskAssessment[[#This Row],[W2]]=1,\"a\",\"b\"),IF(Table_RiskAssessment[[#This Row],[W2]]=1,\"b\",\"c\"))),IF(Table_RiskAssessment[[#This Row],[F2]]=1,IF(Table_RiskAssessment[[#This Row],[P2]]=1,IF(Table_RiskAssessment[[#This Row],[W2]]=1,\"b\",\"c\"),IF(Table_RiskAssessment[[#This Row],[W2]]=1,\"c\",\"d\")),IF(Table_RiskAssessment[[#This Row],[P2]]=1,IF(Table_RiskAssessment[[#This Row],[W2]]=1,\"c\",\"d\"),IF(Table_RiskAssessment[[#This Row],[W2]]=1,\"d\",\"e\")))),\"?\")","v":"?"},null,null,null,"-"]
[null,null,null,"2006 / 42","4.4.",{"$f":"Language!A$239","v":"Instructions"},"x","x","x",null,null,null,null,null,null,null,null,null,null,null,null,null,null,null,null,null,null,null,null,null,null,null,null,null,null,null,null,null,null,null,null,null,null,null,null,null,null,null,null,null,null,null,null,null,{"$f":"IF((Table_RiskAssessment[[#This Row],[S2]]* Table_RiskAssessment[[#This Row],[F2]]* Table_RiskAssessment[[#This Row],[P2]]>0),IF(Table_RiskAssessment[[#This Row],[S2]]=1,IF(Table_RiskAssessment[[#This Row],[F2]]=1,IF(Table_RiskAssessment[[#This Row],[P2]]=1,\"a\",IF(Table_RiskAssessment[[#This Row],[W2]]=1,\"a\",\"b\")),IF(Table_RiskAssessment[[#This Row],[P2]]=1,IF(Table_RiskAssessment[[#This Row],[W2]]=1,\"a\",\"b\"),IF(Table_RiskAssessment[[#This Row],[W2]]=1,\"b\",\"c\"))),IF(Table_RiskAssessment[[#This Row],[F2]]=1,IF(Table_RiskAssessment[[#This Row],[P2]]=1,IF(Table_RiskAssessment[[#This Row],[W2]]=1,\"b\",\"c\"),IF(Table_RiskAssessment[[#This Row],[W2]]=1,\"c\",\"d\")),IF(Table_RiskAssessment[[#This Row],[P2]]=1,IF(Table_RiskAssessment[[#This Row],[W2]]=1,\"c\",\"d\"),IF(Table_RiskAssessment[[#This Row],[W2]]=1,\"d\",\"e\")))),\"?\")","v":"?"},null,null,null,"-"]
[null,null,null,"2006 / 42","4.4.1.",{"$f":"Language!A$240","v":"Lifting accessories"},"x","","x",null,null,null,null,null,null,null,null,null,null,null,null,null,null,null,null,null,null,null,null,null,null,null,null,null,null,null,null,null,null,null,null,null,null,null,null,null,null,null,null,null,null,null,null,null,{"$f":"IF((Table_RiskAssessment[[#This Row],[S2]]* Table_RiskAssessment[[#This Row],[F2]]* Table_RiskAssessment[[#This Row],[P2]]>0),IF(Table_RiskAssessment[[#This Row],[S2]]=1,IF(Table_RiskAssessment[[#This Row],[F2]]=1,IF(Table_RiskAssessment[[#This Row],[P2]]=1,\"a\",IF(Table_RiskAssessment[[#This Row],[W2]]=1,\"a\",\"b\")),IF(Table_RiskAssessment[[#This Row],[P2]]=1,IF(Table_RiskAssessment[[#This Row],[W2]]=1,\"a\",\"b\"),IF(Table_RiskAssessment[[#This Row],[W2]]=1,\"b\",\"c\"))),IF(Table_RiskAssessment[[#This Row],[F2]]=1,IF(Table_RiskAssessment[[#This Row],[P2]]=1,IF(Table_RiskAssessment[[#This Row],[W2]]=1,\"b\",\"c\"),IF(Table_RiskAssessment[[#This Row],[W2]]=1,\"c\",\"d\")),IF(Table_RiskAssessment[[#This Row],[P2]]=1,IF(Table_RiskAssessment[[#This Row],[W2]]=1,\"c\",\"d\"),IF(Table_RiskAssessment[[#This Row],[W2]]=1,\"d\",\"e\")))),\"?\")","v":"?"},null,null,null,"-"]
[null,null,null,"2006 / 42","4.4.2.",{"$f":"Language!A$241","v":"Lifting machinery"},"x","","x",null,null,null,null,null,null,null,null,null,null,null,null,null,null,null,null,null,null,null,null,null,null,null,null,null,null,null,null,null,null,null,null,null,null,null,null,null,null,null,null,null,null,null,null,null,{"$f":"IF((Table_RiskAssessment[[#This Row],[S2]]* Table_RiskAssessment[[#This Row],[F2]]* Table_RiskAssessment[[#This Row],[P2]]>0),IF(Table_RiskAssessment[[#This Row],[S2]]=1,IF(Table_RiskAssessment[[#This Row],[F2]]=1,IF(Table_RiskAssessment[[#This Row],[P2]]=1,\"a\",IF(Table_RiskAssessment[[#This Row],[W2]]=1,\"a\",\"b\")),IF(Table_RiskAssessment[[#This Row],[P2]]=1,IF(Table_RiskAssessment[[#This Row],[W2]]=1,\"a\",\"b\"),IF(Table_RiskAssessment[[#This Row],[W2]]=1,\"b\",\"c\"))),IF(Table_RiskAssessment[[#This Row],[F2]]=1,IF(Table_RiskAssessment[[#This Row],[P2]]=1,IF(Table_RiskAssessment[[#This Row],[W2]]=1,\"b\",\"c\"),IF(Table_RiskAssessment[[#This Row],[W2]]=1,\"c\",\"d\")),IF(Table_RiskAssessment[[#This Row],[P2]]=1,IF(Table_RiskAssessment[[#This Row],[W2]]=1,\"c\",\"d\"),IF(Table_RiskAssessment[[#This Row],[W2]]=1,\"d\",\"e\")))),\"?\")","v":"?"},null,null,null,"-"]
[null,null,null,"2006 / 42","5.",{"$f":"Language!A$242","v":"Supplementary essential health and safety requirements for machinery intended for underground work"},"x","x","x",null,null,null,null,null,null,null,null,null,null,null,null,null,null,null,null,null,null,null,null,null,null,null,null,null,null,null,null,null,null,null,null,null,null,null,null,null,null,null,null,null,null,null,null,null,{"$f":"IF((Table_RiskAssessment[[#This Row],[S2]]* Table_RiskAssessment[[#This Row],[F2]]* Table_RiskAssessment[[#This Row],[P2]]>0),IF(Table_RiskAssessment[[#This Row],[S2]]=1,IF(Table_RiskAssessment[[#This Row],[F2]]=1,IF(Table_RiskAssessment[[#This Row],[P2]]=1,\"a\",IF(Table_RiskAssessment[[#This Row],[W2]]=1,\"a\",\"b\")),IF(Table_RiskAssessment[[#This Row],[P2]]=1,IF(Table_RiskAssessment[[#This Row],[W2]]=1,\"a\",\"b\"),IF(Table_RiskAssessment[[#This Row],[W2]]=1,\"b\",\"c\"))),IF(Table_RiskAssessment[[#This Row],[F2]]=1,IF(Table_RiskAssessment[[#This Row],[P2]]=1,IF(Table_RiskAssessment[[#This Row],[W2]]=1,\"b\",\"c\"),IF(Table_RiskAssessment[[#This Row],[W2]]=1,\"c\",\"d\")),IF(Table_RiskAssessment[[#This Row],[P2]]=1,IF(Table_RiskAssessment[[#This Row],[W2]]=1,\"c\",\"d\"),IF(Table_RiskAssessment[[#This Row],[W2]]=1,\"d\",\"e\")))),\"?\")","v":"?"},null,null,null,"-"]
[null,null,null,"2006 / 42","5.1.",{"$f":"Language!A$243","v":"Risks due to lack of stability"},"x","","x",null,null,null,null,null,null,null,null,null,null,null,null,null,null,null,null,null,null,null,null,null,null,null,null,null,null,null,null,null,null,null,null,null,null,null,null,null,null,null,null,null,null,null,null,null,{"$f":"IF((Table_RiskAssessment[[#This Row],[S2]]* Table_RiskAssessment[[#This Row],[F2]]* Table_RiskAssessment[[#This Row],[P2]]>0),IF(Table_RiskAssessment[[#This Row],[S2]]=1,IF(Table_RiskAssessment[[#This Row],[F2]]=1,IF(Table_RiskAssessment[[#This Row],[P2]]=1,\"a\",IF(Table_RiskAssessment[[#This Row],[W2]]=1,\"a\",\"b\")),IF(Table_RiskAssessment[[#This Row],[P2]]=1,IF(Table_RiskAssessment[[#This Row],[W2]]=1,\"a\",\"b\"),IF(Table_RiskAssessment[[#This Row],[W2]]=1,\"b\",\"c\"))),IF(Table_RiskAssessment[[#This Row],[F2]]=1,IF(Table_RiskAssessment[[#This Row],[P2]]=1,IF(Table_RiskAssessment[[#This Row],[W2]]=1,\"b\",\"c\"),IF(Table_RiskAssessment[[#This Row],[W2]]=1,\"c\",\"d\")),IF(Table_RiskAssessment[[#This Row],[P2]]=1,IF(Table_RiskAssessment[[#This Row],[W2]]=1,\"c\",\"d\"),IF(Table_RiskAssessment[[#This Row],[W2]]=1,\"d\",\"e\")))),\"?\")","v":"?"},null,null,null,"-"]
[null,null,null,"2006 / 42","5.2.",{"$f":"Language!A$244","v":"Movement"},"x","","x",null,null,null,null,null,null,null,null,null,null,null,null,null,null,null,null,null,null,null,null,null,null,null,null,null,null,null,null,null,null,null,null,null,null,null,null,null,null,null,null,null,null,null,null,null,{"$f":"IF((Table_RiskAssessment[[#This Row],[S2]]* Table_RiskAssessment[[#This Row],[F2]]* Table_RiskAssessment[[#This Row],[P2]]>0),IF(Table_RiskAssessment[[#This Row],[S2]]=1,IF(Table_RiskAssessment[[#This Row],[F2]]=1,IF(Table_RiskAssessment[[#This Row],[P2]]=1,\"a\",IF(Table_RiskAssessment[[#This Row],[W2]]=1,\"a\",\"b\")),IF(Table_RiskAssessment[[#This Row],[P2]]=1,IF(Table_RiskAssessment[[#This Row],[W2]]=1,\"a\",\"b\"),IF(Table_RiskAssessment[[#This Row],[W2]]=1,\"b\",\"c\"))),IF(Table_RiskAssessment[[#This Row],[F2]]=1,IF(Table_RiskAssessment[[#This Row],[P2]]=1,IF(Table_RiskAssessment[[#This Row],[W2]]=1,\"b\",\"c\"),IF(Table_RiskAssessment[[#This Row],[W2]]=1,\"c\",\"d\")),IF(Table_RiskAssessment[[#This Row],[P2]]=1,IF(Table_RiskAssessment[[#This Row],[W2]]=1,\"c\",\"d\"),IF(Table_RiskAssessment[[#This Row],[W2]]=1,\"d\",\"e\")))),\"?\")","v":"?"},null,null,null,"-"]
[null,null,null,"2006 / 42","5.3.",{"$f":"Language!A$245","v":"Control devices"},"x","","x",null,null,null,null,null,null,null,null,null,null,null,null,null,null,null,null,null,null,null,null,null,null,null,null,null,null,null,null,null,null,null,null,null,null,null,null,null,null,null,null,null,null,null,null,null,{"$f":"IF((Table_RiskAssessment[[#This Row],[S2]]* Table_RiskAssessment[[#This Row],[F2]]* Table_RiskAssessment[[#This Row],[P2]]>0),IF(Table_RiskAssessment[[#This Row],[S2]]=1,IF(Table_RiskAssessment[[#This Row],[F2]]=1,IF(Table_RiskAssessment[[#This Row],[P2]]=1,\"a\",IF(Table_RiskAssessment[[#This Row],[W2]]=1,\"a\",\"b\")),IF(Table_RiskAssessment[[#This Row],[P2]]=1,IF(Table_RiskAssessment[[#This Row],[W2]]=1,\"a\",\"b\"),IF(Table_RiskAssessment[[#This Row],[W2]]=1,\"b\",\"c\"))),IF(Table_RiskAssessment[[#This Row],[F2]]=1,IF(Table_RiskAssessment[[#This Row],[P2]]=1,IF(Table_RiskAssessment[[#This Row],[W2]]=1,\"b\",\"c\"),IF(Table_RiskAssessment[[#This Row],[W2]]=1,\"c\",\"d\")),IF(Table_RiskAssessment[[#This Row],[P2]]=1,IF(Table_RiskAssessment[[#This Row],[W2]]=1,\"c\",\"d\"),IF(Table_RiskAssessment[[#This Row],[W2]]=1,\"d\",\"e\")))),\"?\")","v":"?"},null,null,null,"-"]
[null,null,null,"2006 / 42","5.4.",{"$f":"Language!A$246","v":"Stopping"},"x","","x",null,null,null,null,null,null,null,null,null,null,null,null,null,null,null,null,null,null,null,null,null,null,null,null,null,null,null,null,null,null,null,null,null,null,null,null,null,null,null,null,null,null,null,null,null,{"$f":"IF((Table_RiskAssessment[[#This Row],[S2]]* Table_RiskAssessment[[#This Row],[F2]]* Table_RiskAssessment[[#This Row],[P2]]>0),IF(Table_RiskAssessment[[#This Row],[S2]]=1,IF(Table_RiskAssessment[[#This Row],[F2]]=1,IF(Table_RiskAssessment[[#This Row],[P2]]=1,\"a\",IF(Table_RiskAssessment[[#This Row],[W2]]=1,\"a\",\"b\")),IF(Table_RiskAssessment[[#This Row],[P2]]=1,IF(Table_RiskAssessment[[#This Row],[W2]]=1,\"a\",\"b\"),IF(Table_RiskAssessment[[#This Row],[W2]]=1,\"b\",\"c\"))),IF(Table_RiskAssessment[[#This Row],[F2]]=1,IF(Table_RiskAssessment[[#This Row],[P2]]=1,IF(Table_RiskAssessment[[#This Row],[W2]]=1,\"b\",\"c\"),IF(Table_RiskAssessment[[#This Row],[W2]]=1,\"c\",\"d\")),IF(Table_RiskAssessment[[#This Row],[P2]]=1,IF(Table_RiskAssessment[[#This Row],[W2]]=1,\"c\",\"d\"),IF(Table_RiskAssessment[[#This Row],[W2]]=1,\"d\",\"e\")))),\"?\")","v":"?"},null,null,null,"-"]
[null,null,null,"2006 / 42","5.5.",{"$f":"Language!A$247","v":"Fire"},"x","","x",null,null,null,null,null,null,null,null,null,null,null,null,null,null,null,null,null,null,null,null,null,null,null,null,null,null,null,null,null,null,null,null,null,null,null,null,null,null,null,null,null,null,null,null,null,{"$f":"IF((Table_RiskAssessment[[#This Row],[S2]]* Table_RiskAssessment[[#This Row],[F2]]* Table_RiskAssessment[[#This Row],[P2]]>0),IF(Table_RiskAssessment[[#This Row],[S2]]=1,IF(Table_RiskAssessment[[#This Row],[F2]]=1,IF(Table_RiskAssessment[[#This Row],[P2]]=1,\"a\",IF(Table_RiskAssessment[[#This Row],[W2]]=1,\"a\",\"b\")),IF(Table_RiskAssessment[[#This Row],[P2]]=1,IF(Table_RiskAssessment[[#This Row],[W2]]=1,\"a\",\"b\"),IF(Table_RiskAssessment[[#This Row],[W2]]=1,\"b\",\"c\"))),IF(Table_RiskAssessment[[#This Row],[F2]]=1,IF(Table_RiskAssessment[[#This Row],[P2]]=1,IF(Table_RiskAssessment[[#This Row],[W2]]=1,\"b\",\"c\"),IF(Table_RiskAssessment[[#This Row],[W2]]=1,\"c\",\"d\")),IF(Table_RiskAssessment[[#This Row],[P2]]=1,IF(Table_RiskAssessment[[#This Row],[W2]]=1,\"c\",\"d\"),IF(Table_RiskAssessment[[#This Row],[W2]]=1,\"d\",\"e\")))),\"?\")","v":"?"},null,null,null,"-"]
[null,null,null,"2006 / 42","5.6.",{"$f":"Language!A$248","v":"Exhaust emissions"},"x","","x",null,null,null,null,null,null,null,null,null,null,null,null,null,null,null,null,null,null,null,null,null,null,null,null,null,null,null,null,null,null,null,null,null,null,null,null,null,null,null,null,null,null,null,null,null,{"$f":"IF((Table_RiskAssessment[[#This Row],[S2]]* Table_RiskAssessment[[#This Row],[F2]]* Table_RiskAssessment[[#This Row],[P2]]>0),IF(Table_RiskAssessment[[#This Row],[S2]]=1,IF(Table_RiskAssessment[[#This Row],[F2]]=1,IF(Table_RiskAssessment[[#This Row],[P2]]=1,\"a\",IF(Table_RiskAssessment[[#This Row],[W2]]=1,\"a\",\"b\")),IF(Table_RiskAssessment[[#This Row],[P2]]=1,IF(Table_RiskAssessment[[#This Row],[W2]]=1,\"a\",\"b\"),IF(Table_RiskAssessment[[#This Row],[W2]]=1,\"b\",\"c\"))),IF(Table_RiskAssessment[[#This Row],[F2]]=1,IF(Table_RiskAssessment[[#This Row],[P2]]=1,IF(Table_RiskAssessment[[#This Row],[W2]]=1,\"b\",\"c\"),IF(Table_RiskAssessment[[#This Row],[W2]]=1,\"c\",\"d\")),IF(Table_RiskAssessment[[#This Row],[P2]]=1,IF(Table_RiskAssessment[[#This Row],[W2]]=1,\"c\",\"d\"),IF(Table_RiskAssessment[[#This Row],[W2]]=1,\"d\",\"e\")))),\"?\")","v":"?"},null,null,null,"-"]
[null,null,null,"2006 / 42","6.",{"$f":"Language!A$249","v":"Supplementary essential health and safety requirements for machinery presenting particular hazards due to the lifting of persons"},"x","x","x",null,null,null,null,null,null,null,null,null,null,null,null,null,null,null,null,null,null,null,null,null,null,null,null,null,null,null,null,null,null,null,null,null,null,null,null,null,null,null,null,null,null,null,null,null,{"$f":"IF((Table_RiskAssessment[[#This Row],[S2]]* Table_RiskAssessment[[#This Row],[F2]]* Table_RiskAssessment[[#This Row],[P2]]>0),IF(Table_RiskAssessment[[#This Row],[S2]]=1,IF(Table_RiskAssessment[[#This Row],[F2]]=1,IF(Table_RiskAssessment[[#This Row],[P2]]=1,\"a\",IF(Table_RiskAssessment[[#This Row],[W2]]=1,\"a\",\"b\")),IF(Table_RiskAssessment[[#This Row],[P2]]=1,IF(Table_RiskAssessment[[#This Row],[W2]]=1,\"a\",\"b\"),IF(Table_RiskAssessment[[#This Row],[W2]]=1,\"b\",\"c\"))),IF(Table_RiskAssessment[[#This Row],[F2]]=1,IF(Table_RiskAssessment[[#This Row],[P2]]=1,IF(Table_RiskAssessment[[#This Row],[W2]]=1,\"b\",\"c\"),IF(Table_RiskAssessment[[#This Row],[W2]]=1,\"c\",\"d\")),IF(Table_RiskAssessment[[#This Row],[P2]]=1,IF(Table_RiskAssessment[[#This Row],[W2]]=1,\"c\",\"d\"),IF(Table_RiskAssessment[[#This Row],[W2]]=1,\"d\",\"e\")))),\"?\")","v":"?"},null,null,null,"-"]
[null,null,null,"2006 / 42","6.1.",{"$f":"Language!A$250","v":"General"},"x","x","x",null,null,null,null,null,null,null,null,null,null,null,null,null,null,null,null,null,null,null,null,null,null,null,null,null,null,null,null,null,null,null,null,null,null,null,null,null,null,null,null,null,null,null,null,null,{"$f":"IF((Table_RiskAssessment[[#This Row],[S2]]* Table_RiskAssessment[[#This Row],[F2]]* Table_RiskAssessment[[#This Row],[P2]]>0),IF(Table_RiskAssessment[[#This Row],[S2]]=1,IF(Table_RiskAssessment[[#This Row],[F2]]=1,IF(Table_RiskAssessment[[#This Row],[P2]]=1,\"a\",IF(Table_RiskAssessment[[#This Row],[W2]]=1,\"a\",\"b\")),IF(Table_RiskAssessment[[#This Row],[P2]]=1,IF(Table_RiskAssessment[[#This Row],[W2]]=1,\"a\",\"b\"),IF(Table_RiskAssessment[[#This Row],[W2]]=1,\"b\",\"c\"))),IF(Table_RiskAssessment[[#This Row],[F2]]=1,IF(Table_RiskAssessment[[#This Row],[P2]]=1,IF(Table_RiskAssessment[[#This Row],[W2]]=1,\"b\",\"c\"),IF(Table_RiskAssessment[[#This Row],[W2]]=1,\"c\",\"d\")),IF(Table_RiskAssessment[[#This Row],[P2]]=1,IF(Table_RiskAssessment[[#This Row],[W2]]=1,\"c\",\"d\"),IF(Table_RiskAssessment[[#This Row],[W2]]=1,\"d\",\"e\")))),\"?\")","v":"?"},null,null,null,"-"]
[null,null,null,"2006 / 42","6.1.1.",{"$f":"Language!A$251","v":"Mechanical strength"},"x","","x",null,null,null,null,null,null,null,null,null,null,null,null,null,null,null,null,null,null,null,null,null,null,null,null,null,null,null,null,null,null,null,null,null,null,null,null,null,null,null,null,null,null,null,null,null,{"$f":"IF((Table_RiskAssessment[[#This Row],[S2]]* Table_RiskAssessment[[#This Row],[F2]]* Table_RiskAssessment[[#This Row],[P2]]>0),IF(Table_RiskAssessment[[#This Row],[S2]]=1,IF(Table_RiskAssessment[[#This Row],[F2]]=1,IF(Table_RiskAssessment[[#This Row],[P2]]=1,\"a\",IF(Table_RiskAssessment[[#This Row],[W2]]=1,\"a\",\"b\")),IF(Table_RiskAssessment[[#This Row],[P2]]=1,IF(Table_RiskAssessment[[#This Row],[W2]]=1,\"a\",\"b\"),IF(Table_RiskAssessment[[#This Row],[W2]]=1,\"b\",\"c\"))),IF(Table_RiskAssessment[[#This Row],[F2]]=1,IF(Table_RiskAssessment[[#This Row],[P2]]=1,IF(Table_RiskAssessment[[#This Row],[W2]]=1,\"b\",\"c\"),IF(Table_RiskAssessment[[#This Row],[W2]]=1,\"c\",\"d\")),IF(Table_RiskAssessment[[#This Row],[P2]]=1,IF(Table_RiskAssessment[[#This Row],[W2]]=1,\"c\",\"d\"),IF(Table_RiskAssessment[[#This Row],[W2]]=1,\"d\",\"e\")))),\"?\")","v":"?"},null,null,null,"-"]
[null,null,null,"2006 / 42","6.1.2.",{"$f":"Language!A$252","v":"Loading control for machinery moved by power other than human strength"},"x","","x",null,null,null,null,null,null,null,null,null,null,null,null,null,null,null,null,null,null,null,null,null,null,null,null,null,null,null,null,null,null,null,null,null,null,null,null,null,null,null,null,null,null,null,null,null,{"$f":"IF((Table_RiskAssessment[[#This Row],[S2]]* Table_RiskAssessment[[#This Row],[F2]]* Table_RiskAssessment[[#This Row],[P2]]>0),IF(Table_RiskAssessment[[#This Row],[S2]]=1,IF(Table_RiskAssessment[[#This Row],[F2]]=1,IF(Table_RiskAssessment[[#This Row],[P2]]=1,\"a\",IF(Table_RiskAssessment[[#This Row],[W2]]=1,\"a\",\"b\")),IF(Table_RiskAssessment[[#This Row],[P2]]=1,IF(Table_RiskAssessment[[#This Row],[W2]]=1,\"a\",\"b\"),IF(Table_RiskAssessment[[#This Row],[W2]]=1,\"b\",\"c\"))),IF(Table_RiskAssessment[[#This Row],[F2]]=1,IF(Table_RiskAssessment[[#This Row],[P2]]=1,IF(Table_RiskAssessment[[#This Row],[W2]]=1,\"b\",\"c\"),IF(Table_RiskAssessment[[#This Row],[W2]]=1,\"c\",\"d\")),IF(Table_RiskAssessment[[#This Row],[P2]]=1,IF(Table_RiskAssessment[[#This Row],[W2]]=1,\"c\",\"d\"),IF(Table_RiskAssessment[[#This Row],[W2]]=1,\"d\",\"e\")))),\"?\")","v":"?"},null,null,null,"-"]
[null,null,null,"2006 / 42","6.2.",{"$f":"Language!A$253","v":"Control devices"},"x","","x",null,null,null,null,null,null,null,null,null,null,null,null,null,null,null,null,null,null,null,null,null,null,null,null,null,null,null,null,null,null,null,null,null,null,null,null,null,null,null,null,null,null,null,null,null,{"$f":"IF((Table_RiskAssessment[[#This Row],[S2]]* Table_RiskAssessment[[#This Row],[F2]]* Table_RiskAssessment[[#This Row],[P2]]>0),IF(Table_RiskAssessment[[#This Row],[S2]]=1,IF(Table_RiskAssessment[[#This Row],[F2]]=1,IF(Table_RiskAssessment[[#This Row],[P2]]=1,\"a\",IF(Table_RiskAssessment[[#This Row],[W2]]=1,\"a\",\"b\")),IF(Table_RiskAssessment[[#This Row],[P2]]=1,IF(Table_RiskAssessment[[#This Row],[W2]]=1,\"a\",\"b\"),IF(Table_RiskAssessment[[#This Row],[W2]]=1,\"b\",\"c\"))),IF(Table_RiskAssessment[[#This Row],[F2]]=1,IF(Table_RiskAssessment[[#This Row],[P2]]=1,IF(Table_RiskAssessment[[#This Row],[W2]]=1,\"b\",\"c\"),IF(Table_RiskAssessment[[#This Row],[W2]]=1,\"c\",\"d\")),IF(Table_RiskAssessment[[#This Row],[P2]]=1,IF(Table_RiskAssessment[[#This Row],[W2]]=1,\"c\",\"d\"),IF(Table_RiskAssessment[[#This Row],[W2]]=1,\"d\",\"e\")))),\"?\")","v":"?"},null,null,null,"-"]
[null,null,null,"2006 / 42","6.3.",{"$f":"Language!A$254","v":"Risks to persons in or on the carrier"},"x","x","x",null,null,null,null,null,null,null,null,null,null,null,null,null,null,null,null,null,null,null,null,null,null,null,null,null,null,null,null,null,null,null,null,null,null,null,null,null,null,null,null,null,null,null,null,null,{"$f":"IF((Table_RiskAssessment[[#This Row],[S2]]* Table_RiskAssessment[[#This Row],[F2]]* Table_RiskAssessment[[#This Row],[P2]]>0),IF(Table_RiskAssessment[[#This Row],[S2]]=1,IF(Table_RiskAssessment[[#This Row],[F2]]=1,IF(Table_RiskAssessment[[#This Row],[P2]]=1,\"a\",IF(Table_RiskAssessment[[#This Row],[W2]]=1,\"a\",\"b\")),IF(Table_RiskAssessment[[#This Row],[P2]]=1,IF(Table_RiskAssessment[[#This Row],[W2]]=1,\"a\",\"b\"),IF(Table_RiskAssessment[[#This Row],[W2]]=1,\"b\",\"c\"))),IF(Table_RiskAssessment[[#This Row],[F2]]=1,IF(Table_RiskAssessment[[#This Row],[P2]]=1,IF(Table_RiskAssessment[[#This Row],[W2]]=1,\"b\",\"c\"),IF(Table_RiskAssessment[[#This Row],[W2]]=1,\"c\",\"d\")),IF(Table_RiskAssessment[[#This Row],[P2]]=1,IF(Table_RiskAssessment[[#This Row],[W2]]=1,\"c\",\"d\"),IF(Table_RiskAssessment[[#This Row],[W2]]=1,\"d\",\"e\")))),\"?\")","v":"?"},null,null,null,"-"]
[null,null,null,"2006 / 42","6.3.1.",{"$f":"Language!A$255","v":"Risks due to movements of the carrier"},"x","","x",null,null,null,null,null,null,null,null,null,null,null,null,null,null,null,null,null,null,null,null,null,null,null,null,null,null,null,null,null,null,null,null,null,null,null,null,null,null,null,null,null,null,null,null,null,{"$f":"IF((Table_RiskAssessment[[#This Row],[S2]]* Table_RiskAssessment[[#This Row],[F2]]* Table_RiskAssessment[[#This Row],[P2]]>0),IF(Table_RiskAssessment[[#This Row],[S2]]=1,IF(Table_RiskAssessment[[#This Row],[F2]]=1,IF(Table_RiskAssessment[[#This Row],[P2]]=1,\"a\",IF(Table_RiskAssessment[[#This Row],[W2]]=1,\"a\",\"b\")),IF(Table_RiskAssessment[[#This Row],[P2]]=1,IF(Table_RiskAssessment[[#This Row],[W2]]=1,\"a\",\"b\"),IF(Table_RiskAssessment[[#This Row],[W2]]=1,\"b\",\"c\"))),IF(Table_RiskAssessment[[#This Row],[F2]]=1,IF(Table_RiskAssessment[[#This Row],[P2]]=1,IF(Table_RiskAssessment[[#This Row],[W2]]=1,\"b\",\"c\"),IF(Table_RiskAssessment[[#This Row],[W2]]=1,\"c\",\"d\")),IF(Table_RiskAssessment[[#This Row],[P2]]=1,IF(Table_RiskAssessment[[#This Row],[W2]]=1,\"c\",\"d\"),IF(Table_RiskAssessment[[#This Row],[W2]]=1,\"d\",\"e\")))),\"?\")","v":"?"},null,null,null,"-"]
[null,null,null,"2006 / 42","6.3.2.",{"$f":"Language!A$256","v":"Risk of persons falling from the carrier"},"x","","x",null,null,null,null,null,null,null,null,null,null,null,null,null,null,null,null,null,null,null,null,null,null,null,null,null,null,null,null,null,null,null,null,null,null,null,null,null,null,null,null,null,null,null,null,null,{"$f":"IF((Table_RiskAssessment[[#This Row],[S2]]* Table_RiskAssessment[[#This Row],[F2]]* Table_RiskAssessment[[#This Row],[P2]]>0),IF(Table_RiskAssessment[[#This Row],[S2]]=1,IF(Table_RiskAssessment[[#This Row],[F2]]=1,IF(Table_RiskAssessment[[#This Row],[P2]]=1,\"a\",IF(Table_RiskAssessment[[#This Row],[W2]]=1,\"a\",\"b\")),IF(Table_RiskAssessment[[#This Row],[P2]]=1,IF(Table_RiskAssessment[[#This Row],[W2]]=1,\"a\",\"b\"),IF(Table_RiskAssessment[[#This Row],[W2]]=1,\"b\",\"c\"))),IF(Table_RiskAssessment[[#This Row],[F2]]=1,IF(Table_RiskAssessment[[#This Row],[P2]]=1,IF(Table_RiskAssessment[[#This Row],[W2]]=1,\"b\",\"c\"),IF(Table_RiskAssessment[[#This Row],[W2]]=1,\"c\",\"d\")),IF(Table_RiskAssessment[[#This Row],[P2]]=1,IF(Table_RiskAssessment[[#This Row],[W2]]=1,\"c\",\"d\"),IF(Table_RiskAssessment[[#This Row],[W2]]=1,\"d\",\"e\")))),\"?\")","v":"?"},null,null,null,"-"]
[null,null,null,"2006 / 42","6.3.3.",{"$f":"Language!A$257","v":"Risk due to objects falling on the carrier"},"x","","x",null,null,null,null,null,null,null,null,null,null,null,null,null,null,null,null,null,null,null,null,null,null,null,null,null,null,null,null,null,null,null,null,null,null,null,null,null,null,null,null,null,null,null,null,null,{"$f":"IF((Table_RiskAssessment[[#This Row],[S2]]* Table_RiskAssessment[[#This Row],[F2]]* Table_RiskAssessment[[#This Row],[P2]]>0),IF(Table_RiskAssessment[[#This Row],[S2]]=1,IF(Table_RiskAssessment[[#This Row],[F2]]=1,IF(Table_RiskAssessment[[#This Row],[P2]]=1,\"a\",IF(Table_RiskAssessment[[#This Row],[W2]]=1,\"a\",\"b\")),IF(Table_RiskAssessment[[#This Row],[P2]]=1,IF(Table_RiskAssessment[[#This Row],[W2]]=1,\"a\",\"b\"),IF(Table_RiskAssessment[[#This Row],[W2]]=1,\"b\",\"c\"))),IF(Table_RiskAssessment[[#This Row],[F2]]=1,IF(Table_RiskAssessment[[#This Row],[P2]]=1,IF(Table_RiskAssessment[[#This Row],[W2]]=1,\"b\",\"c\"),IF(Table_RiskAssessment[[#This Row],[W2]]=1,\"c\",\"d\")),IF(Table_RiskAssessment[[#This Row],[P2]]=1,IF(Table_RiskAssessment[[#This Row],[W2]]=1,\"c\",\"d\"),IF(Table_RiskAssessment[[#This Row],[W2]]=1,\"d\",\"e\")))),\"?\")","v":"?"},null,null,null,"-"]
[null,null,null,"2006 / 42","6.4.",{"$f":"Language!A$258","v":"Machinery serving fixed landings"},"x","x","x",null,null,null,null,null,null,null,null,null,null,null,null,null,null,null,null,null,null,null,null,null,null,null,null,null,null,null,null,null,null,null,null,null,null,null,null,null,null,null,null,null,null,null,null,null,{"$f":"IF((Table_RiskAssessment[[#This Row],[S2]]* Table_RiskAssessment[[#This Row],[F2]]* Table_RiskAssessment[[#This Row],[P2]]>0),IF(Table_RiskAssessment[[#This Row],[S2]]=1,IF(Table_RiskAssessment[[#This Row],[F2]]=1,IF(Table_RiskAssessment[[#This Row],[P2]]=1,\"a\",IF(Table_RiskAssessment[[#This Row],[W2]]=1,\"a\",\"b\")),IF(Table_RiskAssessment[[#This Row],[P2]]=1,IF(Table_RiskAssessment[[#This Row],[W2]]=1,\"a\",\"b\"),IF(Table_RiskAssessment[[#This Row],[W2]]=1,\"b\",\"c\"))),IF(Table_RiskAssessment[[#This Row],[F2]]=1,IF(Table_RiskAssessment[[#This Row],[P2]]=1,IF(Table_RiskAssessment[[#This Row],[W2]]=1,\"b\",\"c\"),IF(Table_RiskAssessment[[#This Row],[W2]]=1,\"c\",\"d\")),IF(Table_RiskAssessment[[#This Row],[P2]]=1,IF(Table_RiskAssessment[[#This Row],[W2]]=1,\"c\",\"d\"),IF(Table_RiskAssessment[[#This Row],[W2]]=1,\"d\",\"e\")))),\"?\")","v":"?"},null,null,null,"-"]
[null,null,null,"2006 / 42","6.4.1.",{"$f":"Language!A$259","v":"Risks to persons in or on the carrier"},"x","","x",null,null,null,null,null,null,null,null,null,null,null,null,null,null,null,null,null,null,null,null,null,null,null,null,null,null,null,null,null,null,null,null,null,null,null,null,null,null,null,null,null,null,null,null,null,{"$f":"IF((Table_RiskAssessment[[#This Row],[S2]]* Table_RiskAssessment[[#This Row],[F2]]* Table_RiskAssessment[[#This Row],[P2]]>0),IF(Table_RiskAssessment[[#This Row],[S2]]=1,IF(Table_RiskAssessment[[#This Row],[F2]]=1,IF(Table_RiskAssessment[[#This Row],[P2]]=1,\"a\",IF(Table_RiskAssessment[[#This Row],[W2]]=1,\"a\",\"b\")),IF(Table_RiskAssessment[[#This Row],[P2]]=1,IF(Table_RiskAssessment[[#This Row],[W2]]=1,\"a\",\"b\"),IF(Table_RiskAssessment[[#This Row],[W2]]=1,\"b\",\"c\"))),IF(Table_RiskAssessment[[#This Row],[F2]]=1,IF(Table_RiskAssessment[[#This Row],[P2]]=1,IF(Table_RiskAssessment[[#This Row],[W2]]=1,\"b\",\"c\"),IF(Table_RiskAssessment[[#This Row],[W2]]=1,\"c\",\"d\")),IF(Table_RiskAssessment[[#This Row],[P2]]=1,IF(Table_RiskAssessment[[#This Row],[W2]]=1,\"c\",\"d\"),IF(Table_RiskAssessment[[#This Row],[W2]]=1,\"d\",\"e\")))),\"?\")","v":"?"},null,null,null,"-"]
[null,null,null,"2006 / 42","6.4.2.",{"$f":"Language!A$260","v":"Controls at landings"},"x","","x",null,null,null,null,null,null,null,null,null,null,null,null,null,null,null,null,null,null,null,null,null,null,null,null,null,null,null,null,null,null,null,null,null,null,null,null,null,null,null,null,null,null,null,null,null,{"$f":"IF((Table_RiskAssessment[[#This Row],[S2]]* Table_RiskAssessment[[#This Row],[F2]]* Table_RiskAssessment[[#This Row],[P2]]>0),IF(Table_RiskAssessment[[#This Row],[S2]]=1,IF(Table_RiskAssessment[[#This Row],[F2]]=1,IF(Table_RiskAssessment[[#This Row],[P2]]=1,\"a\",IF(Table_RiskAssessment[[#This Row],[W2]]=1,\"a\",\"b\")),IF(Table_RiskAssessment[[#This Row],[P2]]=1,IF(Table_RiskAssessment[[#This Row],[W2]]=1,\"a\",\"b\"),IF(Table_RiskAssessment[[#This Row],[W2]]=1,\"b\",\"c\"))),IF(Table_RiskAssessment[[#This Row],[F2]]=1,IF(Table_RiskAssessment[[#This Row],[P2]]=1,IF(Table_RiskAssessment[[#This Row],[W2]]=1,\"b\",\"c\"),IF(Table_RiskAssessment[[#This Row],[W2]]=1,\"c\",\"d\")),IF(Table_RiskAssessment[[#This Row],[P2]]=1,IF(Table_RiskAssessment[[#This Row],[W2]]=1,\"c\",\"d\"),IF(Table_RiskAssessment[[#This Row],[W2]]=1,\"d\",\"e\")))),\"?\")","v":"?"},null,null,null,"-"]
[null,null,null,"2006 / 42","6.4.3.",{"$f":"Language!A$261","v":"Access to the carrier"},"x","","x",null,null,null,null,null,null,null,null,null,null,null,null,null,null,null,null,null,null,null,null,null,null,null,null,null,null,null,null,null,null,null,null,null,null,null,null,null,null,null,null,null,null,null,null,null,{"$f":"IF((Table_RiskAssessment[[#This Row],[S2]]* Table_RiskAssessment[[#This Row],[F2]]* Table_RiskAssessment[[#This Row],[P2]]>0),IF(Table_RiskAssessment[[#This Row],[S2]]=1,IF(Table_RiskAssessment[[#This Row],[F2]]=1,IF(Table_RiskAssessment[[#This Row],[P2]]=1,\"a\",IF(Table_RiskAssessment[[#This Row],[W2]]=1,\"a\",\"b\")),IF(Table_RiskAssessment[[#This Row],[P2]]=1,IF(Table_RiskAssessment[[#This Row],[W2]]=1,\"a\",\"b\"),IF(Table_RiskAssessment[[#This Row],[W2]]=1,\"b\",\"c\"))),IF(Table_RiskAssessment[[#This Row],[F2]]=1,IF(Table_RiskAssessment[[#This Row],[P2]]=1,IF(Table_RiskAssessment[[#This Row],[W2]]=1,\"b\",\"c\"),IF(Table_RiskAssessment[[#This Row],[W2]]=1,\"c\",\"d\")),IF(Table_RiskAssessment[[#This Row],[P2]]=1,IF(Table_RiskAssessment[[#This Row],[W2]]=1,\"c\",\"d\"),IF(Table_RiskAssessment[[#This Row],[W2]]=1,\"d\",\"e\")))),\"?\")","v":"?"},null,null,null,"-"]
[null,null,null,"2006 / 42","6.5.",{"$f":"Language!A$262","v":"Markings"},"x","","x",null,null,null,null,null,null,null,null,null,null,null,null,null,null,null,null,null,null,null,null,null,null,null,null,null,null,null,null,null,null,null,null,null,null,null,null,null,null,null,null,null,null,null,null,null,{"$f":"IF((Table_RiskAssessment[[#This Row],[S2]]* Table_RiskAssessment[[#This Row],[F2]]* Table_RiskAssessment[[#This Row],[P2]]>0),IF(Table_RiskAssessment[[#This Row],[S2]]=1,IF(Table_RiskAssessment[[#This Row],[F2]]=1,IF(Table_RiskAssessment[[#This Row],[P2]]=1,\"a\",IF(Table_RiskAssessment[[#This Row],[W2]]=1,\"a\",\"b\")),IF(Table_RiskAssessment[[#This Row],[P2]]=1,IF(Table_RiskAssessment[[#This Row],[W2]]=1,\"a\",\"b\"),IF(Table_RiskAssessment[[#This Row],[W2]]=1,\"b\",\"c\"))),IF(Table_RiskAssessment[[#This Row],[F2]]=1,IF(Table_RiskAssessment[[#This Row],[P2]]=1,IF(Table_RiskAssessment[[#This Row],[W2]]=1,\"b\",\"c\"),IF(Table_RiskAssessment[[#This Row],[W2]]=1,\"c\",\"d\")),IF(Table_RiskAssessment[[#This Row],[P2]]=1,IF(Table_RiskAssessment[[#This Row],[W2]]=1,\"c\",\"d\"),IF(Table_RiskAssessment[[#This Row],[W2]]=1,\"d\",\"e\")))),\"?\")","v":"?"},null,null,null,"-"]

{"sheet":"Risk assessment Log","index":2,"n_rows":0,"n_cols":0,"rows_kept":0,"cut":false,"hidden":true,"merged":[]}

{"sheet":"B-Standards","index":3,"n_rows":260,"n_cols":6,"rows_kept":260,"cut":false,"hidden":false,"merged":[[0,2,0,4],[0,0,0,1]]}
["Stand EU-Amtsblatt:\nC 92/1 vom 9.3.2018\nzuletzt geändert durch \nAmtsblatt L 366/109 vom 15.10.2021",null,"Auflistung der B-Normen,\njeweils den grundlegenden Sicherheits- und Gesundheitsanforderungen,\nAnlage I der Maschinenrichtlinie 2006/42/EG, zugeordnet\nnach: MMS Muck Maschinensicherheit GmbH"]
["GSA","Nummer","Bezeichnung","Deutsch","English","Français"]
[null,"---",{"$f":"INDEX(Table_Standards[#This Row],1,Language_select+3)","v":" "}," "," "," "]
[null,null,{"$f":"INDEX(Table_Standards[#This Row],1,Language_select+3)","v":"Lighting"},"Beleuchtung","Lighting"]
["1.1.4.","EN 1837:2020",{"$f":"INDEX(Table_Standards[#This Row],1,Language_select+3)","v":"Safety of machinery - Integral lighting of machines"},"Sicherheit von Maschinen — Maschinenintegrierte Beleuchtung","Safety of machinery - Integral lighting of machines","Sécurité des machines — Éclairage intégré aux machines"]
[null,"---",{"$f":"INDEX(Table_Standards[#This Row],1,Language_select+3)","v":" "}," "," "," "]
[null,null,{"$f":"INDEX(Table_Standards[#This Row],1,Language_select+3)","v":"Ergonomics"},"Ergonomie","Ergonomics","Français"]
["1.1.6.","EN 547-1:1996+A1:2008",{"$f":"INDEX(Table_Standards[#This Row],1,Language_select+3)","v":"Safety of machinery - Human body measurements - Part 1: Principles for determining the dimensions required for openings for whole body access into machinery"},"Sicherheit von Maschinen — Körpermaße des Menschen —  Teil 1: Grundlagen zur Bestimmung von Abmessungen für Ganzkörperzugänge  an Maschinenarbeitsplätzen","Safety of machinery - Human body measurements - Part 1: Principles for determining the dimensions required for openings for whole body access into machinery","Sécurité des machines — Mesures du corps humain — Partie 1: Principes de détermination des dimensions requises pour les ouvertures destinées au passage de l’ensemble du corps dans les machines"]
["1.1.6.","EN 547-2:1996+A1:2008",{"$f":"INDEX(Table_Standards[#This Row],1,Language_select+3)","v":"Safety of machinery - Human body measurements - Part 2: Principles for determining the dimensions required for access openings"},"Sicherheit von Maschinen — Körpermaße des Menschen —  Teil 2: Grundlagen für die Bemessung von Zugangsöffnungen","Safety of machinery - Human body measurements - Part 2: Principles for determining the dimensions required for access openings","Sécurité des machines — Mesures du corps humain — Partie 2: Principes de détermination des dimensions requises pour les orifices d’accès"]
["1.1.6.","EN 547-3:1996+A1:2008",{"$f":"INDEX(Table_Standards[#This Row],1,Language_select+3)","v":"Safety of machinery - Human body measurements - Part 3: Anthropometric data"},"Sicherheit von Maschinen — Körpermaße des Menschen —  Teil 3: Körpermaßdaten","Safety of machinery - Human body measurements - Part 3: Anthropometric data","Sécurité des machines — Mesures du corps humain — Partie 3: Données anthropométriques"]
["1.1.6.","EN 614-1:2006+A1:2009",{"$f":"INDEX(Table_Standards[#This Row],1,Language_select+3)","v":"Safety of machinery - Ergonomic design principles - Part 1: Terminology and general principles"},"Sicherheit von Maschinen — Ergonomische Gestaltungsgrundsätze —  Teil 1: Begriffe und allgemeine Leitsätze","Safety of machinery - Ergonomic design principles - Part 1: Terminology and general principles","Sécurité des machines — Principes ergonomiques de conception — Partie 1: Terminologie et principes généraux"]
["1.1.6.","EN 614-2:2000+A1:2008",{"$f":"INDEX(Table_Standards[#This Row],1,Language_select+3)","v":"Safety of machinery - Ergonomic design principles - Part 2: Interactions between the design of machinery and work tasks"},"Sicherheit von Maschinen — Ergonomische Gestaltungsgrundsätze —  Teil 2: Wechselwirkungen zwischen der Gestaltung von Maschinen und  den Arbeitsaufgaben","Safety of machinery - Ergonomic design principles - Part 2: Interactions between the design of machinery and work tasks","Sécurité des machines — Principes ergonomiques de conception — Partie 2: Interactions entre la conception des machines et les tâches du travail"]
["1.1.6.","EN 1005-1:2001+A1:2008",{"$f":"INDEX(Table_Standards[#This Row],1,Language_select+3)","v":"Safety of machinery - Human physical performance - Part 1: Terms and definitions"},"Sicherheit von Maschinen — Menschliche körperliche Leistung —  Teil 1: Begriffe","Safety of machinery - Human physical performance - Part 1: Terms and definitions","Sécurité des machines — Performance physique humaine — Partie 1: Termes et définitions"]
["1.1.6.","EN 1005-2:2003+A1:2008",{"$f":"INDEX(Table_Standards[#This Row],1,Language_select+3)","v":"Safety of machinery - Human physical performance - Part 2: Manual handling of machinery and component parts of machinery"},"Sicherheit von Maschinen — Menschliche körperliche Leistung —  Teil 2: Manuelle Handhabung von Gegenständen in Verbindung mit  Maschinen und Maschinenteilen","Safety of machinery - Human physical performance - Part 2: Manual handling of machinery and component parts of machinery","Sécurité des machines — Performance physique humaine — Partie 2: Manutention manuelle de machines et d’éléments de machines"]
["1.1.6.","EN 1005-3:2002+A1:2008",{"$f":"INDEX(Table_Standards[#This Row],1,Language_select+3)","v":"Safety of machinery - Human physical performance - Part 3: Recommended force limits for machinery operation"},"Sicherheit von Maschinen — Menschliche körperliche Leistung —  Teil 3: Empfohlene Kraftgrenzen bei Maschinenbetätigung","Safety of machinery - Human physical performance - Part 3: Recommended force limits for machinery operation","Sécurité des machines — Performance physique humaine — Partie 3: Limites des forces recommandées pour l’utilisation de machines"]
["1.1.6.","EN 1005-4:2005+A1:2008",{"$f":"INDEX(Table_Standards[#This Row],1,Language_select+3)","v":"Safety of machinery - Human physical performance - Part 4: Evaluation of working postures and movements in relation to machinery"},"Sicherheit von Maschinen — Menschliche körperliche Leistung —  Teil 4: Bewertung von Körperhaltungen und Bewegungen bei der Arbeit  an Maschinen","Safety of machinery - Human physical performance - Part 4: Evaluation of working postures and movements in relation to machinery","Sécurité des machines — Performance physique humaine — Partie 4: Évaluation des postures et mouvements lors du travail en relation avec les machines"]
["1.1.6.","EN ISO 14738:2008",{"$f":"INDEX(Table_Standards[#This Row],1,Language_select+3)","v":"Safety of machinery - Anthropometric requirements for the design of workstations at machinery (ISO 14738:2002, including Cor 1:2003 and Cor 2:2005)"},"Sicherheit von Maschinen — Anthropometrische Anforderungen an die  Gestaltung von Maschinenarbeitsplätzen","Safety of machinery - Anthropometric requirements for the design of workstations at machinery (ISO 14738:2002, including Cor 1:2003 and Cor 2:2005)","Sécurité des machines — Prescriptions anthropométriques relatives à la conception des postes de travail sur les machines"]
["1.1.6.","EN ISO 15536-1:2008",{"$f":"INDEX(Table_Standards[#This Row],1,Language_select+3)","v":"Ergonomics - Computer manikins and body templates - Part 1: General requirements (ISO 15536-1:2005)"},"Ergonomie — Computer-Manikins und Körperumrissschablonen —  Teil 1: Allgemeine Anforderungen","Ergonomics - Computer manikins and body templates - Part 1: General requirements (ISO 15536-1:2005)","Ergonomie — Mannequins informatisés et gabarits humains — Partie 1: Exigences générales"]
[null,"---",{"$f":"INDEX(Table_Standards[#This Row],1,Language_select+3)","v":" "}," "," "," "]
[null,null,{"$f":"INDEX(Table_Standards[#This Row],1,Language_select+3)","v":"Safety and reliability of control systems"},"Sicherheit und Zuverlässigkeit von Steuerungen","Safety and reliability of control systems","Français"]
["1.2.1.","EN ISO 4413:2010",{"$f":"INDEX(Table_Standards[#This Row],1,Language_select+3)","v":"Hydraulic fluid power - General rules and safety requirements for systems and their components (ISO 4413:2010)"},"Fluidtechnik — Allgemeine Regeln und sicherheitstechnische Anforderungen  an Hydraulikanlagen und deren Bauteile","Hydraulic fluid power - General rules and safety requirements for systems and their components (ISO 4413:2010)","Transmissions hydrauliques — Règles générales et exigences de sécurité relatives aux systèmes et leurs composants"]
["1.2.1.","EN ISO 4414:2010",{"$f":"INDEX(Table_Standards[#This Row],1,Language_select+3)","v":"Pneumatic fluid power - General rules and safety requirements for systems and their components (ISO 4414:2010)"},"Fluidtechnik — Allgemeine Regeln und sicherheitstechnische Anforderungen  an Pneumatikanlagen und deren Bauteile","Pneumatic fluid power - General rules and safety requirements for systems and their components (ISO 4414:2010)","Transmissions pneumatiques — Règles générales et exigences de sécurité pour les systèmes et leurs composants"]
["1.2.1.","EN ISO 13849-1:2015",{"$f":"INDEX(Table_Standards[#This Row],1,Language_select+3)","v":"Safety of machinery - Safety-related parts of control systems - Part 1: General principles for design (ISO 13849-1:2006)"},"Sicherheit von Maschinen — Sicherheitsbezogene Teile von Steuerungen  — Teil 1: Allgemeine Gestaltungsleitsätze","Safety of machinery - Safety-related parts of control systems - Part 1: General principles for design (ISO 13849-1:2006)","Sécurité des machines — Parties des systèmes de commande relatives à la sécurité — Partie 1: Principes généraux de conception"]
["1.2.1.","EN ISO 13849-2:2012",{"$f":"INDEX(Table_Standards[#This Row],1,Language_select+3)","v":"Safety of machinery - Safety-related parts of control systems - Part 2"},"Sicherheit von Maschinen — Sicherheitsbezogene Teile von Steuerungen  — Teil 2: Validierung","Safety of machinery - Safety-related parts of control systems - Part 2","Sécurité des machines — Parties des systèmes de commande relatives à la sécurité — Partie 2"]
["1.2.1.","EN 16590-1:2014",{"$f":"INDEX(Table_Standards[#This Row],1,Language_select+3)","v":"Tractors and machinery for agriculture and forestry — Safety-related parts of control systems — Part 1: General principles for design and development"},"Traktoren und Maschinen für die Land- und Forstwirtschaft — Sicherheitsbezogene Teile von Steuerungen — Teil 1: Allgemeine Gestaltungs-und Entwicklungsleitsätze","Tractors and machinery for agriculture and forestry — Safety-related parts of control systems — Part 1: General principles for design and development","Tracteurs et matériels agricoles et forestiers — Parties des systèmes de commande relatives à la sécurité — Partie 1: Principes généraux pour la conception et le développement"]
["1.2.1.","EN 16590-2:2014",{"$f":"INDEX(Table_Standards[#This Row],1,Language_select+3)","v":"Tractors and machinery for agriculture and forestry — Safety-related parts of control systems — Part 2: Concept phase"},"Traktoren und Maschinen für die Land- und Forstwirtschaft — Sicherheitsbezogene Teile von Steuerungen — Teil 2: Konzeptphase","Tractors and machinery for agriculture and forestry — Safety-related parts of control systems — Part 2: Concept phase","Tracteurs et matériels agricoles et forestiers — Parties des systèmes de commande relatives à la sécurité — Partie 2: Phase de projet"]
["1.2.1.","EN 60204-1:2018",{"$f":"INDEX(Table_Standards[#This Row],1,Language_select+3)","v":"Safety of machinery - Electrical equipment of machines - Part 1: General requirements IEC 60204-1:2005 (Modified)"},"Sicherheit von Maschinen — Elektrische Ausrüstung von Maschinen —  Teil 1: Allgemeine Anforderungen","Safety of machinery - Electrical equipment of machines - Part 1: General requirements IEC 60204-1:2005 (Modified)","Sécurité des machines — Equipement électrique des machines — Partie 1: Règles générales"]
["1.2.1.","EN 60204-1:2006/A1:2009",{"$f":"INDEX(Table_Standards[#This Row],1,Language_select+3)","v":"Safety of machinery - Electrical equipment of machines - Part 1: General requirements IEC 60204-1:2005 (Modified)"},"Sicherheit von Maschinen — Elektrische Ausrüstung von Maschinen —  Teil 1: Allgemeine Anforderungen","Safety of machinery - Electrical equipment of machines - Part 1: General requirements IEC 60204-1:2005 (Modified)","Sécurité des machines — Equipement électrique des machines — Partie 1: Règles générales"]
["1.2.1.","IEC 60204-1:2005/A1:2008",{"$f":"INDEX(Table_Standards[#This Row],1,Language_select+3)","v":"Safety of machinery - Electrical equipment of machines - Part 1: General requirements IEC 60204-1:2005 (Modified)"},"Sicherheit von Maschinen — Elektrische Ausrüstung von Maschinen —  Teil 1: Allgemeine Anforderungen","Safety of machinery - Electrical equipment of machines - Part 1: General requirements IEC 60204-1:2005 (Modified)","Sécurité des machines — Equipement électrique des machines — Partie 1: Règles générales"]
["1.2.1.","EN 60204-1:2006/AC:2010",{"$f":"INDEX(Table_Standards[#This Row],1,Language_select+3)","v":"Safety of machinery - Electrical equipment of machines - Part 1: General requirements IEC 60204-1:2005 (Modified)"},"Sicherheit von Maschinen — Elektrische Ausrüstung von Maschinen —  Teil 1: Allgemeine Anforderungen","Safety of machinery - Electrical equipment of machines - Part 1: General requirements IEC 60204-1:2005 (Modified)","Sécurité des machines — Equipement électrique des machines — Partie 1: Règles générales"]
["1.2.1.","EN 60204-31:2013",{"$f":"INDEX(Table_Standards[#This Row],1,Language_select+3)","v":"Safety of machinery — Electrical equipment of machines — Part 31: Particular safety and EMC requirements for sewing machines, units and systems"},"Sicherheit von Maschinen — Elektrische Ausrüstung von Maschinen — Teil 31: Besondere Sicherheits- und EMV-Anforderungen an Nähmaschinen, Näheinheiten und Nähanlagen (CENELEC)","Safety of machinery — Electrical equipment of machines — Part 31: Particular safety and EMC requirements for sewing machines, units and systems","Sécurité des machines — Equipement électrique des machines — Partie 31: Exigences particulières de sécurité et de CEM pour machines à coudre, unités et systèmes de couture"]
["1.2.1.","EN 60947-5-3:2013",{"$f":"INDEX(Table_Standards[#This Row],1,Language_select+3)","v":"Low-voltage switchgear and controlgear — Part 5-3: Control circuit devices and switching elements — Requirements for proximity devices with defined behaviour under fault conditions"},"Niederspannungsschaltgeräte — Teil 5-3: Steuergeräte und Schaltelemente — Anforderungen für Näherungsschalter mit definiertem Verhalten unter Fehlerbedingungen (PDDB)","Low-voltage switchgear and controlgear — Part 5-3: Control circuit devices and switching elements — Requirements for proximity devices with defined behaviour under fault conditions","Appareillage à basse tension — Partie 5-3: Appareils et éléments de commutation pour circuits de commande — Exigences pour dispositifs de détection de proximité à comportement défini dans des conditions de défaut"]
["1.2.1.","EN 61800-5-2:2007",{"$f":"INDEX(Table_Standards[#This Row],1,Language_select+3)","v":"Adjustable speed electrical power drive systems — Part 5-2: Safety requirements — Functional"},"Elektrische Leistungsantriebe mit einstellbarer Drehzahl – Teil 5-2: Anforderungen an die Sicherheit – Funktionelle Sicherheit (CENELEC)","Adjustable speed electrical power drive systems — Part 5-2: Safety requirements — Functional","Entraînements électriques de puissance à vitesse variable — Partie 5-2: Exigences de sécurité — Fonctionnalité"]
["1.2.1.","EN 62061:2005 /AC:2010 /A1:2013 /A2:2015",{"$f":"INDEX(Table_Standards[#This Row],1,Language_select+3)","v":"Safety of machinery - Functional safety of safety-related electrical, electronic and programmable electronic control systems IEC 62061:2005"},"Sicherheit von Maschinen — Funktionale Sicherheit sicherheitsbezogener  elektrischer, elektronischer und programmierbarer elektronischer  Steuerungssysteme","Safety of machinery - Functional safety of safety-related electrical, electronic and programmable electronic control systems IEC 62061:2005","Sécurité des machines — Sécurité fonctionnelle des systèmes de commande électriques, électroniques et électroniques programmables relatifs à la sécurité"]
["1.2.1.","EN 62745:2017/A11:2020",{"$f":"INDEX(Table_Standards[#This Row],1,Language_select+3)","v":"Safety of machinery - Requirements for cableless control systems of machinery"},"Sicherheit von Maschinen — Anforderungen für kabellose Steuerungen an Maschinen (IEC 62745:2017)","Safety of machinery - Requirements for cableless control systems of machinery","Sécurité des machines : exigences généralespour les systèmes de commande sans fil des machines"]
[null,"---",{"$f":"INDEX(Table_Standards[#This Row],1,Language_select+3)","v":" "}," "," "," "]
[null,null,{"$f":"INDEX(Table_Standards[#This Row],1,Language_select+3)","v":"Control devices"},"Stellteile","Control devices","Français"]
["1.2.2.","EN 894-1:1997+A1:2008",{"$f":"INDEX(Table_Standards[#This Row],1,Language_select+3)","v":"Safety of machinery - Ergonomics requirements for the design of displays and control actuators - Part 1: General principles for human interactions with displays and control actuators"},"Sicherheit von Maschinen — Ergonomische Anforderungen an die Gestaltung  von Anzeigen und Stellteilen —  Teil 1: Allgemeine Leitsätze für Benutzer-Interaktion mit Anzeigen und  Stellteilen","Safety of machinery - Ergonomics requirements for the design of displays and control actuators - Part 1: General principles for human interactions with displays and control actuators","Sécurité des machines — Spécifications ergonomiques pour la conception des dispositifs de signalisation et des organes de service — Partie 1: Principes généraux des interactions entre l’homme et les dispositifs de signalisation et organes de service"]
["1.2.2.","EN 894-2:1997+A1:2008",{"$f":"INDEX(Table_Standards[#This Row],1,Language_select+3)","v":"Safety of machinery - Ergonomics requirements for the design of displays and control actuators - Part 2: Displays"},"Sicherheit von Maschinen — Ergonomische Anforderungen an die Gestaltung  von Anzeigen und Stellteilen — Teil 2: Anzeigen","Safety of machinery - Ergonomics requirements for the design of displays and control actuators - Part 2: Displays","Sécurité des machines — Spécifications ergonomiques pour la conception des dispositifs de signalisation et des organes de service — Partie 2: Dispositifs de signalisation"]
["1.2.2.","EN 894-3:2000+A1:2008",{"$f":"INDEX(Table_Standards[#This Row],1,Language_select+3)","v":"Safety of machinery - Ergonomics requirements for the design of displays and control actuators - Part 3: Control actuators"},"Sicherheit von Maschinen — Ergonomische Anforderungen an die Gestaltung  von Anzeigen und Stellteilen — Teil 3: Stellteile","Safety of machinery - Ergonomics requirements for the design of displays and control actuators - Part 3: Control actuators","Sécurité des machines — Spécifications ergonomiques pour la conception des dispositifs de signalisation et des organes de service — Partie 3: Organes de service"]
["1.2.2.","EN 894-4:2010",{"$f":"INDEX(Table_Standards[#This Row],1,Language_select+3)","v":"Safety of machinery - Ergonomics requirements for the design of displays and control actuators - Part 4: Location and arrangement of displays and control actuators"},"Sicherheit von Maschinen — Ergonomische Anforderungen an die Gestaltung  von Anzeigen und Stellteilen — Teil 4: Lage und Anordnung von  Anzeigen und Stellteilen","Safety of machinery - Ergonomics requirements for the design of displays and control actuators - Part 4: Location and arrangement of displays and control actuators","Sécurité des machines — Spécifications ergonomiques pour la conception des dispositifs de signalisation et des organes de service — Partie 4: Agencement et arrangement des dispositifs de signalisation et organes de service"]
["1.2.2.","EN 61310-1:2008",{"$f":"INDEX(Table_Standards[#This Row],1,Language_select+3)","v":"Safety of machinery - Indication, marking and actuation - Part 1: Requirements for visual, acoustic and tactile signals IEC 61310-1:2007"},"Sicherheit von Maschinen — Anzeigen, Kennzeichen und Bedienen—  Teil 1: Anforderungen an sichtbare, hörbare und tastbare Signale","Safety of machinery - Indication, marking and actuation - Part 1: Requirements for visual, acoustic and tactile signals IEC 61310-1:2007","Sécurité des machines — Indication, marquage et manoeuvre — Partie 1: Exigences pour les signaux visuels, acoustiques et tactiles"]
["1.2.2.","EN 61310-2:2008",{"$f":"INDEX(Table_Standards[#This Row],1,Language_select+3)","v":"Safety of machinery - Indication, marking and actuation - Part 2: Requirements for marking IEC 61310-2:2007"},"Sicherheit von Maschinen — Anzeigen, Kennzeichen und Bedienen —  Teil 2: Anforderungen an die Kennzeichnung","Safety of machinery - Indication, marking and actuation - Part 2: Requirements for marking IEC 61310-2:2007","Sécurité des machines — Indication, marquage et manoeuvre — Partie 2: Exigences pour le marquage"]
["1.2.2.","EN 61310-3:2008",{"$f":"INDEX(Table_Standards[#This Row],1,Language_select+3)","v":"Safety of machinery - Indication, marking and actuation - Part 3: Requirements for the location and operation of actuators IEC 61310-3:2007"},"Sicherheit von Maschinen — Anzeigen, Kennzeichen und Bedienen —  Teil 3: Anforderungen an die Anordnung und den Betrieb von Bedienteilen","Safety of machinery - Indication, marking and actuation - Part 3: Requirements for the location and operation of actuators IEC 61310-3:2007","Sécurité des machines — Indication, marquage et manoeuvre — Partie 3: Exigences sur la position et le fonctionnement des organes de commande"]
[null,"---",{"$f":"INDEX(Table_Standards[#This Row],1,Language_select+3)","v":" "}," "," "," "]
[null,null,{"$f":"INDEX(Table_Standards[#This Row],1,Language_select+3)","v":"Starting"},"Ingangsetzen","Starting","Français"]
["1.2.3.","EN ISO 14118:2018",{"$f":"INDEX(Table_Standards[#This Row],1,Language_select+3)","v":"Safety of machinery - Prevention of unexpected start-up"},"Sicherheit von Maschinen — Vermeidung von unerwartetem Anlauf","Safety of machinery - Prevention of unexpected start-up","Sécurité des machines — Prévention de la mise en marche intempestive"]
[null,"---",{"$f":"INDEX(Table_Standards[#This Row],1,Language_select+3)","v":" "}," "," "," "]
[null,null,{"$f":"INDEX(Table_Standards[#This Row],1,Language_select+3)","v":"Emergency stop"},"Stillsetzen im Notfall","Emergency stop","Français"]
["1.2.4.3.","EN ISO 13850:2015",{"$f":"INDEX(Table_Standards[#This Row],1,Language_select+3)","v":"Safety of machinery - Emergency stop - Principles for design (ISO 13850:2006)"},"Sicherheit von Maschinen — Not-Halt — Gestaltungsleitsätze","Safety of machinery - Emergency stop - Principles for design (ISO 13850:2006)","Sécurité des machines — Arrêt d’urgence — Principes de conception"]
["1.2.4.3.","EN 60947-5-5:1997+A11:2013",{"$f":"INDEX(Table_Standards[#This Row],1,Language_select+3)","v":"Low-voltage switchgear and controlgear - Part 5-5: Control circuit devices and switching elements - Electrical emergency stop device with mechanical latching function"},"Niederspannungsschaltgeräte — Teil 5-5: Steuergeräte und Schaltelemente — Elektrisches Not-Aus-Gerät mit mechanischer Verrastfunktion","Low-voltage switchgear and controlgear - Part 5-5: Control circuit devices and switching elements - Electrical emergency stop device with mechanical latching function","Appareillage à basse tension — Partie 5-5: Appareils et éléments de commutation pour circuits de commande — Appareil d’arrêt d’urgence électrique à accrochage mécanique"]
["1.2.4.3.","EN 60947-5-5:1997/A2:2017",{"$f":"INDEX(Table_Standards[#This Row],1,Language_select+3)","v":"Low-voltage switchgear and controlgear - Part 5-5: Control circuit devices and switching elements - Electrical emergency stop device with mechanical latching function"},"Niederspannungsschaltgeräte — Teil 5-5: Steuergeräte und Schaltelemente — Elektrisches Not-Aus-Gerät mit mechanischer Verrastfunktion","Low-voltage switchgear and controlgear - Part 5-5: Control circuit devices and switching elements - Electrical emergency stop device with mechanical latching function","Appareillage à basse tension — Partie 5-5: Appareils et éléments de commutation pour circuits de commande — Appareil d’arrêt d’urgence électrique à accrochage mécanique"]
[null,"---",{"$f":"INDEX(Table_Standards[#This Row],1,Language_select+3)","v":" "}," "," "," "]
[null,null,{"$f":"INDEX(Table_Standards[#This Row],1,Language_select+3)","v":"Risk of break-up during operation"},"Bruchrisiko beim Betrieb","Risk of break-up during operation","Français"]
["1.3.2.","EN ISO 4413:2010",{"$f":"INDEX(Table_Standards[#This Row],1,Language_select+3)","v":"Hydraulic fluid power - General rules and safety requirements for systems and their components (ISO 4413:2010)"},"Fluidtechnik — Allgemeine Regeln und sicherheitstechnische Anforderungen  an Hydraulikanlagen und deren Bauteile","Hydraulic fluid power - General rules and safety requirements for systems and their components (ISO 4413:2010)","Transmissions hydrauliques — Règles générales et exigences de sécurité relatives aux systèmes et leurs composants"]
["1.3.2.","EN ISO 4414:2010",{"$f":"INDEX(Table_Standards[#This Row],1,Language_select+3)","v":"Pneumatic fluid power - General rules and safety requirements for systems and their components (ISO 4414:2010)"},"Fluidtechnik — Allgemeine Regeln und sicherheitstechnische Anforderungen  an Pneumatikanlagen und deren Bauteile","Pneumatic fluid power - General rules and safety requirements for systems and their components (ISO 4414:2010)","Transmissions pneumatiques — Règles générales et exigences de sécurité pour les systèmes et leurs composants"]
[null,"---",{"$f":"INDEX(Table_Standards[#This Row],1,Language_select+3)","v":" "}," "," "," "]
[null,null,{"$f":"INDEX(Table_Standards[#This Row],1,Language_select+3)","v":"Risks related to moving parts"},"Risiken durch bewegte Teile","Risks related to moving parts","Français"]
["1.3.7.","EN ISO 13854:2019",{"$f":"INDEX(Table_Standards[#This Row],1,Language_select+3)","v":"Safety of machinery - Minimum gaps to avoid crushing of parts of the human body"},"Sicherheit von Maschinen — Mindestabstände zur Vermeidung des Quetschens von Körperteilen","Safety of machinery - Minimum gaps to avoid crushing of parts of the human body","Sécurité des machines — Ecartements minimaux pour prévenir les risques d’écrasement de parties du corps humain"]
["1.3.7.","EN ISO 11161:2007/A1:2010",{"$f":"INDEX(Table_Standards[#This Row],1,Language_select+3)","v":"Safety of machinery — Integrated manufacturing systems — Basic requirements"},"Sicherheit von Maschinen — Integrierte Fertigungssysteme — Grundlegende Anforderungen","Safety of machinery — Integrated manufacturing systems — Basic requirements","Sécurité des machines — Systèmes de fabrication intégrés — Prescriptions fondamentales"]
[]
["1.3.7.","EN ISO 13857:2019",{"$f":"INDEX(Table_Standards[#This Row],1,Language_select+3)","v":"Safety of machinery - Safety distances to prevent hazard zones being reached by upper and lower limbs (ISO 13857:2008)"},"Sicherheit von Maschinen — Sicherheitsabstände gegen das Erreichen  von Gefährdungsbereichen mit den oberen und unteren Gliedmaßen","Safety of machinery - Safety distances to prevent hazard zones being reached by upper and lower limbs (ISO 13857:2008)","Sécurité des machines — Distances de sécurité empêchant les membres supérieurs et inférieurs d’atteindre les zones dangereuses"]
[null,"---",{"$f":"INDEX(Table_Standards[#This Row],1,Language_select+3)","v":" "}," "," "," "]
[null,null,{"$f":"INDEX(Table_Standards[#This Row],1,Language_select+3)","v":"Special requirements for guards"},"Besondere Anforderungen an trennende Schutzeinrichtungen","Special requirements for guards","Français"]
["1.4.2.","EN ISO 14120:2015",{"$f":"INDEX(Table_Standards[#This Row],1,Language_select+3)","v":"Safety of machinery — Guards — General requirements for the design and construction of fixed and movable guards"},"Sicherheit von Maschinen — Trennende Schutzeinrichtungen — Allgemeine Anforderungen an Gestaltung, Bau und Auswahl von feststehenden und beweglichen trennenden Schutzeinrichtungen","Safety of machinery — Guards — General requirements for the design and construction of fixed and movable guards","Français"]
[null,"---",{"$f":"INDEX(Table_Standards[#This Row],1,Language_select+3)","v":" "}," "," "," "]
[null,null,{"$f":"INDEX(Table_Standards[#This Row],1,Language_select+3)","v":"Interlocking movable guards"},"Beweglich trennende Schutzeinrichtungen mit Verriegelungen","Interlocking movable guards","Français"]
["1.4.2.2.","EN ISO 14119:2013",{"$f":"INDEX(Table_Standards[#This Row],1,Language_select+3)","v":"Safety of machinery - Interlocking devices associated with guards - Principles for design and selection"},"Sicherheit von Maschinen — Verriegelungseinrichtungen in Verbindung mit trennenden Schutzeinrichtungen — Leitsätze für Gestaltung und Auswahl","Safety of machinery - Interlocking devices associated with guards - Principles for design and selection","Sécurité des machines — Dispositifs de verrouillage associés à des protecteurs — Principes de conception et de choix"]
[null,"---",{"$f":"INDEX(Table_Standards[#This Row],1,Language_select+3)","v":" "}," "," "," "]
[null,null,{"$f":"INDEX(Table_Standards[#This Row],1,Language_select+3)","v":"Special requirements for protective devices"},"Besondere Anforderungen an nicht trennende Schutzeinrichtungen","Special requirements for protective devices","Français"]
["1.4.3.","EN ISO 13851:2019",{"$f":"INDEX(Table_Standards[#This Row],1,Language_select+3)","v":"Safety of machinery - Two-hand control devices - Functional aspects - Principles for design"},"Sicherheit von Maschinen — Zweihandschaltungen — Funktionelle  Aspekte und Gestaltungsleitsätze","Safety of machinery - Two-hand control devices - Functional aspects - Principles for design","Sécurité des machines — Dispositifs de commande bimanuelle — Aspects fonctionnels — Principes de conception"]
["1.4.3.","EN ISO 13855:2010",{"$f":"INDEX(Table_Standards[#This Row],1,Language_select+3)","v":"Safety of machinery - Positioning of safeguards with respect to the approach speeds of parts of the human body (ISO 13855:2010)"},"Sicherheit von Maschinen — Anordnung von Schutzeinrichtungen im  Hinblick auf Annäherungsgeschwindigkeiten von Körperteilen","Safety of machinery - Positioning of safeguards with respect to the approach speeds of parts of the human body (ISO 13855:2010)","Sécurité des machines — Positionnement des moyens de protection par rapport à la vitesse d’approche des parties du corps"]
["1.4.3.","EN ISO 13856-1:2013",{"$f":"INDEX(Table_Standards[#This Row],1,Language_select+3)","v":"Safety of machinery - Pressure-sensitive protective devices - Part 1: General principles for the design and testing of pressure-sensitive mats and pressure-sensitive floors"},"Sicherheit von Maschinen — Druckempfindliche Schutzeinrichtungen — Teil 1: Allgemeine Leitsätze für die Gestaltung und Prüfung von Schaltmatten und Schaltplatten","Safety of machinery - Pressure-sensitive protective devices - Part 1: General principles for the design and testing of pressure-sensitive mats and pressure-sensitive floors","Sécurité des machines — Dispositifs de protection sensibles à la pression — Partie 1: Principes généraux de conception et d’essai des tapis et planchers sensibles à la pression"]
["1.4.3.","EN ISO 13856-2:2013",{"$f":"INDEX(Table_Standards[#This Row],1,Language_select+3)","v":"Safety of machinery - Pressure-sensitive protective devices - Part 2: General principles for the design and testing of pressure-sensitive edges and pressure-sensitive bars"},"Sicherheit von Maschinen — Druckempfindliche Schutzeinrichtungen — Teil 2: Allgemeine Leitsätze für die Gestaltung und Prüfung von Schaltleisten und Schaltstangen","Safety of machinery - Pressure-sensitive protective devices - Part 2: General principles for the design and testing of pressure-sensitive edges and pressure-sensitive bars","Sécurité des machines — Dispositifs de protection sensibles à la pression — Partie 2: Principes généraux de conception et d’essai des bords et barres sensibles à la pression"]
["1.4.3.","EN ISO 13856-3:2013",{"$f":"INDEX(Table_Standards[#This Row],1,Language_select+3)","v":"Safety of machinery - Pressure-sensitive protective devices - Part 3: General principles for design and testing of pressure-sensitive bumpers, plates, wires and similar devices "},"Sicherheit von Maschinen — Druckempfindliche Schutzeinrichtungen — Teil 3: Allgemeine Leitsätze für die Gestaltung und Prüfung von Schaltpuffern, Schaltflächen, Schaltleinen und ähnlichen Einrichtungen","Safety of machinery - Pressure-sensitive protective devices - Part 3: General principles for design and testing of pressure-sensitive bumpers, plates, wires and similar devices ","Sécurité des machines — Dispositifs de protection sensibles à la pression — Partie 3: Principes généraux de conception et d’essai des pare-chocs, plaques, câbles et dispositifs analogues sensibles à la pression"]
["1.4.3.","EN 61496-1:2013",{"$f":"INDEX(Table_Standards[#This Row],1,Language_select+3)","v":"Safety of machinery - Electro-sensitive protective equipment - Part 1: General requirements and tests IEC 61496-1:2004 (Modified)"},"Sicherheit von Maschinen — Berührungslos wirkende Schutzeinrichtungen  — Teil 1: Allgemeine Anforderungen und Prüfungen","Safety of machinery - Electro-sensitive protective equipment - Part 1: General requirements and tests IEC 61496-1:2004 (Modified)","Sécurité des machines — Équipements de protection électro-sensibles — Partie 1: Prescriptions générales et essais"]
[null,"---",{"$f":"INDEX(Table_Standards[#This Row],1,Language_select+3)","v":" "}," "," "," "]
[null,null,{"$f":"INDEX(Table_Standards[#This Row],1,Language_select+3)","v":"Electricity supply"},"Elektrische Energieversorgung","Electricity supply","Français"]
["1.5.01.","EN 60204-1:2018",{"$f":"INDEX(Table_Standards[#This Row],1,Language_select+3)","v":"Safety of machinery - Electrical equipment of machines - Part 1: General requirements IEC 60204-1:2005 (Modified)"},"Sicherheit von Maschinen — Elektrische Ausrüstung von Maschinen —  Teil 1: Allgemeine Anforderungen","Safety of machinery - Electrical equipment of machines - Part 1: General requirements IEC 60204-1:2005 (Modified)","Sécurité des machines — Equipement électrique des machines — Partie 1: Règles générales"]
["1.5.01.","EN 60204-1:2006/A1:2009",{"$f":"INDEX(Table_Standards[#This Row],1,Language_select+3)","v":"Safety of machinery - Electrical equipment of machines - Part 1: General requirements IEC 60204-1:2005 (Modified)"},"Sicherheit von Maschinen — Elektrische Ausrüstung von Maschinen —  Teil 1: Allgemeine Anforderungen","Safety of machinery - Electrical equipment of machines - Part 1: General requirements IEC 60204-1:2005 (Modified)","Sécurité des machines — Equipement électrique des machines — Partie 1: Règles générales"]
["1.5.01.","IEC 60204-1:2005/A1:2008",{"$f":"INDEX(Table_Standards[#This Row],1,Language_select+3)","v":"Safety of machinery - Electrical equipment of machines - Part 1: General requirements IEC 60204-1:2005 (Modified)"},"Sicherheit von Maschinen — Elektrische Ausrüstung von Maschinen —  Teil 1: Allgemeine Anforderungen","Safety of machinery - Electrical equipment of machines - Part 1: General requirements IEC 60204-1:2005 (Modified)","Sécurité des machines — Equipement électrique des machines — Partie 1: Règles générales"]
["1.5.01.","EN 60204-1:2006/AC:2010",{"$f":"INDEX(Table_Standards[#This Row],1,Language_select+3)","v":"Safety of machinery - Electrical equipment of machines - Part 1: General requirements IEC 60204-1:2005 (Modified)"},"Sicherheit von Maschinen — Elektrische Ausrüstung von Maschinen —  Teil 1: Allgemeine Anforderungen","Safety of machinery - Electrical equipment of machines - Part 1: General requirements IEC 60204-1:2005 (Modified)","Sécurité des machines — Equipement électrique des machines — Partie 1: Règles générales"]
["1.5.01.","EN IEC 60204-11:2019",{"$f":"INDEX(Table_Standards[#This Row],1,Language_select+3)","v":"Safety of machinery - Electrical equipment of machines - Part 11: Requirements for HV equipment for voltages above 1 000 V a.c. or 1 500 V d.c. and not exceeding 36 kV IEC 60204-11:2000"},"Sicherheit von Maschinen — Elektrische Ausrüstung von Maschinen —  Teil 11: Anforderungen an Ausrüstung für Spannungen  über 1000 V Wechselspannung oder 1 500 V Gleichspannung, aber nicht  über 36 kV","Safety of machinery - Electrical equipment of machines - Part 11: Requirements for HV equipment for voltages above 1 000 V a.c. or 1 500 V d.c. and not exceeding 36 kV IEC 60204-11:2000","Sécurité des machines — Equipement électrique des machines — Partie 11: Prescriptions pour les équipements HT fonctionnant à des tensions supérieures à 1 000 V c.a. ou 1 500 V c.c. et ne dépassant pas 36 kV"]
["1.5.01.","EN 60204-11:2000",{"$f":"INDEX(Table_Standards[#This Row],1,Language_select+3)","v":"Safety of machinery - Electrical equipment of machines - Part 11: Requirements for HV equipment for voltages above 1 000 V a.c. or 1 500 V d.c. and not exceeding 36 kV IEC 60204-11:2000"},"Sicherheit von Maschinen — Elektrische Ausrüstung von Maschinen —  Teil 11: Anforderungen an Hochspannungsausrüstung für Spannungen  über 1000 V Wechselspannung oder 1 500 V Gleichspannung aber nicht  über 36 kV","Safety of machinery - Electrical equipment of machines - Part 11: Requirements for HV equipment for voltages above 1 000 V a.c. or 1 500 V d.c. and not exceeding 36 kV IEC 60204-11:2000","Sécurité des machines — Equipement électrique des machines — Partie 11: Prescriptions pour les équipements HT fonctionnant à des tensions supérieures à 1 000 V c.a. ou 1 500 V c.c. et ne dépassant pas 36 kV"]
["1.5.01.","EN 60204-11:2000/AC:2010",{"$f":"INDEX(Table_Standards[#This Row],1,Language_select+3)","v":"Safety of machinery - Electrical equipment of machines - Part 11: Requirements for HV equipment for voltages above 1 000 V a.c. or 1 500 V d.c. and not exceeding 36 kV IEC 60204-11:2000"},"Sicherheit von Maschinen — Elektrische Ausrüstung von Maschinen —  Teil 11: Anforderungen an Hochspannungsausrüstung für Spannungen  über 1000 V Wechselspannung oder 1 500 V Gleichspannung aber nicht  über 36 kV","Safety of machinery - Electrical equipment of machines - Part 11: Requirements for HV equipment for voltages above 1 000 V a.c. or 1 500 V d.c. and not exceeding 36 kV IEC 60204-11:2000","Sécurité des machines — Equipement électrique des machines — Partie 11: Prescriptions pour les équipements HT fonctionnant à des tensions supérieures à 1 000 V c.a. ou 1 500 V c.c. et ne dépassant pas 36 kV"]
["1.5.01.","EN 60204-32:2008",{"$f":"INDEX(Table_Standards[#This Row],1,Language_select+3)","v":"Safety of machinery - Electrical equipment of machines - Part 32: Requirements for hoisting machines IEC 60204-32:2008"},"Sicherheit von Maschinen — Elektrische Ausrüstung von Maschinen —  Teil 32: Anforderungen für Hebezeuge","Safety of machinery - Electrical equipment of machines - Part 32: Requirements for hoisting machines IEC 60204-32:2008","Sécurité des machines — Équipement électrique des machines — Partie 32: Exigences pour les appareils de levage"]
["1.5.01.","EN 60204-33:2011",{"$f":"INDEX(Table_Standards[#This Row],1,Language_select+3)","v":"Safety of machinery - Electrical equipment of machines – Part 33: Requirements for semiconductor fabrication equipment IEC 60204-33:2009 (Modified)"},"Sicherheit von Maschinen — Elektrische Ausrüstungen von Maschinen — Teil 33: Anforderungen an Fertigungseinrichtungen für Halbleiter","Safety of machinery - Electrical equipment of machines – Part 33: Requirements for semiconductor fabrication equipment IEC 60204-33:2009 (Modified)","Sécurité des machines — Equipement électrique des machines — Partie 33: Exigences pour les équipements de fabrication des semi-conducteurs"]
["1.5.01.","EN 61800-5-2:2007",{"$f":"INDEX(Table_Standards[#This Row],1,Language_select+3)","v":"Adjustable speed electrical power drive systems - Part 5-2: Safety requirements - Functional IEC 61800-5-2:2007"},"Elektrische Leistungsantriebe mit einstellbarer Drehzahl –  Teil 5-2: Anforderungen an die Sicherheit – Funktionelle Sicherheit","Adjustable speed electrical power drive systems - Part 5-2: Safety requirements - Functional IEC 61800-5-2:2007","Entraînements électriques de puissance à vitesse variable — Partie 5-2: Exigences de sécurité — Fonctionnalité"]
[null,"---",{"$f":"INDEX(Table_Standards[#This Row],1,Language_select+3)","v":" "}," "," "," "]
[null,null,{"$f":"INDEX(Table_Standards[#This Row],1,Language_select+3)","v":"Energy supply other than electricity"},"Nichtelektrische Energieversorgung","Energy supply other than electricity","Français"]
["1.5.03.","EN ISO 4413:2010",{"$f":"INDEX(Table_Standards[#This Row],1,Language_select+3)","v":"Hydraulic fluid power - General rules and safety requirements for systems and their components (ISO 4413:2010)"},"Fluidtechnik — Allgemeine Regeln und sicherheitstechnische Anforderungen  an Hydraulikanlagen und deren Bauteile","Hydraulic fluid power - General rules and safety requirements for systems and their components (ISO 4413:2010)","Transmissions hydrauliques — Règles générales et exigences de sécurité relatives aux systèmes et leurs composants"]
["1.5.03.","EN ISO 4414:2010",{"$f":"INDEX(Table_Standards[#This Row],1,Language_select+3)","v":"Pneumatic fluid power - General rules and safety requirements for systems and their components (ISO 4414:2010)"},"Fluidtechnik — Allgemeine Regeln und sicherheitstechnische Anforderungen  an Pneumatikanlagen und deren Bauteile","Pneumatic fluid power - General rules and safety requirements for systems and their components (ISO 4414:2010)","Transmissions pneumatiques — Règles générales et exigences de sécurité pour les systèmes et leurs composants"]
[null,"---",{"$f":"INDEX(Table_Standards[#This Row],1,Language_select+3)","v":" "}," "," "," "]
[null,null,{"$f":"INDEX(Table_Standards[#This Row],1,Language_select+3)","v":"Extreme temperatures"},"Extreme Temperaturen","Extreme temperatures","Français"]
["1.5.05.","EN ISO 13732-1:2008",{"$f":"INDEX(Table_Standards[#This Row],1,Language_select+3)","v":"Ergonomics of the thermal environment - Methods for the assessment of human responses to contact with surfaces - Part 1: Hot surfaces (ISO 13732-1:2006)"},"Ergonomie der thermischen Umgebung — Bewertungsverfahren für  menschliche Reaktionen bei Kontakt mit Oberflächen — Teil 1: Heiße  Oberflächen","Ergonomics of the thermal environment - Methods for the assessment of human responses to contact with surfaces - Part 1: Hot surfaces (ISO 13732-1:2006)","Ergonomie des ambiances thermiques — Méthodes d’évaluation de la réponse humaine au contact avec des surfaces — Partie 1: Surfaces chaudes"]
["1.5.05.","EN ISO 13732-3:2008",{"$f":"INDEX(Table_Standards[#This Row],1,Language_select+3)","v":"Ergonomics of the thermal environment - Methods for the assessment of human responses to contact with surfaces - Part 3: Cold surfaces (ISO 13732-3:2005)"},"Ergonomie der thermischen Umgebung — Bewertungsmethoden für  Reaktionen des Menschen bei Kontakt mit Oberflächen — Teil 3: Kalte  Oberflächen","Ergonomics of the thermal environment - Methods for the assessment of human responses to contact with surfaces - Part 3: Cold surfaces (ISO 13732-3:2005)","Ergonomie des ambiances thermiques — Méthodes d’évaluation de la réponse humaine au contact avec des surfaces — Partie 3: Surfaces froides"]
[null,"---",{"$f":"INDEX(Table_Standards[#This Row],1,Language_select+3)","v":" "}," "," "," "]
[null,null,{"$f":"INDEX(Table_Standards[#This Row],1,Language_select+3)","v":"Fire"},"Brand","Fire","Français"]
["1.5.06.","EN ISO 19353:2019",{"$f":"INDEX(Table_Standards[#This Row],1,Language_select+3)","v":"Safety of machinery - Fire prevention and fire protection"},"Sicherheit von Maschinen — Vorbeugender und abwehrender Brandschutz","Safety of machinery - Fire prevention and fire protection","Sécurité des machines — Prévention et protection contre l’incendie"]
["1.5.06.","EN ISO 19353:2016",{"$f":"INDEX(Table_Standards[#This Row],1,Language_select+3)","v":"Safety of machinery - Fire prevention and fire protection"},"Sicherheit von Maschinen — Vorbeugender und abwehrender Brandschutz","Safety of machinery - Fire prevention and fire protection","Sécurité des machines — Prévention et protection contre l’incendie"]
[null,"---",{"$f":"INDEX(Table_Standards[#This Row],1,Language_select+3)","v":" "}," "," "," "]
[null,null,{"$f":"INDEX(Table_Standards[#This Row],1,Language_select+3)","v":"Explosion"},"Explosion","Explosion","Français"]
["1.5.07.","EN 1127-1:2019",{"$f":"INDEX(Table_Standards[#This Row],1,Language_select+3)","v":"Explosive atmospheres - Explosion prevention and protection - Part 1: Basic concepts and methodology"},"Explosionsfähige Atmosphären — Explosionsschutz — Teil 1: Grundlagen  und Methodik","Explosive atmospheres - Explosion prevention and protection - Part 1: Basic concepts and methodology","Atmosphères explosives — Prévention de l’explosion et protection contre l’explosion — Partie 1: Notions fondamentales et méthodologie"]
["1.5.07.","EN 1127-1:2011",{"$f":"INDEX(Table_Standards[#This Row],1,Language_select+3)","v":"Explosive atmospheres - Explosion prevention and protection - Part 1: Basic concepts and methodology"},"Explosionsfähige Atmosphären — Explosionsschutz — Teil 1: Grundlagen  und Methodik (<-- A-Norm)","Explosive atmospheres - Explosion prevention and protection - Part 1: Basic concepts and methodology","Atmosphères explosives — Prévention de l’explosion et protection contre l’explosion — Partie 1: Notions fondamentales et méthodologie"]
["1.5.07.","EN 1127-2:2014",{"$f":"INDEX(Table_Standards[#This Row],1,Language_select+3)","v":"Explosive atmospheres - Explosion prevention and protection - Part 2: Basic concepts and methodology for mining"},"Explosionsfähige Atmosphären — Explosionsschutz — Teil 2: Grundlagen  und Methodik in Bergwerken (<-- A-Norm)","Explosive atmospheres - Explosion prevention and protection - Part 2: Basic concepts and methodology for mining","Atmosphères explosives — Prévention de l’explosion et protection contre l’explosion — Partie 2: Notions fondamentales et méthodologie dans l’exploitation des mines"]
["1.5.07.","EN 15967:2011",{"$f":"INDEX(Table_Standards[#This Row],1,Language_select+3)","v":"Determination of maximum explosion pressure and the maximum rate of pressure rise of gases and vapours"},"Verfahren zur Bestimmung des maximalen Explosionsdruckes und des  maximalen zeitlichen Druckanstieges für Gase und Dämpfe","Determination of maximum explosion pressure and the maximum rate of pressure rise of gases and vapours","Détermination de la pression maximale d’explosion et de la vitesse maximale de montée en pression des gaz et des vapeurs"]
["1.5.07.","EN 50223:2015",{"$f":"INDEX(Table_Standards[#This Row],1,Language_select+3)","v":"Stationary electrostatic application equipment for ignitable flock material - Safety requirements"},"Stationäre elektrostatische Flockanlagen für entzündbaren Flock —  Sicherheitsanforderungen","Stationary electrostatic application equipment for ignitable flock material - Safety requirements","Matériel fixe de projection électrostatique de flock inflammable — Exigences de sécurité"]
[null,"---",{"$f":"INDEX(Table_Standards[#This Row],1,Language_select+3)","v":" "}," "," "," "]
[null,null,{"$f":"INDEX(Table_Standards[#This Row],1,Language_select+3)","v":"Noise"},"Lärm","Noise","Français"]
["1.5.08.","EN ISO 3741:2010",{"$f":"INDEX(Table_Standards[#This Row],1,Language_select+3)","v":"Acoustics - Determination of sound power levels and sound energy levels of noise sources using sound pressure - Precision methods for reverberation test rooms (ISO 3741:2010)"},"Akustik — Ermittlung der Schallleistungspegel von Geräuschquellen  durch Schalldruckmessungen — Hallraumverfahren der Genauigkeitsklasse  1","Acoustics - Determination of sound power levels and sound energy levels of noise sources using sound pressure - Precision methods for reverberation test rooms (ISO 3741:2010)","Acoustique — Détermination des niveaux de puissance et des niveaux d’énergie acoustiques émis par les sources de bruit à partir de la pression acoustique — Méthodes de laboratoire en salles d’essais réverbérantes"]
["1.5.08.","EN ISO 3743-1:2010",{"$f":"INDEX(Table_Standards[#This Row],1,Language_select+3)","v":"Acoustics - Determination of sound power levels and sound energy levels of noise sources using sound pressure - Engineering methods for small movable sources in reverberant fields - Part 1: Comparison method for a hard-walled test room (ISO 3743- 1:2010)"},"Akustik — Bestimmung der Schallleistungspegel von Geräuschquellen —  Verfahren der Genauigkeitsklasse 2 für kleine, transportable Quellen in  Hallfeldern —  Teil 1: Vergleichsverfahren in Prüfverfahren mit schallharten Wänden","Acoustics - Determination of sound power levels and sound energy levels of noise sources using sound pressure - Engineering methods for small movable sources in reverberant fields - Part 1: Comparison method for a hard-walled test room (ISO 3743- 1:2010)","Acoustique — Détermination des niveaux de puissance acoustique et des niveaux d’énergie acoustique émis par les sources de bruit à partir de la pression acoustique — Méthodes d’expertise en champ réverbéré applicables aux petites\nsources transportables — Partie 1: Méthode par comparaison en salle d’essai à parois dures"]
["1.5.08.","EN ISO 3743-2:2019",{"$f":"INDEX(Table_Standards[#This Row],1,Language_select+3)","v":"Acoustics - Determination of sound power levels of noise sources using sound pressure - Engineering methods for small, movable sources in reverberant fields - Part 2: Methods for special reverberation test rooms (ISO 3743-2:1994)"},"Akustik — Bestimmung der Schallleistungspegel von Geräuschquellen  aus Schalldruckmessungen — Verfahren der Genauigkeitsklasse 2 für  kleine, transportable Quellen in Hallfeldern —  Teil 2: Verfahren für Sonder-Hallräume","Acoustics - Determination of sound power levels of noise sources using sound pressure - Engineering methods for small, movable sources in reverberant fields - Part 2: Methods for special reverberation test rooms (ISO 3743-2:1994)","Acoustique — Détermination des niveaux de puissance acoustique et des niveaux d’énergie acoustique émis par les sources de bruit à partir de la pression acoustique — Méthodes d’expertise en champ réverbéré applicables aux petites\nsources transportables — Partie 2: Méthodes en salle d’essai réverbérante spéciale"]
["1.5.08.","EN ISO 3744:2010",{"$f":"INDEX(Table_Standards[#This Row],1,Language_select+3)","v":"Acoustics - Determination of sound power levels and sound energy levels of noise sources using sound pressure - Engineering methods for an essentially free field over a reflecting plane (ISO 3744:2010)"},"Akustik — Bestimmung der Schallleistungspegel von Geräuschquellen  aus Schalldruckmessungen — Hüllflächenverfahren der Genauigkeitsklasse  2 für ein im Wesentlichen freies Schallfeld über einer reflektierenden  Ebene","Acoustics - Determination of sound power levels and sound energy levels of noise sources using sound pressure - Engineering methods for an essentially free field over a reflecting plane (ISO 3744:2010)","Acoustique — Détermination des niveaux de puissance et d’énergie acoustiques émis par les sources de bruit à partir de la pression acoustique — Méthodes d’expertise pour des conditions approchant celles du champ libre sur plan\nréfléchissant"]
["1.5.08.","EN ISO 3745:2012/A1:2017",{"$f":"INDEX(Table_Standards[#This Row],1,Language_select+3)","v":"Acoustics - Determination of sound power levels and sound energy levels of noise sources using sound pressure - Precision methods for anechoic rooms and hemi- anechoic rooms (ISO 3745:2012)"},"Akustik — Bestimmung der Schallleistungspegel von Geräuschquellen  aus Schalldruckmessungen — Verfahren der Genauigkeitsklasse 1 für  reflexionsarme Räume und Halbräume","Acoustics - Determination of sound power levels and sound energy levels of noise sources using sound pressure - Precision methods for anechoic rooms and hemi- anechoic rooms (ISO 3745:2012)","Acoustique — Détermination des niveaux de puissance acoustique et des niveaux d’énergie acoustique émis par les sources de bruit à partir de la pression acoustique — Méthodes de laboratoire pour les salles anéchoïques et les\nsalles semi-anéchoïques"]
["1.5.08.","EN ISO 3746:2010",{"$f":"INDEX(Table_Standards[#This Row],1,Language_select+3)","v":"Acoustics - Determination of sound power levels and sound energy levels of noise sources using sound pressure - Survey method using an enveloping measurement surface over a reflecting plane (ISO 3746:2010)"},"Akustik — Bestimmung der Schallleistungspegel von Geräuschquellen  aus Schalldruckmessungen — Hüllflächenverfahren der Genauigkeitsklasse  3 über einer reflektierenden Ebene","Acoustics - Determination of sound power levels and sound energy levels of noise sources using sound pressure - Survey method using an enveloping measurement surface over a reflecting plane (ISO 3746:2010)","Acoustique — Détermination des niveaux de puissance acoustique et des niveaux d’énergie acoustique émis par les sources de bruit à partir de la pression acoustique — Méthode de contrôle employant une surface de mesure enveloppante\nau-dessus d’un plan réfléchissant"]
["1.5.08.","EN ISO 3747:2010",{"$f":"INDEX(Table_Standards[#This Row],1,Language_select+3)","v":"Acoustics - Determination of sound power levels and sound energy levels of noise sources using sound pressure - Engineering/ survey methods for use in situ in a reverberant environment (ISO 3747:2010)"},"Akustik — Bestimmung der Schallleistungspegel von Geräuschquellen  aus Schalldruckmessungen –Vergleichsverfahren zur Verwendung unter  Einsatzbedingungen","Acoustics - Determination of sound power levels and sound energy levels of noise sources using sound pressure - Engineering/ survey methods for use in situ in a reverberant environment (ISO 3747:2010)","Acoustique — Détermination des niveaux de puissance acoustique et des niveaux d’énergie acoustique émis par les sources de bruit à partir de la pression acoustique — Méthode d’expertise et de contrôle pour une utilisation in situ en\nenvironnement réverbérant"]
["1.5.08.","EN ISO 4871:2009",{"$f":"INDEX(Table_Standards[#This Row],1,Language_select+3)","v":"Acoustics - Declaration and verification of noise emission values of machinery and equipment (ISO 4871:1996)"},"Akustik — Angabe und Nachprüfung von Geräuschemissionswerten von  Maschinen und Geräten","Acoustics - Declaration and verification of noise emission values of machinery and equipment (ISO 4871:1996)","Acoustique — Déclaration et vérification des valeurs d’émission sonore des machines et équipements"]
["1.5.08.","EN ISO 5136:2009",{"$f":"INDEX(Table_Standards[#This Row],1,Language_select+3)","v":"Acoustics - Determination of sound power radiated into a duct by fans and other air- moving devices - In-duct method (ISO 5136:2003)"},"Akustik — Bestimmung der von Ventilatoren und anderen Strömungsmaschinen  in Kanäle abgestrahlten Schallleistung — Kanalverfahren","Acoustics - Determination of sound power radiated into a duct by fans and other air- moving devices - In-duct method (ISO 5136:2003)","Acoustique — Détermination de la puissance acoustique rayonnée dans un conduit par des ventilateurs et d’autres systèmes de ventilation — Méthode en conduit"]
["1.5.08.","EN ISO 7235:2009",{"$f":"INDEX(Table_Standards[#This Row],1,Language_select+3)","v":"Acoustics - Laboratory measurement procedures for ducted silencers and air- terminal units - Insertion loss, flow noise and total pressure loss (ISO 7235:2003)"},"Akustik — Labormessungen an Schalldämpfern in Kanälen — Einfügungsdämpfung,  Strömungsgeräusch und Gesamtdruckverlust","Acoustics - Laboratory measurement procedures for ducted silencers and air- terminal units - Insertion loss, flow noise and total pressure loss (ISO 7235:2003)","Acoustique — Modes opératoires de mesure en laboratoire pour silencieux en conduit et unités terminales — Perte d’insertion, bruit d’écoulement et perte de pression totale"]
["1.5.08.","EN ISO 9614-1:2009",{"$f":"INDEX(Table_Standards[#This Row],1,Language_select+3)","v":"Acoustics - Determination of sound power levels of noise sources using sound intensity - Part 1: Measurement at discrete points (ISO 9614-1:1993)"},"Akustik — Bestimmung der Schallleistungspegel von Schallquellen aus  Schallintensitätsmessungen — Teil 1: Messungen an diskreten Punkten","Acoustics - Determination of sound power levels of noise sources using sound intensity - Part 1: Measurement at discrete points (ISO 9614-1:1993)","Acoustique — Détermination par intensimétrie des niveaux de puissance acoustique émis par les sources de bruit — Partie 1: Mesurages par points"]
["1.5.08.","EN ISO 9614-3:2009",{"$f":"INDEX(Table_Standards[#This Row],1,Language_select+3)","v":"Acoustics - Determination of sound power levels of noise sources using sound intensity - Part 3: Precision method for measurement by scanning (ISO 9614-3:2002)"},"Akustik — Bestimmung der Schallleistungspegel von Geräuschquellen  aus Schallintensitätsmessungen —  Teil 3: Scanning-Verfahren der Genauigkeitsklasse 1","Acoustics - Determination of sound power levels of noise sources using sound intensity - Part 3: Precision method for measurement by scanning (ISO 9614-3:2002)","Acoustique — Détermination par intensimétrie des niveaux de puissance acoustique émis par les sources de bruit — Partie 3: Méthode de précision pour mesurage par balayage"]
["1.5.08.","EN ISO 11201:2010",{"$f":"INDEX(Table_Standards[#This Row],1,Language_select+3)","v":"Acoustics - Noise emitted by machinery and equipment - Determination of emission sound pressure levels at a work station and at other specified positions in an essentially free field over a reflecting plane with negligible environmental corrections (ISO 11201:2010)"},"Akustik — Geräuschabstrahlung von Maschinen und Geräten — Bestimmung  von Emissions-Schalldruckpegeln am Arbeitsplatz und an  anderen festgelegten Orten in einem im Wesentlichen freien Schallfeld  über einer reflektierenden Ebene mit vernachlässigbaren Umgebungskorrekturen","Acoustics - Noise emitted by machinery and equipment - Determination of emission sound pressure levels at a work station and at other specified positions in an essentially free field over a reflecting plane with negligible environmental corrections (ISO 11201:2010)","Acoustique — Bruit émis par les machines et équipements — Détermination des niveaux de pression acoustique d’émission au poste de travail et en d’autres positions spécifiées dans des conditions approchant celles du champ libre sur\nplan réfléchissant avec des corrections d’environnement négligeables"]
["1.5.08.","EN ISO 11202:2010",{"$f":"INDEX(Table_Standards[#This Row],1,Language_select+3)","v":"Acoustics - Noise emitted by machinery and equipment - Determination of emission sound pressure levels at a work station and at other specified positions applying approximate environmental corrections (ISO 11202:2010)"},"Akustik — Geräuschabstrahlung von Maschinen und Geräten — Bestimmung  von Emissions-Schalldruckpegeln am Arbeitsplatz und an  anderen festgelegten Orten unter Anwendung angenäherter Umgebungskorrekturen","Acoustics - Noise emitted by machinery and equipment - Determination of emission sound pressure levels at a work station and at other specified positions applying approximate environmental corrections (ISO 11202:2010)","Acoustique — Bruit émis par les machines et équipements — Détermination des niveaux de pression acoustique d’émission au poste de travail et en d’autres positions spécifiées en appliquant des corrections d’environnement approximatives"]
["1.5.08.","EN ISO 11203:2009/A1:2020",{"$f":"INDEX(Table_Standards[#This Row],1,Language_select+3)","v":"Acoustics - Noise emitted by machinery and equipment - Determination of emission sound pressure levels at a work station and at other specified positions from the sound power level (ISO 11203:1995)"},"Akustik — Geräuschabstrahlung von Maschinen und Geräten — Bestimmung  von Emissions-Schalldruckpegeln am Arbeitsplatz und an  anderen festgelegten Orten aus dem Schallleistungspegel","Acoustics - Noise emitted by machinery and equipment - Determination of emission sound pressure levels at a work station and at other specified positions from the sound power level (ISO 11203:1995)","Acoustique — Bruit émis par les machines et équipements — Détermination des niveaux de pression acoustique d’émission au poste de travail et en d’autres positions spécifiées à partir du niveau de puissance acoustique"]
["1.5.08.","EN ISO 11204:2010",{"$f":"INDEX(Table_Standards[#This Row],1,Language_select+3)","v":"Acoustics - Noise emitted by machinery and equipment - Determination of emission sound pressure levels at a work station and at other specified positions applying accurate environmental corrections (ISO 11204:2010)"},"Akustik — Geräuschabstrahlung von Maschinen und Geräten — Bestimmung  von Emissions-Schalldruckpegeln am Arbeitsplatz und an  anderen festgelegten Orten unter Anwendung exakter Umgebungskorrekturen","Acoustics - Noise emitted by machinery and equipment - Determination of emission sound pressure levels at a work station and at other specified positions applying accurate environmental corrections (ISO 11204:2010)","Acoustique — Bruit émis par les machines et équipements — Détermination des niveaux de pression acoustique d’émission au poste de travail et en d’autres positions spécifiées en appliquant des corrections d’environnement exactes"]
["1.5.08.","EN ISO 11205:2009",{"$f":"INDEX(Table_Standards[#This Row],1,Language_select+3)","v":"Acoustics - Noise emitted by machinery and equipment - Engineering method for the determination of emission sound pressure levels in situ at the work station and at other specified positions using sound intensity (ISO 11205:2003)"},"Akustik — Geräuschabstrahlung von Maschinen und Geräten — Verfahren  der Genauigkeitsklasse 2 zur Bestimmung von Emissions-  Schalldruckpegeln am Arbeitsplatz und an anderen festgelegten Orten  unter Einsatzbedingungen aus Schallintensitätsmessungen","Acoustics - Noise emitted by machinery and equipment - Engineering method for the determination of emission sound pressure levels in situ at the work station and at other specified positions using sound intensity (ISO 11205:2003)","Acoustique — Bruits émis par les machines et les équipements — Méthode d’expertise pour la détermination par intensimétrie des niveaux de pression acoustique d’émission in situ au poste de travail et en d’autres positions spécifiées"]
["1.5.08.","EN ISO 11546-1:2009",{"$f":"INDEX(Table_Standards[#This Row],1,Language_select+3)","v":"Acoustics - Determination of sound insulation performances of enclosures - Part 1: Measurements under laboratory conditions (for declaration purposes) (ISO 11546- 1:1995)"},"Akustik — Bestimmung der Schalldämmung von Schallschutzkapseln —  Teil 1: Messungen unter Laborbedingungen (zum Zweck der Kennzeichnung)","Acoustics - Determination of sound insulation performances of enclosures - Part 1: Measurements under laboratory conditions (for declaration purposes) (ISO 11546- 1:1995)","Acoustique — Détermination de l’isolement acoustique des encoffrements — Partie 1: Mesurages dans des conditions de laboratoire (aux fins de déclaration)"]
["1.5.08.","EN ISO 11546-2:2009",{"$f":"INDEX(Table_Standards[#This Row],1,Language_select+3)","v":"Acoustics - Determination of sound insulation performances of enclosures - Part 2: Measurements in situ (for acceptance and verification purposes) (ISO 11546-2:1995)"},"Akustik — Bestimmung der Schalldämmung von Schallschutzkapseln —  Teil 2: Messungen im Einsatzfall (zum Zweck der Abnahme und Nachprüfung)","Acoustics - Determination of sound insulation performances of enclosures - Part 2: Measurements in situ (for acceptance and verification purposes) (ISO 11546-2:1995)","Acoustique — Détermination de l’isolement acoustique des encoffrements — Partie 2: Mesurages sur site (aux fins d’acceptation et de vérification)"]
["1.5.08.","EN ISO 11688-1:2009",{"$f":"INDEX(Table_Standards[#This Row],1,Language_select+3)","v":"Acoustics - Recommended practice for the design of low-noise machinery and equipment - Part 1: Planning (ISO/TR 11688-1:1995)"},"Akustik — Richtlinien für die Konstruktion lärmarmer Maschinen und  Geräte — Teil 1: Planung","Acoustics - Recommended practice for the design of low-noise machinery and equipment - Part 1: Planning (ISO/TR 11688-1:1995)","Acoustique — Pratique recommandée pour la conception de machines et d’équipements à bruit réduit — Partie 1: Planification"]
["1.5.08.","EN ISO 11691:2009",{"$f":"INDEX(Table_Standards[#This Row],1,Language_select+3)","v":"Acoustics - Measurement of insertion loss of ducted silencers without flow - Laboratory survey method (ISO 11691:1995)"},"Akustik — Messung des Einfügungsdämpfungsmaßes von Schalldämpfern  in Kanälen ohne Strömung — Laborverfahren der Genauigkeitsklasse  3","Acoustics - Measurement of insertion loss of ducted silencers without flow - Laboratory survey method (ISO 11691:1995)","Acoustique — Détermination de la perte d’insertion de silencieux en conduit sans écoulement — Méthode de mesurage en laboratoire"]
["1.5.08.","EN ISO 11957:2009",{"$f":"INDEX(Table_Standards[#This Row],1,Language_select+3)","v":"Acoustics - Determination of sound insulation performance of cabins - Laboratory and in situ measurements (ISO 11957:1996)"},"Akustik — Messung der Schalldämmung von Schallschutzkabinen —  Messungen im Labor und im Einsatzfall","Acoustics - Determination of sound insulation performance of cabins - Laboratory and in situ measurements (ISO 11957:1996)","Acoustique — Détermination des performances d’isolation acoustique des cabines — Mesurages en laboratoire et in situ"]
[null,"---",{"$f":"INDEX(Table_Standards[#This Row],1,Language_select+3)","v":" "}," "," "," "]
[null,null,{"$f":"INDEX(Table_Standards[#This Row],1,Language_select+3)","v":"Vibrations"},"Vibration","Vibrations","Français"]
["1.5.09.","EN 1032:2003+A1:2008",{"$f":"INDEX(Table_Standards[#This Row],1,Language_select+3)","v":"Mechanical vibration - Testing of mobile machinery in order to determine the vibration emission value"},"Mechanische Schwingungen — Prüfverfahren für bewegliche Maschinen  zum Zwecke der Bestimmung des Schwingungsemissionswertes","Mechanical vibration - Testing of mobile machinery in order to determine the vibration emission value","Vibrations mécaniques — Essai des machines mobiles dans le but de déterminer la valeur d’émission vibratoire"]
["1.5.09.","EN 1299:1997+A1:2008",{"$f":"INDEX(Table_Standards[#This Row],1,Language_select+3)","v":"Mechanical vibration and shock - Vibration isolation of machines - Information for the application of source isolation"},"Mechanische Schwingungen und Stöße — Schwingungsisolierung von  Maschinen — Angaben für den Einsatz von Quellenisolierungen","Mechanical vibration and shock - Vibration isolation of machines - Information for the application of source isolation","Vibrations et chocs mécaniques — Isolation vibratoire des machines — Informations pour la mise en oeuvre de l’isolation des sources"]
["1.5.09.","EN ISO 10326-1:2016",{"$f":"INDEX(Table_Standards[#This Row],1,Language_select+3)","v":"Mechanical vibration - Laboratory method for evaluating vehicle seat vibration - Part 1: Basic requirements"},"Mechanische Schwingungen — Laborverfahren zur Bewertung der Schwingungen von Fahrzeugsitzen — Teil 1: Grundlegende Anforderungen","Mechanical vibration - Laboratory method for evaluating vehicle seat vibration - Part 1: Basic requirements","Vibrations mécaniques -- Méthode en laboratoire pour l'évaluation des vibrations du siège de véhicule -- Partie 1: Exigences de base"]
["1.5.09.","EN 12786:2013",{"$f":"INDEX(Table_Standards[#This Row],1,Language_select+3)","v":"Safety of machinery — Requirements for the drafting of the vibration clauses of safety standards"},"Sicherheit von Maschinen — Anforderungen an die Abfassung der Abschnitte über Schwingungen in Sicherheitsnormen","Safety of machinery — Requirements for the drafting of the vibration clauses of safety standards","Sécurité des machines — Exigences relatives à la rédaction des clauses vibrations des normes de sécurité"]
["1.5.09.","EN 13490:2001+A1:2008",{"$f":"INDEX(Table_Standards[#This Row],1,Language_select+3)","v":"Mechanical vibration - Industrial trucks - Laboratory evaluation and specification of operator seat vibration"},"Mechanische Schwingungen — Flurförderzeuge — Laborverfahren zur  Bewertung sowie Spezifikation der Schwingungen des Maschinenführersitzes","Mechanical vibration - Industrial trucks - Laboratory evaluation and specification of operator seat vibration","Sécurité des machines — Exigences relatives à la rédaction des clauses vibrations des normes de sécurité"]
["1.5.09.","EN ISO 13753:2008",{"$f":"INDEX(Table_Standards[#This Row],1,Language_select+3)","v":"Mechanical vibration and shock - Hand-arm vibration - Method for measuring the vibration transmissibility of resilient materials when loaded by the hand-arm system (ISO 13753:1998)"},"Mechanische Schwingungen und Stöße — Hand-Arm-Schwingungen —  Verfahren zur Messung der Schwingungsübertragung elastischer Materialien  unter Belastung durch das Hand-Arm-System","Mechanical vibration and shock - Hand-arm vibration - Method for measuring the vibration transmissibility of resilient materials when loaded by the hand-arm system (ISO 13753:1998)","Vibrations et chocs mécaniques — Vibrations main-bras — Méthode pour mesurer le facteur de transmission des vibrations par les matériaux résilients chargés par le système main-bras"]
["1.5.09.","EN ISO 20643:2008/A1:2012",{"$f":"INDEX(Table_Standards[#This Row],1,Language_select+3)","v":"Mechanical vibration - Hand-held and hand- guided machinery - Principles for evaluation of vibration emission (ISO 20643:2005)"},"Mechanische Schwingungen — Handgehaltene und handgeführte Maschinen  — Grundsätzliches Vorgehen bei der Ermittlung der Schwingungsemission","Mechanical vibration - Hand-held and hand- guided machinery - Principles for evaluation of vibration emission (ISO 20643:2005)","Vibration mécanique — Machines tenues et guidées à la main — Principes pour l’évaluation d’émission de vibration"]
["1.5.09.","EN 60204-31:2013",{"$f":"INDEX(Table_Standards[#This Row],1,Language_select+3)","v":"Safety of machinery — Electrical equipment of machines — Part 31: Particular safety and EMC requirements for sewing machines, units and systems"},"Sicherheit von Maschinen — Elektrische Ausrüstung von Maschinen — Teil 31: Besondere Sicherheits- und EMV-Anforderungen an Nähmaschinen, Näheinheiten und Nähanlagen (CENELEC)","Safety of machinery — Electrical equipment of machines — Part 31: Particular safety and EMC requirements for sewing machines, units and systems","Sécurité des machines — Equipement électrique des machines — Partie 31: Exigences particulières de sécurité et de CEM pour machines à coudre, unités et systèmes de couture"]
[null,"---",{"$f":"INDEX(Table_Standards[#This Row],1,Language_select+3)","v":" "}," "," "," "]
[null,null,{"$f":"INDEX(Table_Standards[#This Row],1,Language_select+3)","v":"Radiation"},"Strahlung","Radiation","Français"]
["1.5.10.","EN 12198-1:2000+A1:2008",{"$f":"INDEX(Table_Standards[#This Row],1,Language_select+3)","v":"Safety of machinery - Assessment and reduction of risks arising from radiation emitted by machinery - Part 1: General principles"},"Sicherheit von Maschinen — Bewertung und Verminderung des Risikos  der von Maschinen emittierten Strahlung — Teil 1: Allgemeine Leitsätze","Safety of machinery - Assessment and reduction of risks arising from radiation emitted by machinery - Part 1: General principles","Sécurité des machines — Estimation et réduction des risques engendrés par les rayonnements émis par les machines — Partie 1: Principes généraux"]
["1.5.10.","EN 12198-2:2002+A1:2008",{"$f":"INDEX(Table_Standards[#This Row],1,Language_select+3)","v":"Safety of machinery - Assessment and reduction of risks arising from radiation emitted by machinery - Part 2: Radiation emission measurement procedure"},"Sicherheit von Maschinen — Bewertung und Verminderung des Risikos  der von Maschinen emittierten Strahlung —  Teil 2: Messverfahren für die Strahlenemission","Safety of machinery - Assessment and reduction of risks arising from radiation emitted by machinery - Part 2: Radiation emission measurement procedure","Sécurité des machines — Estimation et réduction des risques engendrés par les rayonnements émis par les machines — Partie 2: Procédures de mesurage des émissions de rayonnement"]
["1.5.10.","EN 12198-3:2002+A1:2008",{"$f":"INDEX(Table_Standards[#This Row],1,Language_select+3)","v":"Safety of machinery - Assessment and reduction of risks arising from radiation emitted by machinery - Part 3: Reduction of radiation by attenuation or screening"},"Sicherheit von Maschinen — Bewertung und Verminderung des Risikos  der von Maschinen emittierten Strahlung —  Teil 3: Verminderung der Strahlung durch Abschwächung oder Abschirmung","Safety of machinery - Assessment and reduction of risks arising from radiation emitted by machinery - Part 3: Reduction of radiation by attenuation or screening","Sécurité des machines — Estimation et réduction des risques engendrés par les rayonnements émis par les machines — Partie 3: Réduction du rayonnement par atténuation ou par écrans"]
[null,"---",{"$f":"INDEX(Table_Standards[#This Row],1,Language_select+3)","v":" "}," "," "," "]
[null,null,{"$f":"INDEX(Table_Standards[#This Row],1,Language_select+3)","v":"Laser radiation"},"Laserstrahlung","Laser radiation","Français"]
["1.5.12.","EN ISO 11145:2016",{"$f":"INDEX(Table_Standards[#This Row],1,Language_select+3)","v":"Optics and photonics - Lasers and laser-related equipment - Vocabulary and symbols"},"Optik und Photonik — Laser und Laseranlagen — Begriffe und Formelzeichen","Optics and photonics - Lasers and laser-related equipment - Vocabulary and symbols","Optique et photonique — Lasers et équipements associés aux lasers — Vocabulaire et symboles"]
["1.5.12.","EN ISO 11553-1:2020+A11:2020",{"$f":"INDEX(Table_Standards[#This Row],1,Language_select+3)","v":0},"Sicherheit von Maschinen — Laserbearbeitungsmaschinen — Teil 1: Anforderungen an die Lasersicherheit"]
["1.5.12.","EN ISO 11554:2016",{"$f":"INDEX(Table_Standards[#This Row],1,Language_select+3)","v":"Optics and photonics — Lasers and laser-related equipment — Test methods for laser beam power, energy and temporal characteristics"},"Optik und Photonik — Laser und Laseranlagen — Prüfverfahren für Leistung, Energie und Kenngrößen des Zeitverhaltens von Laserstrahlen","Optics and photonics — Lasers and laser-related equipment — Test methods for laser beam power, energy and temporal characteristics","Optique et photonique — Lasers et équipements associés aux lasers — Méthodes d’essai de la puissance et de l’énergie des faisceaux lasers et de leurs caractéristiques temporelles"]
["1.5.12.","EN 12254:2010",{"$f":"INDEX(Table_Standards[#This Row],1,Language_select+3)","v":"Screens for laser working places - Safety requirements and testing"},"Abschirmungen an Laserarbeitsplätzen — Sicherheitstechnische Anforderung  und Prüfung","Screens for laser working places - Safety requirements and testing","Écrans pour postes de travail au laser — Exigences et essais de sécurité"]
["1.5.12.","EN 12254:2010/AC:2011",{"$f":"INDEX(Table_Standards[#This Row],1,Language_select+3)","v":"Screens for laser working places - Safety requirements and testing"},"Abschirmungen an Laserarbeitsplätzen — Sicherheitstechnische Anforderung  und Prüfung","Screens for laser working places - Safety requirements and testing","Écrans pour postes de travail au laser — Exigences et essais de sécurité"]
[null,"---",{"$f":"INDEX(Table_Standards[#This Row],1,Language_select+3)","v":" "}," "," "," "]
[null,null,{"$f":"INDEX(Table_Standards[#This Row],1,Language_select+3)","v":"Emissions of hazardous materials and substances"},"Emission gefährlicher Werkstoffe und Substanzen","Emissions of hazardous materials and substances","Français"]
["1.5.13.","EN 1093-1:2008",{"$f":"INDEX(Table_Standards[#This Row],1,Language_select+3)","v":"Safety of machinery - Evaluation of the emission of airborne hazardous substances - Part 1: Selection of test methods"},"Sicherheit von Maschinen — Bewertung der Emission von luftgetragenen  Gefahrstoffen — Teil 1: Auswahl der Prüfverfahren","Safety of machinery - Evaluation of the emission of airborne hazardous substances - Part 1: Selection of test methods","Sécurité des machines — Évaluation de l’émission de substances dangereuses véhiculées par l’air — Partie 1: Choix des méthodes d’essai"]
["1.5.13.","EN 1093-2:2006+A1:2008",{"$f":"INDEX(Table_Standards[#This Row],1,Language_select+3)","v":"Safety of machinery - Evaluation of the emission of airborne hazardous substances - Part 2: Tracer gas method for the measurement of the emission rate of a given pollutant"},"Sicherheit von Maschinen — Bewertung der Emission von luftgetragenen  Gefahrstoffen — Teil 2: Tracergasverfahren zur Messung der Emissionsrate  eines bestimmten luftverunreinigenden Stoffes","Safety of machinery - Evaluation of the emission of airborne hazardous substances - Part 2: Tracer gas method for the measurement of the emission rate of a given pollutant","Sécurité des machines — Évaluation de l’émission de substances dangereuses véhiculées par l’air — Partie 2: Méthode par traçage pour l’évaluation du débit d’émission d’un polluant donné"]
["1.5.13.","EN 1093-3:2006+A1:2008",{"$f":"INDEX(Table_Standards[#This Row],1,Language_select+3)","v":"Safety of machinery - Evaluation of the emission of airborne hazardous substances - Part 3: Test bench method for the measurement of the emission rate of a given pollutant"},"Sicherheit von Maschinen — Bewertung der Emission von luftgetragenen  Gefahrstoffen — Teil 3: Prüfstandverfahren zur Messung der Emissionsrate  eines bestimmten luftverunreinigenden Stoffes","Safety of machinery - Evaluation of the emission of airborne hazardous substances - Part 3: Test bench method for the measurement of the emission rate of a given pollutant","Sécurité des machines — Évaluation de l’émission de substances dangereuses véhiculées par l’air — Partie 3: Méthode sur banc d’essai pour le mesurage du débit d’émission d’un polluant donné"]
["1.5.13.","EN 1093-4:1996+A1:2008",{"$f":"INDEX(Table_Standards[#This Row],1,Language_select+3)","v":"Safety of machinery - Evaluation of the emission of airborne hazardous substances - Part 4: Capture efficiency of an exhaust system - Tracer method"},"Sicherheit von Maschinen — Bewertung der Emission von luftgetragenen  Gefahrstoffen — Teil 4: Erfassungsgrad eines Absaugsystems — Tracerverfahren","Safety of machinery - Evaluation of the emission of airborne hazardous substances - Part 4: Capture efficiency of an exhaust system - Tracer method","Sécurité des machines — Évaluation de l’émission de substances dangereuses véhiculées par l’air — Partie 4: Efficacité de captage d’un système d’aspiration — Méthode par traçage"]
["1.5.13.","EN 1093-6:1998+A1:2008",{"$f":"INDEX(Table_Standards[#This Row],1,Language_select+3)","v":"Safety of machinery - Evaluation of the emission of airborne hazardous substances - Part 6: Separation efficiency by mass, unducted outlet"},"Sicherheit von Maschinen — Bewertung der Emission von luftgetragenen  Gefahrstoffen — Teil 6: Masseabscheidegrad, diffuser Auslass","Safety of machinery - Evaluation of the emission of airborne hazardous substances - Part 6: Separation efficiency by mass, unducted outlet","Sécurité des machines — Évaluation de l’émission de substances dangereuses véhiculées par l’air — Partie 6: Efficacité massique de séparation, sortie libre"]
["1.5.13.","EN 1093-7:1998+A1:2008",{"$f":"INDEX(Table_Standards[#This Row],1,Language_select+3)","v":"Safety of machinery - Evaluation of the emission of airborne hazardous substances - Part 7: Separation efficiency by mass, ducted outlet"},"Sicherheit von Maschinen — Bewertung der Emission von luftgetragenen  Gefahrstoffen — Teil 7: Masseabscheidegrad, definierter Auslass","Safety of machinery - Evaluation of the emission of airborne hazardous substances - Part 7: Separation efficiency by mass, ducted outlet","Sécurité des machines — Évaluation de l’émission de substances dangereuses véhiculées par l’air — Partie 7: Efficacité massique de séparation, sortie raccordée"]
["1.5.13.","EN 1093-8:1998+A1:2008",{"$f":"INDEX(Table_Standards[#This Row],1,Language_select+3)","v":"Safety of machinery - Evaluation of the emission of airborne hazardous substances - Part 8: Pollutant concentration parameter, test bench method"},"Sicherheit von Maschinen — Bewertung der Emission von luftgetragenen  Gefahrstoffen — Teil 8: Konzentrationsparameter des luftverunreinigenden  Stoffes, Prüfstandverfahren","Safety of machinery - Evaluation of the emission of airborne hazardous substances - Part 8: Pollutant concentration parameter, test bench method","Sécurité des machines — Évaluation de l’émission de substances dangereuses véhiculées par l’air — Partie 8: Paramètre de concentration en polluant, méthode sur banc d’essai"]
["1.5.13.","EN 1093-9:1998+A1:2008",{"$f":"INDEX(Table_Standards[#This Row],1,Language_select+3)","v":"Safety of machinery - Evaluation of the emission of airborne hazardous substances - Part 9: Pollutant concentration parameter, room method"},"Sicherheit von Maschinen — Bewertung der Emission von luftgetragenen  Gefahrstoffen — Teil 9: Konzentrationsparameter des luftverunreinigenden  Stoffes, Prüfraumverfahren","Safety of machinery - Evaluation of the emission of airborne hazardous substances - Part 9: Pollutant concentration parameter, room method","Sécurité des machines — Évaluation de l’émission de substances dangereuses véhiculées par l’air — Partie 9: Paramètre de concentration en polluant, méthode en salle d’essai"]
["1.5.13.","EN 1093-11:2001+A1:2008",{"$f":"INDEX(Table_Standards[#This Row],1,Language_select+3)","v":"Safety of machinery - Evaluation of the emission of airborne hazardous substances - Part 11: Decontamination index"},"Sicherheit von Maschinen — Bewertung der Emission von luftgetragenen  Gefahrstoffen — Teil 11: Reinigungsindex","Safety of machinery - Evaluation of the emission of airborne hazardous substances - Part 11: Decontamination index","Sécurité des machines — Évaluation de l’émission de substances dangereuses véhiculées par l’air — Partie 11: Indice d’assainissement"]
["1.5.13.","EN ISO 14123-1:2015",null,"Sicherheit von Maschinen — Minderung von Gesundheitsrisiken, die auf Gefahrstoffemissionen von Maschinen zurückzuführen sind — Teil 1: Grundsätze und Festlegungen für Maschinenhersteller","Safety of machinery — Reduction of risks to health resulting from hazardous substances emitted by machinery — Part 1: Principles and specifications for machinery manufacturers","Sécurité des machines — Réduction des risques pour la santé résultant de substances dangereuses émises par des machines — Partie 1: Principes et spécifications à l’intention des constructeurs de machines"]
["1.5.13.","EN ISO 14123-2:2015",null,"Sicherheit von Maschinen — Minderung von Gesundheitsrisiken, die auf Gefahrstoffemissionen von Maschinen zurückzuführen sind — Teil 2: Methodik beim Aufstellen von Überprüfungsverfahren","Safety of machinery — Reduction of risks to health resulting from hazardous substances emitted by machinery — Part 2: Methodology leading to verification procedures ","Sécurité des machines — Réduction des risques pour la santé résultant de substances dangereuses émises par des machines — Partie 2: Méthodologie menant à des procédures de vérification"]
[null,"---",{"$f":"INDEX(Table_Standards[#This Row],1,Language_select+3)","v":" "}," "," "," "]
[null,null,{"$f":"INDEX(Table_Standards[#This Row],1,Language_select+3)","v":"Access to operating positions and servicing points"},"Zugang zu den Bedienungsständen und den Eingriffspunkten für die Instandhaltung","Access to operating positions and servicing points","Français"]
["1.6.2.","EN ISO 14122-1:2016",{"$f":"INDEX(Table_Standards[#This Row],1,Language_select+3)","v":"Safety of machinery - Permanent means of access to machinery - Part 1: Choice of fixed means of access between two levels"},"Sicherheit von Maschinen — Ortsfeste Zugänge zu maschinellen Anlagen  — Teil 1: Wahl eines ortsfesten Zugangs zwischen zwei Ebenen","Safety of machinery - Permanent means of access to machinery - Part 1: Choice of fixed means of access between two levels","Sécurité des machines — Moyens d’accès permanents aux machines — Partie 1: Choix d’un moyen d’accès et des exigences générales d’accès"]
["1.6.2.","EN ISO 14122-2:2016",{"$f":"INDEX(Table_Standards[#This Row],1,Language_select+3)","v":"Safety of machinery - Permanent means of access to machinery - Part 2: Working platforms and walkways"},"Sicherheit von Maschinen — Ortsfeste Zugänge zu maschinellen Anlagen  — Teil 2: Arbeitsbühnen und Laufstege","Safety of machinery - Permanent means of access to machinery - Part 2: Working platforms and walkways","Sécurité des machines — Moyens d’accès permanents aux machines — Partie 2: Plates-formes de travail et passerelles "]
["1.6.2.","EN ISO 14122-3:2016",{"$f":"INDEX(Table_Standards[#This Row],1,Language_select+3)","v":"Safety of machinery - Permanent means of access to machinery - Part 3: Stairs, stepladders and guard-rails"},"Sicherheit von Maschinen — Ortsfeste Zugänge zu maschinellen Anlagen  — Teil 3: Treppen, Treppenleitern und Geländer","Safety of machinery - Permanent means of access to machinery - Part 3: Stairs, stepladders and guard-rails","Sécurité des machines — Moyens d’accès permanents aux machines — Partie 3: Escaliers, échelles à marches et garde-corps "]
["1.6.2.","EN ISO 14122-4:2016",{"$f":"INDEX(Table_Standards[#This Row],1,Language_select+3)","v":"Safety of machinery - Permanent means of access to machinery - Part 4: Fixed ladders"},"Sicherheit von Maschinen — Ortsfeste Zugänge zu maschinellen Anlagen  — Teil 4: Ortsfeste Steigleitern","Safety of machinery - Permanent means of access to machinery - Part 4: Fixed ladders","Sécurité des machines — Moyens d’accès permanents aux machines — Partie 4: Échelles fixes "]
[null,"---",{"$f":"INDEX(Table_Standards[#This Row],1,Language_select+3)","v":" "}," "," "," "]
[null,null,{"$f":"INDEX(Table_Standards[#This Row],1,Language_select+3)","v":"Warning of residual risks"},"Warnung vor Restrisiken","Warning of residual risks","Français"]
["1.7.2.","EN 842:1996+A1:2008",{"$f":"INDEX(Table_Standards[#This Row],1,Language_select+3)","v":"Safety of machinery - Visual danger signals - General requirements, design and testing"},"Sicherheit von Maschinen — Optische Gefahrensignale — Allgemeine  Anforderungen, Gestaltung und Prüfung","Safety of machinery - Visual danger signals - General requirements, design and testing","Sécurité des machines — Signaux visuels de danger — Exigences générales, conception et essais"]
["1.7.2.","EN 981:1996+A1:2008",{"$f":"INDEX(Table_Standards[#This Row],1,Language_select+3)","v":"Safety of machinery - System of auditory and visual danger and information signals"},"Sicherheit von Maschinen — System akustischer und optischer Gefahrensignale  und Informationssignale","Safety of machinery - System of auditory and visual danger and information signals","Sécurité des machines — Système de signaux auditifs et visuels de danger et d’information"]
["1.7.2.","EN ISO 7731:2008",{"$f":"INDEX(Table_Standards[#This Row],1,Language_select+3)","v":"Ergonomics - Danger signals for public and work areas - Auditory danger signals (ISO 7731:2003)"},"Ergonomie — Gefahrensignale für öffentliche Bereiche und Arbeitsstätten  — Akustische Gefahrensignale","Ergonomics - Danger signals for public and work areas - Auditory danger signals (ISO 7731:2003)","Ergonomie — Signaux de danger pour lieux publics et lieux de travail — Signaux de danger auditifs "]
[null,"---",{"$f":"INDEX(Table_Standards[#This Row],1,Language_select+3)","v":" "}," "," "," "]
[null,null,{"$f":"INDEX(Table_Standards[#This Row],1,Language_select+3)","v":"Contents of the instructions"},"Inhalt der Betriebsanleitung ","Contents of the instructions","Français"]
["1.7.4.2.","EN ISO 20607:2019",{"$f":"INDEX(Table_Standards[#This Row],1,Language_select+3)","v":"Safety of machinery - Instruction handbook - General drafting principles (ISO 20607:2019)"},"Sicherheit von Maschinen — Betriebsanleitung — Allgemeine Gestaltungsgrundsätze (ISO 20607:2019)","Safety of machinery - Instruction handbook - General drafting principles (ISO 20607:2019)","Sécurité des machines - Notice d'instructions - Principes rédactionnels généraux"]
[null,"---",{"$f":"INDEX(Table_Standards[#This Row],1,Language_select+3)","v":" "}," "," "," "]
[null,null,{"$f":"INDEX(Table_Standards[#This Row],1,Language_select+3)","v":"Foodstuffs machinery and machinery for cosmetics or pharmaceutical products"},"Nahrungsmittelmaschinen und Maschinen für kosmetische oder pharmazeutische Erzeugnisse","Foodstuffs machinery and machinery for cosmetics or pharmaceutical products","Français"]
["2.1.","EN ISO 14159:2008",{"$f":"INDEX(Table_Standards[#This Row],1,Language_select+3)","v":"Safety of machinery - Hygiene requirements for the design of machinery"},"Sicherheit von Maschinen — Hygieneanforderungen an die Gestaltung von Maschinen","Safety of machinery - Hygiene requirements for the design of machinery","Sécurité des machines — Prescriptions relatives à l’hygiène lors de la conception des machines"]
[null,"---",{"$f":"INDEX(Table_Standards[#This Row],1,Language_select+3)","v":" "}," "," "," "]
[]
[null,"Abgelöste EN Normen","zurückgezogen"]
["Datum Streichung","Nummer","Spalte1","Deutsch","English","Français"]
[null,"EN 1037:1995+A1:2008",{"$f":"INDEX(Table_Standards_Old[#This Row],1,Language_select+3)","v":"Safety of machinery - Prevention of unexpected start-up"},"Sicherheit von Maschinen — Vermeidung von unerwartetem Anlauf","Safety of machinery - Prevention of unexpected start-up","Sécurité des machines — Prévention de la mise en marche intempestive"]
[null,"EN 1088:1995+A2:2008",{"$f":"INDEX(Table_Standards_Old[#This Row],1,Language_select+3)","v":"Safety of machinery - Interlocking devices associated with guards - Principles for design and selection"},"Sicherheit von Maschinen — Verriegelungseinrichtungen in Verbindung mit trennenden Schutzeinrichtungen — Leitsätze für Gestaltung und Auswahl","Safety of machinery - Interlocking devices associated with guards - Principles for design and selection","Français"]
[null,"EN 13478:2001+A1:2008",{"$f":"INDEX(Table_Standards_Old[#This Row],1,Language_select+3)","v":"Safety of machinery - Fire prevention and protection"},"Sicherheit von Maschinen — Brandschutz","Safety of machinery - Fire prevention and protection","Sécurité des machines — Prévention et protection contre l’incendie"]
[null,"EN 1760-1:1997+A1:2009",{"$f":"INDEX(Table_Standards_Old[#This Row],1,Language_select+3)","v":"Safety of machinery - Pressure sensitive protective devices - Part 1: General principles for the design and testing of pressure sensitive mats and pressure sensitive floors"},"Sicherheit von Maschinen — Druckempfindliche Schutzeinrichtungen —  Teil 1: Allgemeine Leitsätze für die Gestaltung und Prüfung von Schaltmatten  und Schaltplatten","Safety of machinery - Pressure sensitive protective devices - Part 1: General principles for the design and testing of pressure sensitive mats and pressure sensitive floors","Français"]
[null,"EN 1760-2:2001+A1:2009",{"$f":"INDEX(Table_Standards_Old[#This Row],1,Language_select+3)","v":"Safety of machinery - Pressure sensitive protective devices - Part 2: General principles for the design and testing of pressure sensitive edges and pressure sensitive bars"},"Sicherheit von Maschinen — Druckempfindliche Schutzeinrichtungen —  Teil 2: Allgemeine Leitsätze für die Gestaltung und Prüfung von Schaltleisten  und Schaltstangen","Safety of machinery - Pressure sensitive protective devices - Part 2: General principles for the design and testing of pressure sensitive edges and pressure sensitive bars","Français"]
[null,"EN 1760-3:2004+A1:2009",{"$f":"INDEX(Table_Standards_Old[#This Row],1,Language_select+3)","v":"Safety of machinery - Pressure sensitive protective devices - Part 3: General principles for the design and testing of pressure sensitive bumpers, plates, wires and similar devices"},"Sicherheit von Maschinen — Druckempfindliche Schutzeinrichtungen —  Teil 3: Allgemeine Leitsätze für die Gestaltung und Prüfung von  Schaltpuffern, Schaltflächen, Schaltleinen und ähnlichen Einrichtungen","Safety of machinery - Pressure sensitive protective devices - Part 3: General principles for the design and testing of pressure sensitive bumpers, plates, wires and similar devices","Français"]
[null,"EN 30326-1:1994",{"$f":"INDEX(Table_Standards_Old[#This Row],1,Language_select+3)","v":"Mechanical vibration - Laboratory method for evaluating vehicle seat vibration - Part 1: Basic requirements (ISO 10326-1:1992)"},"Mechanische Schwingungen — Laborverfahren zur Bewertung der  Schwingungen von Fahrzeugsitzen — Grundlegende Anforderungen","Mechanical vibration - Laboratory method for evaluating vehicle seat vibration - Part 1: Basic requirements (ISO 10326-1:1992)","Français"]
[null,"EN 30326-1:1994+A1:2007",{"$f":"INDEX(Table_Standards_Old[#This Row],1,Language_select+3)","v":"Mechanical vibration - Laboratory method for evaluating vehicle seat vibration - Part 1: Basic requirements "},"Mechanische Schwingungen — Laborverfahren zur Bewertung der  Schwingungen von Fahrzeugsitzen — Grundlegende Anforderungen","Mechanical vibration - Laboratory method for evaluating vehicle seat vibration - Part 1: Basic requirements ","Français"]
[null,"EN 50223:2010",{"$f":"INDEX(Table_Standards_Old[#This Row],1,Language_select+3)","v":"Stationary electrostatic application equipment for ignitable flock material - Safety requirements"},"Stationäre elektrostatische Flockanlagen für entzündbaren Flock —  Sicherheitsanforderungen","Stationary electrostatic application equipment for ignitable flock material - Safety requirements","Français"]
[null,"EN 60204-1:2006",{"$f":"INDEX(Table_Standards_Old[#This Row],1,Language_select+3)","v":"Safety of machinery - Electrical equipment of machines - Part 1: General requirements IEC 60204-1:2005 (Modified)"},"Sicherheit von Maschinen — Elektrische Ausrüstung von Maschinen — Teil 1: Allgemeine Anforderungen (CENELEC)","Safety of machinery - Electrical equipment of machines - Part 1: General requirements IEC 60204-1:2005 (Modified)","Français"]
[null,"EN 61496-1:2004",{"$f":"INDEX(Table_Standards_Old[#This Row],1,Language_select+3)","v":"Safety of machinery - Electro-sensitive protective equipment - Part 1: General requirements and tests IEC 61496-1:2004 (Modified)"},"Sicherheit von Maschinen — Berührungslos wirkende Schutzeinrichtungen  — Teil 1: Allgemeine Anforderungen und Prüfungen","Safety of machinery - Electro-sensitive protective equipment - Part 1: General requirements and tests IEC 61496-1:2004 (Modified)","Français"]
[null,"EN 61496-1:2004/A1:2008",{"$f":"INDEX(Table_Standards_Old[#This Row],1,Language_select+3)","v":"Safety of machinery - Electro-sensitive protective equipment - Part 1: General requirements and tests IEC 61496-1:2004 (Modified)"},"Sicherheit von Maschinen — Berührungslos wirkende Schutzeinrichtungen  — Teil 1: Allgemeine Anforderungen und Prüfungen","Safety of machinery - Electro-sensitive protective equipment - Part 1: General requirements and tests IEC 61496-1:2004 (Modified)","Français"]
[null,"EN 62061:2005",{"$f":"INDEX(Table_Standards_Old[#This Row],1,Language_select+3)","v":"Safety of machinery - Functional safety of safety-related electrical, electronic and programmable electronic control systems IEC 62061:2005"},"Sicherheit von Maschinen — Funktionale Sicherheit sicherheitsbezogener  elektrischer, elektronischer und programmierbarer elektronischer  Steuerungssysteme","Safety of machinery - Functional safety of safety-related electrical, electronic and programmable electronic control systems IEC 62061:2005","Français"]
[null,"EN 626-1:1994+A1:2008",{"$f":"INDEX(Table_Standards_Old[#This Row],1,Language_select+3)","v":"Safety of machinery - Reduction of risks to health from hazardous substances emitted by machinery - Part 1: Principles and specifications for machinery manufacturers"},"Sicherheit von Maschinen — Reduzierung des Gesundheitsrisikos durch  Gefahrstoffe, die von Maschinen ausgehen —  Teil 1: Grundsätze und Festlegungen für Maschinenhersteller","Safety of machinery - Reduction of risks to health from hazardous substances emitted by machinery - Part 1: Principles and specifications for machinery manufacturers","Français"]
[null,"EN 626-2:1996+A1:2008",{"$f":"INDEX(Table_Standards_Old[#This Row],1,Language_select+3)","v":"Safety of machinery - Reduction of risk to health from hazardous substances emitted by machinery - Part 2: Methodology leading to verification procedures"},"Sicherheit von Maschinen — Reduzierung des Gesundheitsrisikos durch  Gefahrstoffe, die von Maschinen ausgehen —  Teil 2: Methodik beim Aufstellen von Überprüfungsverfahren","Safety of machinery - Reduction of risk to health from hazardous substances emitted by machinery - Part 2: Methodology leading to verification procedures","Français"]
[null,"EN 953:1997+A1:2009",{"$f":"INDEX(Table_Standards_Old[#This Row],1,Language_select+3)","v":"Safety of machinery - Guards - General requirements for the design and construction of fixed and movable guards"},"Sicherheit von Maschinen — Trennende Schutzeinrichtungen — Allgemeine  Anforderungen an Gestaltung und Bau von feststehenden und  beweglichen trennenden Schutzeinrichtungen","Safety of machinery - Guards - General requirements for the design and construction of fixed and movable guards","Sécurité des machines — Protecteurs — Prescriptions générales pour la conception et la construction des protecteurs fixes et mobiles"]
[null,"EN ISO 11252:2008",{"$f":"INDEX(Table_Standards_Old[#This Row],1,Language_select+3)","v":"Lasers and laser-related equipment - Laser device - Minimum requirements for documentation (ISO 11252:2004)"},"Laser und Laseranlagen — Lasergerät — Mindestanforderungen an die  Dokumentation","Lasers and laser-related equipment - Laser device - Minimum requirements for documentation (ISO 11252:2004)","Français"]
[null,"EN ISO 13849-1:2008",{"$f":"INDEX(Table_Standards_Old[#This Row],1,Language_select+3)","v":"Safety of machinery - Safety-related parts of control systems - Part 1: General principles for design (ISO 13849-1:2006)"},"Sicherheit von Maschinen — Sicherheitsbezogene Teile von Steuerungen  — Teil 1: Allgemeine Gestaltungsleitsätze","Safety of machinery - Safety-related parts of control systems - Part 1: General principles for design (ISO 13849-1:2006)","Sécurité des machines — Parties des systèmes de commande relatives à la sécurité — Partie 1: Principes généraux de conception"]
[null,"EN ISO 13849-1:2008/AC:2009",{"$f":"INDEX(Table_Standards_Old[#This Row],1,Language_select+3)","v":"Safety of machinery - Safety-related parts of control systems - Part 1: General principles for design (ISO 13849-1:2006)"},"Sicherheit von Maschinen — Sicherheitsbezogene Teile von Steuerungen  — Teil 1: Allgemeine Gestaltungsleitsätze","Safety of machinery - Safety-related parts of control systems - Part 1: General principles for design (ISO 13849-1:2006)","Sécurité des machines — Parties des systèmes de commande relatives à la sécurité — Partie 1: Principes généraux de conception"]
[null,"EN ISO 13849-2:2012",{"$f":"INDEX(Table_Standards_Old[#This Row],1,Language_select+3)","v":"Safety of machinery - Safety-related parts of control systems - Part 2: Validation"},"Sicherheit von Maschinen — Sicherheitsbezogene Teile von Steuerungen  — Teil 2: Validierung","Safety of machinery - Safety-related parts of control systems - Part 2: Validation","Sécurité des machines — Parties des systèmes de commande relatives à la sécurité — Partie 2: Validation"]
[null,"EN ISO 13850:2008",{"$f":"INDEX(Table_Standards_Old[#This Row],1,Language_select+3)","v":"Safety of machinery - Emergency stop - Principles for design (ISO 13850:2006)"},"Sicherheit von Maschinen — Not-Halt — Gestaltungsleitsätze","Safety of machinery - Emergency stop - Principles for design (ISO 13850:2006)","Sécurité des machines — Arrêt d’urgence — Principes de conception"]
[null,"EN ISO 14122-1:2001",{"$f":"INDEX(Table_Standards_Old[#This Row],1,Language_select+3)","v":"Safety of machinery - Permanent means of access to machinery - Part 1: Choice of fixed means of access between two levels (ISO 14122-1:2001)"},"Sicherheit von Maschinen — Ortsfeste Zugänge zu maschinellen Anlagen  — Teil 1: Wahl eines ortsfesten Zugangs zwischen zwei Ebenen","Safety of machinery - Permanent means of access to machinery - Part 1: Choice of fixed means of access between two levels (ISO 14122-1:2001)","Français"]
[null,"EN ISO 14122-1:2001/A1:2010",{"$f":"INDEX(Table_Standards_Old[#This Row],1,Language_select+3)","v":"Safety of machinery - Permanent means of access to machinery - Part 1: Choice of fixed means of access between two levels"},"Sicherheit von Maschinen — Ortsfeste Zugänge zu maschinellen Anlagen  — Teil 1: Wahl eines ortsfesten Zugangs zwischen zwei Ebenen","Safety of machinery - Permanent means of access to machinery - Part 1: Choice of fixed means of access between two levels","Français"]
[null,"EN ISO 14122-2:2001",{"$f":"INDEX(Table_Standards_Old[#This Row],1,Language_select+3)","v":"Safety of machinery - Permanent means of access to machinery - Part 2: Working platforms and walkways (ISO 14122- 2:2001)"},"Sicherheit von Maschinen — Ortsfeste Zugänge zu maschinellen Anlagen  — Teil 2: Arbeitsbühnen und Laufstege","Safety of machinery - Permanent means of access to machinery - Part 2: Working platforms and walkways (ISO 14122- 2:2001)","Français"]
[null,"EN ISO 14122-2:2001/A1:2010",{"$f":"INDEX(Table_Standards_Old[#This Row],1,Language_select+3)","v":"Safety of machinery - Permanent means of access to machinery - Part 2: Working platforms and walkways"},"Sicherheit von Maschinen — Ortsfeste Zugänge zu maschinellen Anlagen  — Teil 2: Arbeitsbühnen und Laufstege","Safety of machinery - Permanent means of access to machinery - Part 2: Working platforms and walkways","Français"]
[null,"EN ISO 14122-3:2001",{"$f":"INDEX(Table_Standards_Old[#This Row],1,Language_select+3)","v":"Safety of machinery - Permanent means of access to machinery - Part 3: Stairs, stepladders and guard-rails (ISO 14122- 3:2001)"},"Sicherheit von Maschinen — Ortsfeste Zugänge zu maschinellen Anlagen  — Teil 3: Treppen, Treppenleitern und Geländer","Safety of machinery - Permanent means of access to machinery - Part 3: Stairs, stepladders and guard-rails (ISO 14122- 3:2001)","Français"]
[null,"EN ISO 14122-3:2001/A1:2010",{"$f":"INDEX(Table_Standards_Old[#This Row],1,Language_select+3)","v":"Safety of machinery - Permanent means of access to machinery - Part 3: Stairs, stepladders and guard-rails"},"Sicherheit von Maschinen — Ortsfeste Zugänge zu maschinellen Anlagen  — Teil 3: Treppen, Treppenleitern und Geländer","Safety of machinery - Permanent means of access to machinery - Part 3: Stairs, stepladders and guard-rails","Français"]
[null,"EN ISO 14122-4:2004",{"$f":"INDEX(Table_Standards_Old[#This Row],1,Language_select+3)","v":"Safety of machinery - Permanent means of access to machinery - Part 4: Fixed ladders (ISO 14122-4:2004)"},"Sicherheit von Maschinen — Ortsfeste Zugänge zu maschinellen Anlagen  — Teil 4: Ortsfeste Steigleitern","Safety of machinery - Permanent means of access to machinery - Part 4: Fixed ladders (ISO 14122-4:2004)","Français"]
[null,"EN ISO 11200:2009",{"$f":"INDEX(Table_Standards_Old[#This Row],1,Language_select+3)","v":"Acoustics - Noise emitted by machinery and equipment - Guidelines for the use of basic standards for the determination of emission sound pressure levels at a work station and at other specified positions (ISO 11200:1995, including Cor 1:1997)"},"Akustik — Geräuschabstrahlung von Maschinen und Geräten — Leitlinien  zur Anwendung der Grundnormen zur Bestimmung von Emissions-  Schalldruckpegeln am Arbeitsplatz und an anderen festgelegten Orten","Acoustics - Noise emitted by machinery and equipment - Guidelines for the use of basic standards for the determination of emission sound pressure levels at a work station and at other specified positions (ISO 11200:1995, including Cor 1:1997)","Acoustique — Bruit émis par les machines et équipements — Guide d’utilisation des normes de base pour la détermination des niveaux de pression acoustique d’émission au poste de travail et en d’autres positions spécifiées"]
[null,"EN ISO 11200:2014",{"$f":"INDEX(Table_Standards_Old[#This Row],1,Language_select+3)","v":"Acoustics - Noise emitted by machinery and equipment - Guidelines for the use of basic standards for the determination of emission sound pressure levels at a work station and at other specified positions (ISO 11200:1995, including Cor 1:1997)"},"Akustik — Geräuschabstrahlung von Maschinen und Geräten — Leitlinien  zur Anwendung der Grundnormen zur Bestimmung von Emissions-  Schalldruckpegeln am Arbeitsplatz und an anderen festgelegten Orten","Acoustics - Noise emitted by machinery and equipment - Guidelines for the use of basic standards for the determination of emission sound pressure levels at a work station and at other specified positions (ISO 11200:1995, including Cor 1:1997)","Acoustique — Bruit émis par les machines et équipements — Guide d’utilisation des normes de base pour la détermination des niveaux de pression acoustique d’émission au poste de travail et en d’autres positions spécifiées"]
[null,"EN 62061:2005/AC:2010",{"$f":"INDEX(Table_Standards_Old[#This Row],1,Language_select+3)","v":"Safety of machinery - Functional safety of safety-related electrical, electronic and programmable electronic control systems IEC 62061:2005"},"Sicherheit von Maschinen — Funktionale Sicherheit sicherheitsbezogener  elektrischer, elektronischer und programmierbarer elektronischer  Steuerungssysteme","Safety of machinery - Functional safety of safety-related electrical, electronic and programmable electronic control systems IEC 62061:2005","Sécurité des machines — Sécurité fonctionnelle des systèmes de commande électriques, électroniques et électroniques programmables relatifs à la sécurité"]
[null,"EN 62061:2005/A1:2013",{"$f":"INDEX(Table_Standards_Old[#This Row],1,Language_select+3)","v":"Safety of machinery - Functional safety of safety-related electrical, electronic and programmable electronic control systems IEC 62061:2005"},"Sicherheit von Maschinen — Funktionale Sicherheit sicherheitsbezogener  elektrischer, elektronischer und programmierbarer elektronischer  Steuerungssysteme","Safety of machinery - Functional safety of safety-related electrical, electronic and programmable electronic control systems IEC 62061:2005","Sécurité des machines — Sécurité fonctionnelle des systèmes de commande électriques, électroniques et électroniques programmables relatifs à la sécurité"]
[null,"EN 1127-2:2002+A1:2008",{"$f":"INDEX(Table_Standards_Old[#This Row],1,Language_select+3)","v":"Explosive atmospheres - Explosion prevention and protection - Part 2: Basic concepts and methodology for mining"},"Explosionsfähige Atmosphären — Explosionsschutz — Teil 2: Grundlagen  und Methodik in Bergwerken (<-- A-Norm)","Explosive atmospheres - Explosion prevention and protection - Part 2: Basic concepts and methodology for mining","Atmosphères explosives — Prévention de l’explosion et protection contre l’explosion — Partie 2: Notions fondamentales et méthodologie dans l’exploitation des mines"]
[null,"EN 62061:2005/A2:2015",{"$f":"INDEX(Table_Standards_Old[#This Row],1,Language_select+3)","v":"Safety of machinery - Functional safety of safety-related electrical, electronic and programmable electronic control systems IEC 62061:2005"},"Sicherheit von Maschinen — Funktionale Sicherheit sicherheitsbezogener  elektrischer, elektronischer und programmierbarer elektronischer  Steuerungssysteme","Safety of machinery - Functional safety of safety-related electrical, electronic and programmable electronic control systems IEC 62061:2005","Sécurité des machines — Sécurité fonctionnelle des systèmes de commande électriques, électroniques et électroniques programmables relatifs à la sécurité"]
[null,"EN ISO 3745:2012",{"$f":"INDEX(Table_Standards_Old[#This Row],1,Language_select+3)","v":"Acoustics - Determination of sound power levels and sound energy levels of noise sources using sound pressure - Precision methods for anechoic rooms and hemi- anechoic rooms (ISO 3745:2012)"},"Akustik — Bestimmung der Schallleistungspegel von Geräuschquellen  aus Schalldruckmessungen — Verfahren der Genauigkeitsklasse 1 für  reflexionsarme Räume und Halbräume","Acoustics - Determination of sound power levels and sound energy levels of noise sources using sound pressure - Precision methods for anechoic rooms and hemi- anechoic rooms (ISO 3745:2012)","Acoustique — Détermination des niveaux de puissance acoustique et des niveaux d’énergie acoustique émis par les sources de bruit à partir de la pression acoustique — Méthodes de laboratoire pour les salles anéchoïques et les\nsalles semi-anéchoïques"]
[null,"EN ISO 20643:2008/AC:2010",{"$f":"INDEX(Table_Standards_Old[#This Row],1,Language_select+3)","v":"Mechanical vibration - Hand-held and hand- guided machinery - Principles for evaluation of vibration emission (ISO 20643:2005)"},"Mechanische Schwingungen — Handgehaltene und handgeführte Maschinen  — Grundsätzliches Vorgehen bei der Ermittlung der Schwingungsemission","Mechanical vibration - Hand-held and hand- guided machinery - Principles for evaluation of vibration emission (ISO 20643:2005)","Vibration mécanique — Machines tenues et guidées à la main — Principes pour l’évaluation d’émission de vibration"]
[null,"EN 30326-1:1994/A2:2011",{"$f":"INDEX(Table_Standards_Old[#This Row],1,Language_select+3)","v":"Mechanical vibration - Laboratory method for evaluating vehicle seat vibration - Part 1: Basic requirements "},"Mechanische Schwingungen — Laborverfahren zur Bewertung der  Schwingungen von Fahrzeugsitzen — Grundlegende Anforderungen","Mechanical vibration - Laboratory method for evaluating vehicle seat vibration - Part 1: Basic requirements ","Vibrations mécaniques — Méthode en laboratoire pour l’évaluation des vibrations du siège de véhicule — Partie 1: Exigences de base"]
[null,"EN ISO 11145:2008",{"$f":"INDEX(Table_Standards_Old[#This Row],1,Language_select+3)","v":"Optics and photonics - Lasers and laser-related equipment - Vocabulary and symbols"},"Optik und Photonik — Laser und Laseranlagen — Begriffe und Formelzeichen","Optics and photonics - Lasers and laser-related equipment - Vocabulary and symbols","Optique et photonique — Lasers et équipements associés aux lasers — Vocabulaire et symboles"]
[null,"EN ISO 11554:2008",{"$f":"INDEX(Table_Standards_Old[#This Row],1,Language_select+3)","v":"Optics and photonics — Lasers and laser-related equipment — Test methods for laser beam power, energy and temporal characteristics"},"Optik und Photonik — Laser und Laseranlagen — Prüfverfahren für Leistung, Energie und Kenngrößen des Zeitverhaltens von Laserstrahlen","Optics and photonics — Lasers and laser-related equipment — Test methods for laser beam power, energy and temporal characteristics","Optique et photonique — Lasers et équipements associés aux lasers — Méthodes d’essai de la puissance et de l’énergie des faisceaux lasers et de leurs caractéristiques temporelles"]
[null,"EN ISO 14122-4:2004/AC:2010",{"$f":"INDEX(Table_Standards_Old[#This Row],1,Language_select+3)","v":"Safety of machinery - Permanent means of access to machinery - Part 4: Fixed ladders"},"Sicherheit von Maschinen — Ortsfeste Zugänge zu maschinellen Anlagen  — Teil 4: Ortsfeste Steigleitern","Safety of machinery - Permanent means of access to machinery - Part 4: Fixed ladders","Français"]
["2021-10-02","EN ISO 19353:2016",{"$f":"INDEX(Table_Standards[#This Row],1,Language_select+3)","v":{"$error":"#VALUE!"}},"Sicherheit von Maschinen — Vorbeugender und abwehrender Brandschutz","Safety of machinery - Fire prevention and fire protection","Sécurité des machines — Prévention et protection contre l’incendie"]
["2021-10-02","EN 60204-1:2006/A1:2009",{"$f":"INDEX(Table_Standards[#This Row],1,Language_select+3)","v":{"$error":"#VALUE!"}},"Sicherheit von Maschinen — Elektrische Ausrüstung von Maschinen —  Teil 1: Allgemeine Anforderungen","Safety of machinery - Electrical equipment of machines - Part 1: General requirements IEC 60204-1:2005 (Modified)","Sécurité des machines — Equipement électrique des machines — Partie 1: Règles générales"]
["2021-10-02","IEC 60204-1:2005/A1:2008",{"$f":"INDEX(Table_Standards[#This Row],1,Language_select+3)","v":{"$error":"#VALUE!"}},"Sicherheit von Maschinen — Elektrische Ausrüstung von Maschinen —  Teil 1: Allgemeine Anforderungen","Safety of machinery - Electrical equipment of machines - Part 1: General requirements IEC 60204-1:2005 (Modified)","Sécurité des machines — Equipement électrique des machines — Partie 1: Règles générales"]
["2021-10-02","EN 60204-1:2006/AC:2010",{"$f":"INDEX(Table_Standards[#This Row],1,Language_select+3)","v":{"$error":"#VALUE!"}},"Sicherheit von Maschinen — Elektrische Ausrüstung von Maschinen —  Teil 1: Allgemeine Anforderungen","Safety of machinery - Electrical equipment of machines - Part 1: General requirements IEC 60204-1:2005 (Modified)","Sécurité des machines — Equipement électrique des machines — Partie 1: Règles générales"]
["2021-10-02","EN 60204-11:2000",{"$f":"INDEX(Table_Standards[#This Row],1,Language_select+3)","v":{"$error":"#VALUE!"}},"Sicherheit von Maschinen — Elektrische Ausrüstung von Maschinen —  Teil 11: Anforderungen an Hochspannungsausrüstung für Spannungen  über 1000 V Wechselspannung oder 1 500 V Gleichspannung aber nicht  über 36 kV","Safety of machinery - Electrical equipment of machines - Part 11: Requirements for HV equipment for voltages above 1 000 V a.c. or 1 500 V d.c. and not exceeding 36 kV IEC 60204-11:2000","Sécurité des machines — Equipement électrique des machines — Partie 11: Prescriptions pour les équipements HT fonctionnant à des tensions supérieures à 1 000 V c.a. ou 1 500 V c.c. et ne dépassant pas 36 kV"]
["2021-10-02","EN 60204-11:2000/AC:2010",{"$f":"INDEX(Table_Standards[#This Row],1,Language_select+3)","v":{"$error":"#VALUE!"}},"Sicherheit von Maschinen — Elektrische Ausrüstung von Maschinen —  Teil 11: Anforderungen an Hochspannungsausrüstung für Spannungen  über 1000 V Wechselspannung oder 1 500 V Gleichspannung aber nicht  über 36 kV","Safety of machinery - Electrical equipment of machines - Part 11: Requirements for HV equipment for voltages above 1 000 V a.c. or 1 500 V d.c. and not exceeding 36 kV IEC 60204-11:2000","Sécurité des machines — Equipement électrique des machines — Partie 11: Prescriptions pour les équipements HT fonctionnant à des tensions supérieures à 1 000 V c.a. ou 1 500 V c.c. et ne dépassant pas 36 kV"]
["2021-10-02","EN 1127-1:2011",{"$f":"INDEX(Table_Standards[#This Row],1,Language_select+3)","v":{"$error":"#VALUE!"}},"Explosionsfähige Atmosphären — Explosionsschutz — Teil 1: Grundlagen  und Methodik (<-- A-Norm)","Explosive atmospheres - Explosion prevention and protection - Part 1: Basic concepts and methodology","Atmosphères explosives — Prévention de l’explosion et protection contre l’explosion — Partie 1: Notions fondamentales et méthodologie"]
["2022-09-03","EN 349:1993/A1:2008",{"$f":"INDEX(Table_Standards[#This Row],1,Language_select+3)","v":{"$error":"#VALUE!"}},"Sicherheit von Maschinen — Mindestabstände zur Vermeidung des Quetschens von Körperteilen","Safety of machinery - Minimum gaps to avoid crushing of parts of the human body","Sécurité des machines — Ecartements minimaux pour prévenir les risques d’écrasement de parties du corps humain"]
["2022-09-03","EN 574:1996/A1:2008",{"$f":"INDEX(Table_Standards[#This Row],1,Language_select+3)","v":{"$error":"#VALUE!"}},"Sicherheit von Maschinen — Zweihandschaltungen — Funktionelle  Aspekte — Gestaltungsleitsätze","Safety of machinery - Two-hand control devices - Functional aspects - Principles for design","Sécurité des machines — Dispositifs de commande bimanuelle — Aspects fonctionnels — Principes de conception"]
["2022-09-03","EN ISO 11203:2009",{"$f":"INDEX(Table_Standards[#This Row],1,Language_select+3)","v":{"$error":"#VALUE!"}},"Akustik — Geräuschabstrahlung von Maschinen und Geräten — Bestimmung  von Emissions-Schalldruckpegeln am Arbeitsplatz und an  anderen festgelegten Orten aus dem Schallleistungspegel","Acoustics - Noise emitted by machinery and equipment - Determination of emission sound pressure levels at a work station and at other specified positions from the sound power level (ISO 11203:1995)","Acoustique — Bruit émis par les machines et équipements — Détermination des niveaux de pression acoustique d’émission au poste de travail et en d’autres positions spécifiées à partir du niveau de puissance acoustique"]
["2022-09-03","EN ISO 13857:2008",{"$f":"INDEX(Table_Standards[#This Row],1,Language_select+3)","v":{"$error":"#VALUE!"}},"Sicherheit von Maschinen — Sicherheitsabstände gegen das Erreichen  von Gefährdungsbereichen mit den oberen und unteren Gliedmaßen","Safety of machinery - Safety distances to prevent hazard zones being reached by upper and lower limbs (ISO 13857:2008)","Sécurité des machines — Distances de sécurité empêchant les membres supérieurs et inférieurs d’atteindre les zones dangereuses"]
["2023-04-15","EN 1837:1999+A1:2009",{"$f":"INDEX(Table_Standards[#This Row],1,Language_select+3)","v":{"$error":"#VALUE!"}},"Sicherheit von Maschinen — Maschinenintegrierte Beleuchtung","Safety of machinery - Integral lighting of machines","Sécurité des machines — Éclairage intégré aux machines"]
["2023-04-15","EN ISO 3743-2:2009",{"$f":"INDEX(Table_Standards[#This Row],1,Language_select+3)","v":{"$error":"#VALUE!"}},"Akustik — Bestimmung der Schallleistungspegel von Geräuschquellen  aus Schalldruckmessungen — Verfahren der Genauigkeitsklasse 2 für  kleine, transportable Quellen in Hallfeldern —  Teil 2: Verfahren für Sonder-Hallräume","Acoustics - Determination of sound power levels of noise sources using sound pressure - Engineering methods for small, movable sources in reverberant fields - Part 2: Methods for special reverberation test rooms (ISO 3743-2:1994)","Acoustique — Détermination des niveaux de puissance acoustique et des niveaux d’énergie acoustique émis par les sources de bruit à partir de la pression acoustique — Méthodes d’expertise en champ réverbéré applicables aux petites\nsources transportables — Partie 2: Méthodes en salle d’essai réverbérante spéciale"]
[]
[]
[null,"Eigene Normen (C-Normen / Werksnormen / …)"]
["GSA","Nummer","Bezeichnung","Deutsch","English","Français"]
[null,"2006/42/EG",{"$f":"INDEX(Table_Standards_Own[#This Row],1,Language_select+3)","v":"machinery directive"},"Maschinenrichtlinie","machinery directive","Français"]
[null,"EN 12549:1999+A1:2008",{"$f":"INDEX(Table_Standards_Own[#This Row],1,Language_select+3)","v":"Acoustics - Noise test code for fastener driving tools - Engineering method"},"Akustik — Geräuschmessverfahren für Eintreibgeräte — Verfahren der  Genauigkeitsklasse 2","Acoustics - Noise test code for fastener driving tools - Engineering method","Français"]
[null,"EN 61000-6-2:2005",{"$f":"INDEX(Table_Standards_Own[#This Row],1,Language_select+3)","v":"Electromagnetic compatibility (EMC) - Part 6-2: Generic standards - Immunity for industrial environments "},"Elektromagnetische Verträglichkeit (EMV) - Teil 6-2: Fachgrundnormen - Störfestigkeit für Industriebereiche","Electromagnetic compatibility (EMC) - Part 6-2: Generic standards - Immunity for industrial environments ","Français"]
[null,"EN 619:2002+A1:2010",{"$f":"INDEX(Table_Standards_Own[#This Row],1,Language_select+3)","v":"Continuous handling equipment and systems — Safety and EMC requirements for equipment for mechanical handling of unit loads"},"Stetigförderer und Systeme — Sicherheits- und EMV-Anforderungen an mechanische Fördereinrichtungen für Stückgut","Continuous handling equipment and systems — Safety and EMC requirements for equipment for mechanical handling of unit loads","Français"]
[null,"EN ISO 10218-1:2011",{"$f":"INDEX(Table_Standards_Own[#This Row],1,Language_select+3)","v":"Robots and robotic devices - Safety requirements for industrial robots - Part 1: Robots (ISO 10218-1:2011)"},"Industrieroboter – Sicherheitanforderungen – Teil 1: Roboter","Robots and robotic devices - Safety requirements for industrial robots - Part 1: Robots (ISO 10218-1:2011)","Français"]
[null,"EN ISO 11252:2013",{"$f":"INDEX(Table_Standards_Own[#This Row],1,Language_select+3)","v":"Lasers and laser-related equipment - Laser device - Minimum requirements for documentation (ISO 11252:2004)"},"Laser und Laseranlagen — Lasergerät — Mindestanforderungen an die  Dokumentation","Lasers and laser-related equipment - Laser device - Minimum requirements for documentation (ISO 11252:2004)","Français"]
[null,"EN ISO 12100:2010",{"$f":"INDEX(Table_Standards_Own[#This Row],1,Language_select+3)","v":"Safety of machinery - General principles for design - Risk assessment and risk reduction"},"Sicherheit von Maschinen - Allgemeine Gestaltungsleitsätze - Risikobeurteilung und Risikominderung ","Safety of machinery - General principles for design - Risk assessment and risk reduction","Français"]
[null,"EN ISO 15744:2008",{"$f":"INDEX(Table_Standards_Own[#This Row],1,Language_select+3)","v":"Hand-held non-electric power tools - Noise measurement code - Engineering method (grade 2) (ISO 15744:2002)"},"Handgehaltene, nicht elektrisch betriebene Maschinen — Geräuschmessverfahren  — Verfahren der Genauigkeitsklasse 2","Hand-held non-electric power tools - Noise measurement code - Engineering method (grade 2) (ISO 15744:2002)","Français"]
[null,"EN ISO 16231-1:2013",{"$f":"INDEX(Table_Standards_Own[#This Row],1,Language_select+3)","v":"Self-propelled agricultural machinery - Assessment of stability - Part 1: Principles"},"Selbstfahrende Maschinen in der Landwirtschaft — Bewertung der Stabilität — Teil 1: Richtlinien","Self-propelled agricultural machinery - Assessment of stability - Part 1: Principles","Français"]
[null,"IEC 60068-2-27:2008",{"$f":"INDEX(Table_Standards_Own[#This Row],1,Language_select+3)","v":"Environmental testing - Part 2-27: Tests - Test Ea and guidance: Shock"},"Umgebungseinflüsse - Teil 2-27: Prüfverfahren - Prüfung Ea und Leitfaden: Schocken ","Environmental testing - Part 2-27: Tests - Test Ea and guidance: Shock","Français"]
[null,"IEC 60068-2-6:2007",{"$f":"INDEX(Table_Standards_Own[#This Row],1,Language_select+3)","v":"Environmental testing - Part 2-6: Tests - Test Fc: Vibration (sinusoidal)"},"Umgebungseinflüsse - Teil 2-6: Prüfverfahren - Prüfung Fc: Schwingen (sinusförmig)","Environmental testing - Part 2-6: Tests - Test Fc: Vibration (sinusoidal)","Français"]
[null,null,{"$f":"INDEX(Table_Standards_Own[#This Row],1,Language_select+3)","v":"English"},"Deutsch","English","Français"]
[null,null,{"$f":"INDEX(Table_Standards_Own[#This Row],1,Language_select+3)","v":"English"},"Deutsch","English","Français"]
[null,null,{"$f":"INDEX(Table_Standards_Own[#This Row],1,Language_select+3)","v":"English"},"Deutsch","English","Français"]
[null,null,{"$f":"INDEX(Table_Standards_Own[#This Row],1,Language_select+3)","v":"English"},"Deutsch","English","Français"]
[null,null,{"$f":"INDEX(Table_Standards_Own[#This Row],1,Language_select+3)","v":"English"},"Deutsch","English","Français"]

{"sheet":"EN ISO 12100","index":4,"n_rows":101,"n_cols":5,"rows_kept":101,"cut":false,"hidden":false,"merged":[[3,1,21,1],[3,0,21,0],[22,1,31,1],[22,0,31,0],[89,1,99,1],[89,0,99,0],[78,1,88,1],[78,0,88,0],[0,0,0,4],[59,1,64,1],[59,0,64,0],[65,1,77,1],[65,0,77,0],[32,1,38,1],[32,0,38,0],[39,1,50,1],[39,0,50,0],[51,1,58,1],[51,0,58,0],[1,2,1,3]]}
["Gefährdungen EN ISO 12100 Tabelle B.1"]
[null,null,"Gefährdungsbeispiele"]
["Nr.","Art oder Gruppe","Ursprung","Mögliche Auswirkungen","Abschnitt Bezug"]
[1,"Mechanische Gefährdungen","---","---","---"]
[null,null,"Beschleunigung/Abbremsung;","Überfahren werden;","6.2.2.1"]
[null,null,"spitze Teile;","Weggeschleudert werden;","6.2.2.2"]
[null,null,"Annäherung eines sich bewegenden Teils an ein feststehendes Teil;","Quetschen;","6.2.3 a)"]
[null,null,"schneidende Teile;","Schneiden oder Abschneiden;","6.2.3 b)"]
[null,null,"elastische Elemente;","Einziehen oder Fangen;","6.2.6"]
[null,null,"herab fallende Gegenstände;","Erfassen;","6.2.10"]
[null,null,"Schwerkraft;","Reiben oder Abschürfen;","6.3.1"]
[null,null,"Höhe gegenüber dem Boden;","Stoß;","6.3.2"]
[null,null,"Hochdruck;","Eindringen von unter Druck stehenden Medien;","6.3.3"]
[null,null,"fehlende Standfestigkeit/-sicherheit;","Scheren;","6.3.5.2"]
[null,null,"kinetische Energie;","Ausrutschen, Stolpern und Stürzen;","6.3.5.4"]
[null,null,"Beweglichkeit der Maschine;","Durchstich oder Einstich;","6.3.5.5"]
[null,null,"sich bewegende Teile;","Ersticken.","6.3.5.6"]
[null,null,"rotierende Teile;",null,"6.4.1"]
[null,null,"raue, rutschige Oberfläche;",null,"6.4.3"]
[null,null,"scharfe Kanten;",null,"6.4.4"]
[null,null,"gespeicherte Energie;",null,"6.4.5"]
[null,null,"Vakuum."]
[2,"Elektrische Gefährdungen","---","---","---"]
[null,null,"Lichtbogen;","Verbrennung;","6.2.9"]
[null,null,"elektromagnetische Vorgänge;","chemische Reaktionen;","6.3.2"]
[null,null,"elektrostatische Vorgänge;","Auswirkungen auf medizinische Implantate;","6.3.3.2"]
[null,null,"spannungsführende Teile;","tödlicher Stromschlag;","6.3.5.4"]
[null,null,"unzureichender Abstand zu unter Hochspannung stehenden Teilen;","Stürzen, Weggeschleudert werden;","6.4.4"]
[null,null,"Überlast;","Feuer;","6.4.5"]
[null,null,"Teile, die im Fehlerzustand spannungsführend geworden sind;","Herausschleudern von geschmolzenen Teilen;"]
[null,null,"Kurzschluss;","(elektrischer) Schlag."]
[null,null,"Wärmestrahlung."]
[3,"Thermische Gefährdungen","---","---","---"]
[null,null,"Explosion;","Verbrennung;","6.2.4 b)"]
[null,null,"Flamme;","Dehydrierung;","6.2.8 c)"]
[null,null,"Objekte oder Materialien hoher oder niedriger Temperatur;","Unbehagen;","6.3.2.7"]
[null,null,"Strahlung von Wärmequellen","Erfrierung;","6.3.3.2.1"]
[null,null,null,"Verletzungen durch Strahlung von Wärmequellen;","6.3.4.5"]
[null,null,null,"Verbrühung."]
[4,"Gefährdungen durch Lärm","---","---","---"]
[null,null,"Kavitationsvorgänge;","Unbehagen;","6.2.2.2"]
[null,null,"Abluftsystem;","Bewusstseinsverlust;","6.2.3 c)"]
[null,null,"mit hoher Geschwindigkeit austretendes Gas;","Gleichgewichtsstörung;","6.2.4 c)"]
[null,null,"Herstellungsprozess (Stanzen, Schneiden usw.);","bleibender Gehörverlust;","6.2.8 c)"]
[null,null,"bewegliche Teile;","Stress;","6.3.1"]
[null,null,"reibende Flächen;","Tinnitus (Ohrensausen);","6.3.2.1 b)"]
[null,null,"mit Unwucht rotierende Teile;","Ermüdung;","6.3.2.5.1"]
[null,null,"pfeifende Pneumatik-Einrichtungen;","alle weiteren (z. B. mechanischen, elektrischen) Probleme als Folge einer Störung der Sprach-kommunikation oder einer Störung akustischer Signale","6.3.3.2.1"]
[null,null,"verschlissene Teile",null,"6.3.4.2"]
[null,null,null,null,"6.4.3"]
[null,null,null,null,"6.4.5.1 b) und c)"]
[5,"Gefährdungen durch Vibration","---","---","---"]
[null,null,"Kavitationsvorgänge;","Unbehagen;","6.2.2.2"]
[null,null,"Fehlausrichtung sich bewegender Teile;","Erkrankungen der unteren Wirbelsäule;","6.2.3 c)"]
[null,null,"bewegliche Ausrüstung;","neurologische Erkrankung;","6.2.8 c)"]
[null,null,"reibende Flächen;","Knochengelenkschaden;","6.3.3.2.1"]
[null,null,"mit Unwucht rotierende Teile;","Wirbelsäulenverletzung;","6.3.4.3"]
[null,null,"schwingende Ausrüstung;","Gefäßerkrankung","6.4.5.1 c)"]
[null,null,"verschlissene Teile"]
[6,"Gefährdungen durch Strahlung","---","---","---"]
[null,null,"ionisierende Strahlungsquelle;","Verbrennung;","6.2.2.2"]
[null,null,"niederfrequente elektromagnetische Strahlung;","Augen- und Hautschädigung;","6.2.3 c)"]
[null,null,"optische Strahlung (infrarot, sichtbar und ultraviolett), einschließlich Laserstrahlen;","Auswirkungen auf die Fortpflanzungsfähigkeit;","6.3.3.2.1"]
[null,null,"hochfrequente elektromagnetische Strahlung","Mutation;","6.3.4.5"]
[null,null,null,"Kopfschmerzen, Schlaflosigkeit usw.","6.4.5.1 c)"]
[7,"Gefährdungen durch Materialien und Substanzen","---","---","---"]
[null,null,"Aerosol;","Atembeschwerden, Ersticken;","6.2.2.2"]
[null,null,"biologische und mikrobiologische (virale oder bakterielle) Substanz;","Krebs;","6.2.3 b)"]
[null,null,"Brennstoff;","Korrosion;","6.2.3 c)"]
[null,null,"Staub;","Auswirkungen auf die Fortpflanzungsfähigkeit;","6.2.4 a)"]
[null,null,"Explosivstoff;","Explosion;","6.2.4 b)"]
[null,null,"Fasern;","Feuer;","6.3.1"]
[null,null,"feuergefährliches Material;","Infektion;","6.3.3.2.1"]
[null,null,"Flüssigkeit;","Veränderung des Erbguts;","6.3.4.4"]
[null,null,"Dämpfe;","Vergiftung;","6.4.5.1 c)"]
[null,null,"Gas;","Sensibilisierung","6.4.5.1 g)"]
[null,null,"Nebel;"]
[null,null,"Oxidationsmittel"]
[8,"Ergonomische Gefährdungen","---","---","---"]
[null,null,"Zugang;","Unbehagen;","6.2.2.1"]
[null,null,"Gestaltung oder Anordnung von Anzeigen und optischen Displays;","Ermüdung;","6.2.7"]
[null,null,"Gestaltung, Anordnung oder Erkennung von Steuerungseinrichtungen;","Störungen des Bewegungsapparates;","6.2.8"]
[null,null,"Anstrengung;","Stress;","6.2.11.8"]
[null,null,"Flackern, Blenden, Schattenbildung und stroboskopische Effekte;","alle weiteren (z. B. mechanischen, elektrischen) Probleme als Folge menschlichen Fehlverhaltens","6.3.2.1"]
[null,null,"örtliche Beleuchtung;",null,"6.3.3.2.1"]
[null,null,"psychische Überbelastung/ Unterforderung;"]
[null,null,"Körperhaltung;"]
[null,null,"sich wiederholende Tätigkeiten;"]
[null,null,"Sichtbarkeit"]
[9,"Gefährdungen im Zusammenhang mit der Einsatzumgebung der Maschine","---","---","---"]
[null,null,"Staub und Nebel;","Verbrennung;","6.2.6"]
[null,null,"elektromagnetische Störungen;","leichte Erkrankungen;","6.2.11.11"]
[null,null,"Blitzschlag;","Ausrutschen, Stürzen;","6.3.2.1"]
[null,null,"Feuchtigkeit;","Ersticken;","6.4.5.1 b)"]
[null,null,"Verunreinigungen;","alle weiteren Probleme, die als Folge der Auswirkungen der Gefährdungsquellen an der Maschine oder an Teilen der Maschine auftreten."]
[null,null,"Schnee;"]
[null,null,"Temperatur;"]
[null,null,"Wasser;"]
[null,null,"Wind;"]
[null,null,"Sauerstoffmangel"]
[10,"Kombination von Gefährdungen","z. B. sich wiederholende Tätigkeit + Anstrengung + hohe Umgebungstemperatur","z. B. Dehydrierung, Bewusstseinsverlust, Hitzeschock"]

{"sheet":"Language","index":5,"n_rows":550,"n_cols":6,"rows_kept":550,"cut":false,"hidden":false,"merged":[]}
["2","Deutsch","English","Français"]
[{"$f":"INDEX(Table_Language[#This Row],1,Language_select+1)","v":"Sheet Risk Assessment"},"Blatt Risikobeurteilung","Sheet Risk Assessment","Français"]
[{"$f":"INDEX(Table_Language[#This Row],1,Language_select+1)","v":"Identifying Number of the hazard"},"Laufende Nummer der Gefährdung","Identifying Number of the hazard","Français"]
[{"$f":"INDEX(Table_Language[#This Row],1,Language_select+1)","v":"Main"},"Haupt","Main","Français"]
[{"$f":"INDEX(Table_Language[#This Row],1,Language_select+1)","v":"Sub"},"Unter","Sub","Français"]
[{"$f":"INDEX(Table_Language[#This Row],1,Language_select+1)","v":"Essential health and safety requirements"},"grundlegende Sicherheits- und Gesundheitsschutzanforderungen","Essential health and safety requirements","Français"]
[{"$f":"INDEX(Table_Language[#This Row],1,Language_select+1)","v":"No."},"Nr.","No.","Français"]
[{"$f":"INDEX(Table_Language[#This Row],1,Language_select+1)","v":"Title"},"Bezeichnung","Title","Français"]
[{"$f":"INDEX(Table_Language[#This Row],1,Language_select+1)","v":"Original (x=line can not be deleted)"},"Original (x=Zeile kann nicht gelöscht werden)","Original (x=line can not be deleted)","Français"]
[{"$f":"INDEX(Table_Language[#This Row],1,Language_select+1)","v":"Hazard exists"},"Gefährdung vorhanden","Hazard exists","Français"]
[{"$f":"INDEX(Table_Language[#This Row],1,Language_select+1)","v":"Information:\n\nx = is applied\n? = to be decided\n- = not applied"},"Hinweis:\n\nx = trifft zu\n? = muss noch entschieden werden\n- = trifft nicht zu","Information:\n\nx = is applied\n? = to be decided\n- = not applied","Français"]
[{"$f":"INDEX(Table_Language[#This Row],1,Language_select+1)","v":"Content already covered?"},"Inhalt bereits abgedeckt?","Content already covered?","Français"]
[{"$f":"INDEX(Table_Language[#This Row],1,Language_select+1)","v":"Information:\n\nx = content is covered / done\nempty = must be considered in EHSR"},"Hinweis:\n\nx = Inhalt ist abgedeckt / erledigt\nLeer = muss behandelt werden","Information:\n\nx = content is covered / done\nempty = must be considered in EHSR","Français"]
[{"$f":"INDEX(Table_Language[#This Row],1,Language_select+1)","v":"Standard type"},"Norm-Typ","Standard type","Français"]
[{"$f":"INDEX(Table_Language[#This Row],1,Language_select+1)","v":"Information:\n\n1 = C-Standard\n2 = B1-Standard\n3 = B2-Standard\n4 = A-Standard"},"Hinweis:\n\n1 = C-Norm\n2 = B1-Norm\n3 = B2-Norm\n4 = A-Norm","Information:\n\n1 = C-Standard\n2 = B1-Standard\n3 = B2-Standard\n4 = A-Standard","Français"]
[{"$f":"INDEX(Table_Language[#This Row],1,Language_select+1)","v":"Hazard according to (harmonized) standard"},"Gefährdungen nach (harmonisierter) Norm","Hazard according to (harmonized) standard","Français"]
[{"$f":"INDEX(Table_Language[#This Row],1,Language_select+1)","v":"Standard number"},"Norm Nummer","Standard number","Français"]
[{"$f":"INDEX(Table_Language[#This Row],1,Language_select+1)","v":"Standard title"},"Norm Titel","Standard title","Français"]
[{"$f":"INDEX(Table_Language[#This Row],1,Language_select+1)","v":"Subclause"},"Abschnitt / Detail","Subclause","Français"]
[{"$f":"INDEX(Table_Language[#This Row],1,Language_select+1)","v":"Standard's content (short form)"},"Norminhalt (eingekürzt und bearbeitet)","Standard's content (short form)","Français"]
[{"$f":"INDEX(Table_Language[#This Row],1,Language_select+1)","v":"Origin"},"Ursprung","Origin","Français"]
[{"$f":"INDEX(Table_Language[#This Row],1,Language_select+1)","v":"Potential consequences"},"mögliche Auswirkung","Potential consequences","Français"]
[{"$f":"INDEX(Table_Language[#This Row],1,Language_select+1)","v":"Place / hazard zone / position in drawing"},"Ort / Gefahrbereich / Position in Zeichnung","Place / hazard zone / position in drawing","Français"]
[{"$f":"INDEX(Table_Language[#This Row],1,Language_select+1)","v":"Hazard / hazardous situation"},"Gefährdung / Gefährdungssituation","Hazard / hazardous situation","Français",null,"entfallen"]
[{"$f":"INDEX(Table_Language[#This Row],1,Language_select+1)","v":"Person in danger"},"Gefährdete Personen","Person in danger","Français"]
[{"$f":"INDEX(Table_Language[#This Row],1,Language_select+1)","v":"Phase of life cycle (acc. to EN ISO 12100, Table B.3)"},"Lebensphase (nach EN ISO 12100, Tabelle B.3)","Phase of life cycle (acc. to EN ISO 12100, Table B.3)","Français"]
[{"$f":"INDEX(Table_Language[#This Row],1,Language_select+1)","v":"All"},"Alle","All","Français"]
[{"$f":"INDEX(Table_Language[#This Row],1,Language_select+1)","v":"Transport"},"Transport","Transport","Français"]
[{"$f":"INDEX(Table_Language[#This Row],1,Language_select+1)","v":"Assembly and installation\nCommissioning"},"Montage und Installation\nInbetriebnahme","Assembly and installation\nCommissioning","Français"]
[{"$f":"INDEX(Table_Language[#This Row],1,Language_select+1)","v":"Setting\nTeaching/programming\nand/or process changeover"},"Einrichten\nEinlernen (Teachen)/ Programmieren und/oder Umrüsten","Setting\nTeaching/programming\nand/or process changeover","Français"]
[{"$f":"INDEX(Table_Language[#This Row],1,Language_select+1)","v":"Operation"},"Betrieb","Operation","Français"]
[{"$f":"INDEX(Table_Language[#This Row],1,Language_select+1)","v":"Cleaning\nMaintenance"},"Reinigung\nInstandhaltung","Cleaning\nMaintenance","Français"]
[{"$f":"INDEX(Table_Language[#This Row],1,Language_select+1)","v":"Fault-finding/\nTroubleshooting"},"Fehlersuche und -beseitigung","Fault-finding/\nTroubleshooting","Français"]
[{"$f":"INDEX(Table_Language[#This Row],1,Language_select+1)","v":"Dismantling\nDisabling"},"Demontage\nAußer Betrieb nehmen","Dismantling\nDisabling","Français"]
[{"$f":"INDEX(Table_Language[#This Row],1,Language_select+1)","v":"Risk Assessment"},"Risikoeinschätzung","Risk Assessment","Français"]
[{"$f":"INDEX(Table_Language[#This Row],1,Language_select+1)","v":"Information:\nThis is from the graph of the EN ISO 13849-1.\nYou can change this to any graph of your choice.\nS – severity of injury\nS1 – slight (normally reversible injury)\nS2 – serious (normally irreversible injury or death)\nF – frequency and/or exposure to hazard\nF1 – seldom-to-less-often and/or exposure time is short\nF2 – frequent-to-continuous and/or exposure time is long\nP – possibility of avoiding hazard or limiting harm\nP1 – possible under specific conditions\nP2 – scarcely possible\nO – probability of occurrence of a hazardous event\nO1 – low (with justification in commentary!)\nO2 – normal"},"Hinweis:\nHier ist der Graph der EN ISO 13849-1 abgebildet. Sie können diesen durch einen beliebigen Graphen Ihrer Wahl ersetzen.\nSchwere der Verletzung S1 und S2\nS1 – leicht (üblicherweise reversible Verletzung)\nS2 – ernst (üblicherweise irreversible Verletzung einschließlich Tod)\nHäufigkeit und/oder Dauer der Gefährdungsexposition F1 und F2\nF1 – selten bis weniger häufig und/oder die Dauer der Gefährdungsexposition ist kurz\nF2 – häufig bis dauernd und/oder die Dauer der Gefährdungsexposition ist lang\nMöglichkeit zur Vermeidung der Gefährdung P1 und P2\nP1 – möglich unter bestimmten Bedingungen,\nP2 – kaum möglich\nW1 – unwahrscheinlich (mit Begründung im Kommentar!)\nW2 – normale Wahrscheinlichkeit ","Information:\nThis is from the graph of the EN ISO 13849-1.\nYou can change this to any graph of your choice.\nS – severity of injury\nS1 – slight (normally reversible injury)\nS2 – serious (normally irreversible injury or death)\nF – frequency and/or exposure to hazard\nF1 – seldom-to-less-often and/or exposure time is short\nF2 – frequent-to-continuous and/or exposure time is long\nP – possibility of avoiding hazard or limiting harm\nP1 – possible under specific conditions\nP2 – scarcely possible\nO – probability of occurrence of a hazardous event\nO1 – low (with justification in commentary!)\nO2 – normal","Français"]
[{"$f":"INDEX(Table_Language[#This Row],1,Language_select+1)","v":"S"},"S","S","Français"]
[{"$f":"INDEX(Table_Language[#This Row],1,Language_select+1)","v":"F"},"F","F","Français"]
[{"$f":"INDEX(Table_Language[#This Row],1,Language_select+1)","v":"P"},"P","P","Français"]
[{"$f":"INDEX(Table_Language[#This Row],1,Language_select+1)","v":"Risk"},"Risiko","Risk","Français"]
[{"$f":"INDEX(Table_Language[#This Row],1,Language_select+1)","v":"risk reduction"},"Risikominimierung","risk reduction","Français"]
[{"$f":"INDEX(Table_Language[#This Row],1,Language_select+1)","v":"design and construction"},"konstruktiv","design and construction","Français"]
[{"$f":"INDEX(Table_Language[#This Row],1,Language_select+1)","v":"protective measures"},"sicherheitstechnisch","protective measures","Français"]
[{"$f":"INDEX(Table_Language[#This Row],1,Language_select+1)","v":"information"},"informativ","information","Français"]
[{"$f":"INDEX(Table_Language[#This Row],1,Language_select+1)","v":"description of the risk reduction"},"Beschreibung der Risikominderung","description of the risk reduction","Français"]
[{"$f":"INDEX(Table_Language[#This Row],1,Language_select+1)","v":"applied technical standards / harmonised B / C standard"},"angewandte technische Spezifikation / harmonisierte B / C Norm","applied technical standards / harmonised B / C standard","Français"]
[{"$f":"INDEX(Table_Language[#This Row],1,Language_select+1)","v":"Title"},"Titel","Title","Français"]
[{"$f":"INDEX(Table_Language[#This Row],1,Language_select+1)","v":"Subclause of the Standard"},"Fundstelle in Norm","Subclause of the Standard","Français"]
[{"$f":"INDEX(Table_Language[#This Row],1,Language_select+1)","v":"technical report / test result"},"technischer Bericht / Prüfergebnis","technical report / test result","Français"]
[{"$f":"INDEX(Table_Language[#This Row],1,Language_select+1)","v":"Risk Assessment"},"Risiko- einschätzung","Risk Assessment","Français"]
[{"$f":"INDEX(Table_Language[#This Row],1,Language_select+1)","v":"S"},"S","S","Français"]
[{"$f":"INDEX(Table_Language[#This Row],1,Language_select+1)","v":"F"},"F","F","Français"]
[{"$f":"INDEX(Table_Language[#This Row],1,Language_select+1)","v":"P"},"P","P","Français"]
[{"$f":"INDEX(Table_Language[#This Row],1,Language_select+1)","v":"Risk"},"Risiko","Risk","Français"]
[{"$f":"INDEX(Table_Language[#This Row],1,Language_select+1)","v":"Further reduction of the risk necessary?"},"Weitere Reduzierung notwendig?","Further reduction of the risk necessary?","Français"]
[{"$f":"INDEX(Table_Language[#This Row],1,Language_select+1)","v":"Information:\nx = applies (further reduction needed)\n- = no further reduction necessary"},"Hinweis:\nx = trifft zu (weitere Reduzierung notwendig)\n- = keine weitere Reduzierung notwendig","Information:\nx = applies (further reduction needed)\n- = no further reduction necessary","Français"]
[{"$f":"INDEX(Table_Language[#This Row],1,Language_select+1)","v":"Comment"},"Kommentar","Comment","Français"]
[{"$f":"INDEX(Table_Language[#This Row],1,Language_select+1)","v":"Person in charge"},"Bearbeiter","Person in charge","Français"]
[{"$f":"INDEX(Table_Language[#This Row],1,Language_select+1)","v":"Date of last change"},"Datum der letzten Änderung","Date of last change","Français"]
[{"$f":"INDEX(Table_Language[#This Row],1,Language_select+1)","v":"Hazard is covered?"},"Gefährdung ist behandelt?","Hazard is covered?","Français"]
[{"$f":"INDEX(Table_Language[#This Row],1,Language_select+1)","v":"Information:\nx = covered / line is finished\n- = not completely covered, more work needed in this line"},"Hinweis:\nx = behandelt / betrachtet, Zeile ist fertig\n- = Nicht behandelt / betrachtet, Zeile muss noch bearbeitet werden","Information:\nx = covered / line is finished\n- = not completely covered, more work needed in this line","Français"]
[{"$f":"INDEX(Table_Language[#This Row],1,Language_select+1)","v":"Group fields"},"Gruppenfeld","Group fields","Français"]
[{"$f":"INDEX(Table_Language[#This Row],1,Language_select+1)","v":"Adding / deleting rows"},"Einfügen / Löschen von Zeilen","Adding / deleting rows","Français"]
[{"$f":"INDEX(Table_Language[#This Row],1,Language_select+1)","v":"Worksheets"},"Tabellenblätter","Worksheets","Français"]
[{"$f":"INDEX(Table_Language[#This Row],1,Language_select+1)","v":"Project data"},"Projektdaten","Project data","Données projet"]
[{"$f":"INDEX(Table_Language[#This Row],1,Language_select+1)","v":"Risk Assessment"},"Risikobeurteilung","Risk Assessment","Évaluation des risques "]
[{"$f":"INDEX(Table_Language[#This Row],1,Language_select+1)","v":"B-Standards"},"B-Normen","B-Standards","B-Norme"]
[{"$f":"INDEX(Table_Language[#This Row],1,Language_select+1)","v":"EN ISO 12100"},"EN ISO 12100","EN ISO 12100","EN ISO 12100"]
[{"$f":"INDEX(Table_Language[#This Row],1,Language_select+1)","v":"Language"},"Sprache","Language","Langue"]
[{"$f":"INDEX(Table_Language[#This Row],1,Language_select+1)","v":"Own Cells"},"Eigene Zellen","Own Cells","Propre élément"]
[{"$f":"INDEX(Table_Language[#This Row],1,Language_select+1)","v":"Check Boxes"},"Kontrollkästchen","Check Boxes","Français"]
[{"$f":"INDEX(Table_Language[#This Row],1,Language_select+1)","v":"privately"},"Privat","privately","Français"]
[{"$f":"INDEX(Table_Language[#This Row],1,Language_select+1)","v":"Commercial, industrial application"},"Gewerbe, industrieller Einsatz","Commercial, industrial application","Français"]
[{"$f":"INDEX(Table_Language[#This Row],1,Language_select+1)","v":"Annex VIII"},"Anhang VIII","Annex VIII","Français"]
[{"$f":"INDEX(Table_Language[#This Row],1,Language_select+1)","v":"Annex IX"},"Anhang IX","Annex IX","Français"]
[{"$f":"INDEX(Table_Language[#This Row],1,Language_select+1)","v":"Annex X"},"Anhang X","Annex X","Français"]
[{"$f":"INDEX(Table_Language[#This Row],1,Language_select+1)","v":"notified body used"},"notifizierte Stelle eingeschaltet","notified body used","Français"]
[{"$f":"INDEX(Table_Language[#This Row],1,Language_select+1)","v":"Text Box"},"Text Box","Text Box","Français"]
[{"$f":"INDEX(Table_Language[#This Row],1,Language_select+1)","v":"Instructions of use at www.maschinenrichtlinie.com"},"Anleitung auf www.maschinenrichtlinie.de","Instructions of use at www.maschinenrichtlinie.com","Instruction de service sur www.maschinenrichtlinie.com"]
[{"$f":"INDEX(Table_Language[#This Row],1,Language_select+1)","v":"MBT Risk assessment based on maschinenrichtlinie.com\n© MBT Mechtersheimer GbR\nVersion "},"MBT Risikobeurteilung nach maschinenrichtlinie.de\n© MBT Mechtersheimer GbR\nVersion ","MBT Risk assessment based on maschinenrichtlinie.com\n© MBT Mechtersheimer GbR\nVersion ","MBT Évaluation des risques basé sur maschinenrichtlinie.com\n© MBT Mechtersheimer GbR\nVersion "]
[{"$f":"INDEX(Table_Language[#This Row],1,Language_select+1)","v":"License:\nCC BY 3.0 DE\nNamensnennung 3.0 Deutschland"},"Lizenz:\nCC BY 3.0 DE\nNamensnennung 3.0 Deutschland","License:\nCC BY 3.0 DE\nNamensnennung 3.0 Deutschland","Licence:\nCC BY 3.0 DE\nNamensnennung 3.0 Deutschland"]
[{"$f":"INDEX(Table_Language[#This Row],1,Language_select+1)","v":"EHSR"},"GSA","EHSR","Français"]
[{"$f":"INDEX(Table_Language[#This Row],1,Language_select+1)","v":"General remarks"},"Allgemeines","General remarks","Français"]
[{"$f":"INDEX(Table_Language[#This Row],1,Language_select+1)","v":"Principles of safety integration"},"Grundsätze für die Integration der Sicherheit","Principles of safety integration","Français"]
[{"$f":"INDEX(Table_Language[#This Row],1,Language_select+1)","v":"Materials and products"},"Materialien und Produkte","Materials and products","Français"]
[{"$f":"INDEX(Table_Language[#This Row],1,Language_select+1)","v":"Lighting"},"Beleuchtung","Lighting","Français"]
[{"$f":"INDEX(Table_Language[#This Row],1,Language_select+1)","v":"Design of machinery to facilitate its handling"},"Konstruktion der Maschine im Hinblick auf die Handhabung","Design of machinery to facilitate its handling","Français"]
[{"$f":"INDEX(Table_Language[#This Row],1,Language_select+1)","v":"Ergonomics"},"Ergonomie","Ergonomics","Français"]
[{"$f":"INDEX(Table_Language[#This Row],1,Language_select+1)","v":"Operating positions"},"Bedienungsplätze","Operating positions","Français"]
[{"$f":"INDEX(Table_Language[#This Row],1,Language_select+1)","v":"Seating"},"Sitze","Seating","Français"]
[{"$f":"INDEX(Table_Language[#This Row],1,Language_select+1)","v":"Control systems"},"Steuerungen und Befehlseinrichtungen","Control systems","Français"]
[{"$f":"INDEX(Table_Language[#This Row],1,Language_select+1)","v":"Safety and reliability of control systems"},"Sicherheit und Zuverlässigkeit von Steuerungen ","Safety and reliability of control systems","Français"]
[{"$f":"INDEX(Table_Language[#This Row],1,Language_select+1)","v":"Control devices"},"Stellteile ","Control devices","Français"]
[{"$f":"INDEX(Table_Language[#This Row],1,Language_select+1)","v":"Starting"},"Ingangsetzen ","Starting","Français"]
[{"$f":"INDEX(Table_Language[#This Row],1,Language_select+1)","v":"Stopping"},"Stillsetzen ","Stopping","Français"]
[{"$f":"INDEX(Table_Language[#This Row],1,Language_select+1)","v":"Normal stop"},"Normales Stillsetzen ","Normal stop","Français"]
[{"$f":"INDEX(Table_Language[#This Row],1,Language_select+1)","v":"Operational stop"},"Betriebsbedingtes Stillsetzen ","Operational stop","Français"]
[{"$f":"INDEX(Table_Language[#This Row],1,Language_select+1)","v":"Emergency stop"},"Stillsetzen im Notfall ","Emergency stop","Français"]
[{"$f":"INDEX(Table_Language[#This Row],1,Language_select+1)","v":"Assembly of machinery"},"Gesamtheit von Maschinen ","Assembly of machinery","Français"]
[{"$f":"INDEX(Table_Language[#This Row],1,Language_select+1)","v":"Selection of control or operating modes"},"Wahl der Steuerungs- oder Betriebsarten ","Selection of control or operating modes","Français"]
[{"$f":"INDEX(Table_Language[#This Row],1,Language_select+1)","v":"Failure of the power supply"},"Störung der Energieversorgung ","Failure of the power supply","Français"]
[{"$f":"INDEX(Table_Language[#This Row],1,Language_select+1)","v":"Protection against mechanical hazards"},"Schutzmaßnahmen gegen mechanische Gefährdungen ","Protection against mechanical hazards","Français"]
[{"$f":"INDEX(Table_Language[#This Row],1,Language_select+1)","v":"Risk of loss of stability"},"Risiko des Verlusts der Standsicherheit ","Risk of loss of stability","Français"]
[{"$f":"INDEX(Table_Language[#This Row],1,Language_select+1)","v":"Risk of break-up during operation"},"Bruchrisiko beim Betrieb ","Risk of break-up during operation","Français"]
[{"$f":"INDEX(Table_Language[#This Row],1,Language_select+1)","v":"Risks due to falling or ejected objects"},"Risiken durch herabfallende oder herausgeschleuderte Gegenstände ","Risks due to falling or ejected objects","Français"]
[{"$f":"INDEX(Table_Language[#This Row],1,Language_select+1)","v":"Risks due to surfaces, edges or angles"},"Risiken durch Oberflächen, Kanten und Ecken ","Risks due to surfaces, edges or angles","Français"]
[{"$f":"INDEX(Table_Language[#This Row],1,Language_select+1)","v":"Risks related to combined machinery"},"Risiken durch mehrfach kombinierte Maschinen ","Risks related to combined machinery","Français"]
[{"$f":"INDEX(Table_Language[#This Row],1,Language_select+1)","v":"Risks related to variations in operating conditions"},"Risiken durch Änderung der Verwendungsbedingungen ","Risks related to variations in operating conditions","Français"]
[{"$f":"INDEX(Table_Language[#This Row],1,Language_select+1)","v":"Risks related to moving parts"},"Risiken durch bewegliche Teile ","Risks related to moving parts","Français"]
[{"$f":"INDEX(Table_Language[#This Row],1,Language_select+1)","v":"Choice of protection against risks arising from moving parts"},"Wahl der Schutzeinrichtungen gegen Risiken durch bewegliche Teile ","Choice of protection against risks arising from moving parts","Français"]
[{"$f":"INDEX(Table_Language[#This Row],1,Language_select+1)","v":"Moving transmission parts"},"Bewegliche Teile der Kraftübertragung ","Moving transmission parts","Français"]
[{"$f":"INDEX(Table_Language[#This Row],1,Language_select+1)","v":"Moving parts involved in the process"},"Bewegliche Teile, die am Arbeitsprozess beteiligt sind ","Moving parts involved in the process","Français"]
[{"$f":"INDEX(Table_Language[#This Row],1,Language_select+1)","v":"Risks of uncontrolled movements"},"Risiko unkontrollierter Bewegungen ","Risks of uncontrolled movements","Français"]
[{"$f":"INDEX(Table_Language[#This Row],1,Language_select+1)","v":"Required characteristics of guards and protective devices"},"Anforderungen an Schutzeinrichtungen ","Required characteristics of guards and protective devices","Français"]
[{"$f":"INDEX(Table_Language[#This Row],1,Language_select+1)","v":"General requirements"},"Allgemeine Anforderungen ","General requirements","Français"]
[{"$f":"INDEX(Table_Language[#This Row],1,Language_select+1)","v":"Special requirements for guards"},"Besondere Anforderungen an trennende Schutzeinrichtungen ","Special requirements for guards","Français"]
[{"$f":"INDEX(Table_Language[#This Row],1,Language_select+1)","v":"Fixed guards"},"Feststehende trennende Schutzeinrichtungen ","Fixed guards","Français"]
[{"$f":"INDEX(Table_Language[#This Row],1,Language_select+1)","v":"Interlocking movable guards"},"Bewegliche trennende Schutzeinrichtungen mit Verriegelung ","Interlocking movable guards","Français"]
[{"$f":"INDEX(Table_Language[#This Row],1,Language_select+1)","v":"Adjustable guards restricting access"},"Zugangsbeschränkende verstellbare Schutzeinrichtungen ","Adjustable guards restricting access","Français"]
[{"$f":"INDEX(Table_Language[#This Row],1,Language_select+1)","v":"Special requirements for protective devices"},"Besondere Anforderungen an nichttrennende Schutzeinrichtungen ","Special requirements for protective devices","Français"]
[{"$f":"INDEX(Table_Language[#This Row],1,Language_select+1)","v":"Risks due to other hazards"},"Risiken durch sonstige Gefährdungen ","Risks due to other hazards","Français"]
[{"$f":"INDEX(Table_Language[#This Row],1,Language_select+1)","v":"Electricity supply"},"Elektrische Energieversorgung ","Electricity supply","Français"]
[{"$f":"INDEX(Table_Language[#This Row],1,Language_select+1)","v":"Static electricity"},"Statische Elektrizität ","Static electricity","Français"]
[{"$f":"INDEX(Table_Language[#This Row],1,Language_select+1)","v":"Energy supply other than electricity"},"Nichtelektrische Energieversorgung ","Energy supply other than electricity","Français"]
[{"$f":"INDEX(Table_Language[#This Row],1,Language_select+1)","v":"Errors of fitting"},"Montagefehler ","Errors of fitting","Français"]
[{"$f":"INDEX(Table_Language[#This Row],1,Language_select+1)","v":"Extreme temperatures"},"Extreme Temperaturen ","Extreme temperatures","Français"]
[{"$f":"INDEX(Table_Language[#This Row],1,Language_select+1)","v":"Fire"},"Brand ","Fire","Français"]
[{"$f":"INDEX(Table_Language[#This Row],1,Language_select+1)","v":"Explosion"},"Explosion ","Explosion","Français"]
[{"$f":"INDEX(Table_Language[#This Row],1,Language_select+1)","v":"Noise"},"Lärm ","Noise","Français"]
[{"$f":"INDEX(Table_Language[#This Row],1,Language_select+1)","v":"Vibrations"},"Vibrationen ","Vibrations","Français"]
[{"$f":"INDEX(Table_Language[#This Row],1,Language_select+1)","v":"Radiation"},"Strahlung ","Radiation","Français"]
[{"$f":"INDEX(Table_Language[#This Row],1,Language_select+1)","v":"External radiation"},"Strahlung von außen ","External radiation","Français"]
[{"$f":"INDEX(Table_Language[#This Row],1,Language_select+1)","v":"Laser radiation"},"Laserstrahlung ","Laser radiation","Français"]
[{"$f":"INDEX(Table_Language[#This Row],1,Language_select+1)","v":"Emissions of hazardous materials and substances"},"Emission gefährlicher Werkstoffe und Substanzen ","Emissions of hazardous materials and substances","Français"]
[{"$f":"INDEX(Table_Language[#This Row],1,Language_select+1)","v":"Risk of being trapped in a machine"},"Risiko, in einer Maschine eingeschlossen zu werden","Risk of being trapped in a machine","Français"]
[{"$f":"INDEX(Table_Language[#This Row],1,Language_select+1)","v":"Risk of slipping, tripping or falling"},"Ausrutsch-, Stolper- und Sturzrisiko ","Risk of slipping, tripping or falling","Français"]
[{"$f":"INDEX(Table_Language[#This Row],1,Language_select+1)","v":"Lightning"},"Blitzschlag ","Lightning","Français"]
[{"$f":"INDEX(Table_Language[#This Row],1,Language_select+1)","v":"Maintenance"},"Instandhaltung ","Maintenance","Français"]
[{"$f":"INDEX(Table_Language[#This Row],1,Language_select+1)","v":"Machinery maintenance"},"Wartung der Maschine ","Machinery maintenance","Français"]
[{"$f":"INDEX(Table_Language[#This Row],1,Language_select+1)","v":"Access to operating positions and servicing points"},"Zugang zu den Bedienungsständen und den Eingriffspunkten für die Instandhaltung ","Access to operating positions and servicing points","Français"]
[{"$f":"INDEX(Table_Language[#This Row],1,Language_select+1)","v":"Isolation of energy sources"},"Trennung von den Energiequellen ","Isolation of energy sources","Français"]
[{"$f":"INDEX(Table_Language[#This Row],1,Language_select+1)","v":"Operator intervention"},"Eingriffe des Bedienungspersonals ","Operator intervention","Français"]
[{"$f":"INDEX(Table_Language[#This Row],1,Language_select+1)","v":"Cleaning of internal parts"},"Reinigung innen liegender Maschinenteile ","Cleaning of internal parts","Français"]
[{"$f":"INDEX(Table_Language[#This Row],1,Language_select+1)","v":"Information"},"Informationen ","Information","Français"]
[{"$f":"INDEX(Table_Language[#This Row],1,Language_select+1)","v":"Information and warnings on the machinery"},"Informationen und Warnhinweise an der Maschine ","Information and warnings on the machinery","Français"]
[{"$f":"INDEX(Table_Language[#This Row],1,Language_select+1)","v":"Information and information devices"},"Informationen und Informationseinrichtungen ","Information and information devices","Français"]
[{"$f":"INDEX(Table_Language[#This Row],1,Language_select+1)","v":"Warning devices"},"Warneinrichtungen ","Warning devices","Français"]
[{"$f":"INDEX(Table_Language[#This Row],1,Language_select+1)","v":"Warning of residual risks"},"Warnung vor Restrisiken ","Warning of residual risks","Français"]
[{"$f":"INDEX(Table_Language[#This Row],1,Language_select+1)","v":"Marking of machinery"},"Kennzeichnung der Maschinen ","Marking of machinery","Français"]
[{"$f":"INDEX(Table_Language[#This Row],1,Language_select+1)","v":"Instructions"},"Betriebsanleitung ","Instructions","Français"]
[{"$f":"INDEX(Table_Language[#This Row],1,Language_select+1)","v":"General principles for the drafting of instructions"},"Allgemeine Grundsätze für die Abfassung der Betriebsanleitung ","General principles for the drafting of instructions","Français"]
[{"$f":"INDEX(Table_Language[#This Row],1,Language_select+1)","v":"Contents of the instructions"},"Inhalt der Betriebsanleitung ","Contents of the instructions","Français"]
[{"$f":"INDEX(Table_Language[#This Row],1,Language_select+1)","v":"Sales literature"},"Verkaufsprospekte","Sales literature","Français"]
[{"$f":"INDEX(Table_Language[#This Row],1,Language_select+1)","v":"Supplementary essential health and safety requirements for certain categories of machinery"},"Bestimmte Maschinengattungen","Supplementary essential health and safety requirements for certain categories of machinery","Français"]
[{"$f":"INDEX(Table_Language[#This Row],1,Language_select+1)","v":"Foodstuffs machinery and machinery for cosmetics or pharmaceutical products"},"Nahrungsmittelmaschinen und Maschinen für kosmetische oder pharmazeutische Erzeugnisse","Foodstuffs machinery and machinery for cosmetics or pharmaceutical products","Français"]
[{"$f":"INDEX(Table_Language[#This Row],1,Language_select+1)","v":"General"},"Allgemeines","General","Français"]
[{"$f":"INDEX(Table_Language[#This Row],1,Language_select+1)","v":"Instructions"},"Betriebsanleitung","Instructions","Français"]
[{"$f":"INDEX(Table_Language[#This Row],1,Language_select+1)","v":"Portable hand-held and/or hand-guided machinery"},"handgehaltene und/oder handgeführte tragbare Maschinen","Portable hand-held and/or hand-guided machinery","Français"]
[{"$f":"INDEX(Table_Language[#This Row],1,Language_select+1)","v":"General"},"Allgemeines","General","Français"]
[{"$f":"INDEX(Table_Language[#This Row],1,Language_select+1)","v":"Instructions"},"Betriebsanleitung","Instructions","Français"]
[{"$f":"INDEX(Table_Language[#This Row],1,Language_select+1)","v":"Portable fixing and other impact machinery"},"Tragbare Befestigungsgeräte und andere Schussgeräte","Portable fixing and other impact machinery","Français"]
[{"$f":"INDEX(Table_Language[#This Row],1,Language_select+1)","v":"General"},"Allgemeines","General","Français"]
[{"$f":"INDEX(Table_Language[#This Row],1,Language_select+1)","v":"Instructions"},"Betriebsanleitung","Instructions","Français"]
[{"$f":"INDEX(Table_Language[#This Row],1,Language_select+1)","v":"Machinery for working wood and material with similar physical characteristics"},"Maschinen zur Bearbeitung von Holz und von Werkstoffen mit ähnlichen physikalischen Eigenschaften","Machinery for working wood and material with similar physical characteristics","Français"]
[{"$f":"INDEX(Table_Language[#This Row],1,Language_select+1)","v":"Machinery for pesticide application"},"Maschinen zur Ausbringung von Pestiziden","Machinery for pesticide application","Français"]
[{"$f":"INDEX(Table_Language[#This Row],1,Language_select+1)","v":"Definitions"},"Begriffsbestimmung","Definitions","Français"]
[{"$f":"INDEX(Table_Language[#This Row],1,Language_select+1)","v":"General"},"Allgemeines","General","Français"]
[{"$f":"INDEX(Table_Language[#This Row],1,Language_select+1)","v":"Controls and monitoring"},"Bedienung und Überwachung","Controls and monitoring","Français"]
[{"$f":"INDEX(Table_Language[#This Row],1,Language_select+1)","v":"Filling and emptying"},"Füllung und Entleerung","Filling and emptying","Français"]
[{"$f":"INDEX(Table_Language[#This Row],1,Language_select+1)","v":"Application of pesticides"},"Ausbringung von Pestiziden","Application of pesticides","Français"]
[{"$f":"INDEX(Table_Language[#This Row],1,Language_select+1)","v":"Application rate"},"Ausbringungsrate","Application rate","Français"]
[{"$f":"INDEX(Table_Language[#This Row],1,Language_select+1)","v":"Distribution, deposition and drift of pesticide"},"Verteilung, Anlagerung und Abdrift von Pestiziden","Distribution, deposition and drift of pesticide","Français"]
[{"$f":"INDEX(Table_Language[#This Row],1,Language_select+1)","v":"Tests"},"Prüfungen","Tests","Français"]
[{"$f":"INDEX(Table_Language[#This Row],1,Language_select+1)","v":"Losses during stoppage"},"Unbeabsichtigte Freisetzungen während und nach der Abschaltung","Losses during stoppage","Français"]
[{"$f":"INDEX(Table_Language[#This Row],1,Language_select+1)","v":"Maintenance"},"Wartung","Maintenance","Français"]
[{"$f":"INDEX(Table_Language[#This Row],1,Language_select+1)","v":"Cleaning"},"Reinigung","Cleaning","Français"]
[{"$f":"INDEX(Table_Language[#This Row],1,Language_select+1)","v":"Servicing"},"Instandhaltung","Servicing","Français"]
[{"$f":"INDEX(Table_Language[#This Row],1,Language_select+1)","v":"Inspections"},"Kontrollen","Inspections","Français"]
[{"$f":"INDEX(Table_Language[#This Row],1,Language_select+1)","v":"Marking of nozzles, strainers and filters"},"Kennzeichnung von Düsen, Sieben und Filtern","Marking of nozzles, strainers and filters","Français"]
[{"$f":"INDEX(Table_Language[#This Row],1,Language_select+1)","v":"Indication of pesticide in use"},"Angabe des verwendeten Pestizids","Indication of pesticide in use","Français"]
[{"$f":"INDEX(Table_Language[#This Row],1,Language_select+1)","v":"Instructions"},"Betriebsanleitung","Instructions","Français"]
[{"$f":"INDEX(Table_Language[#This Row],1,Language_select+1)","v":"Supplementary essential health and safety requirements to offset hazards due to the mobility of machinery"},"Beweglichkeit von Maschinen","Supplementary essential health and safety requirements to offset hazards due to the mobility of machinery","Français"]
[{"$f":"INDEX(Table_Language[#This Row],1,Language_select+1)","v":"General"},"Allgemeines","General","Français"]
[{"$f":"INDEX(Table_Language[#This Row],1,Language_select+1)","v":"Definitions"},"Begriffsbestimmungen","Definitions","Français"]
[{"$f":"INDEX(Table_Language[#This Row],1,Language_select+1)","v":"Work positions"},"Bedienerplätze","Work positions","Français"]
[{"$f":"INDEX(Table_Language[#This Row],1,Language_select+1)","v":"Driving position"},"Fahrerplatz","Driving position","Français"]
[{"$f":"INDEX(Table_Language[#This Row],1,Language_select+1)","v":"Seating"},"Sitze","Seating","Français"]
[{"$f":"INDEX(Table_Language[#This Row],1,Language_select+1)","v":"Positions for other persons"},"Plätze für andere Personen","Positions for other persons","Français"]
[{"$f":"INDEX(Table_Language[#This Row],1,Language_select+1)","v":"Control systems"},"Steuerung","Control systems","Français"]
[{"$f":"INDEX(Table_Language[#This Row],1,Language_select+1)","v":"Control devices"},"Stellteile","Control devices","Français"]
[{"$f":"INDEX(Table_Language[#This Row],1,Language_select+1)","v":"Starting/moving"},"Ingangsetzen/Verfahren","Starting/moving","Français"]
[{"$f":"INDEX(Table_Language[#This Row],1,Language_select+1)","v":"Travelling function"},"Stillsetzen/Bremsen","Travelling function","Français"]
[{"$f":"INDEX(Table_Language[#This Row],1,Language_select+1)","v":"Movement of pedestrian-controlled machinery"},"Verfahren mitgängergeführter Maschinen","Movement of pedestrian-controlled machinery","Français"]
[{"$f":"INDEX(Table_Language[#This Row],1,Language_select+1)","v":"Control circuit failure"},"Störung des Steuerkreises","Control circuit failure","Français"]
[{"$f":"INDEX(Table_Language[#This Row],1,Language_select+1)","v":"Protection against mechanical hazards"},"Schutzmaßnahmen gegen mechanische Gefährdungen","Protection against mechanical hazards","Français"]
[{"$f":"INDEX(Table_Language[#This Row],1,Language_select+1)","v":"Uncontrolled movements"},"Unkontrollierte Bewegungen","Uncontrolled movements","Français"]
[{"$f":"INDEX(Table_Language[#This Row],1,Language_select+1)","v":"Moving transmission parts"},"Bewegliche Übertragungselemente","Moving transmission parts","Français"]
[{"$f":"INDEX(Table_Language[#This Row],1,Language_select+1)","v":"Roll-over and tip-over"},"Überrollen und Umkippen","Roll-over and tip-over","Français"]
[{"$f":"INDEX(Table_Language[#This Row],1,Language_select+1)","v":"Falling objects"},"Herabfallende Gegenstände","Falling objects","Français"]
[{"$f":"INDEX(Table_Language[#This Row],1,Language_select+1)","v":"Means of access"},"Zugänge","Means of access","Français"]
[{"$f":"INDEX(Table_Language[#This Row],1,Language_select+1)","v":"Towing devices"},"Anhängevorrichtungen","Towing devices","Français"]
[{"$f":"INDEX(Table_Language[#This Row],1,Language_select+1)","v":"Transmission of power between self-propelled machinery (or tractor) and recipient machinery"},"Kraftübertragung zwischen einer selbstfahrenden Maschine (oder einer Zugmaschine) und einer angetriebenen Maschine","Transmission of power between self-propelled machinery (or tractor) and recipient machinery","Français"]
[{"$f":"INDEX(Table_Language[#This Row],1,Language_select+1)","v":"Protection against other hazards"},"Schutzmaßnahmen gegen sonstige Gefährdungen","Protection against other hazards","Français"]
[{"$f":"INDEX(Table_Language[#This Row],1,Language_select+1)","v":"Batteries"},"Batterien","Batteries","Français"]
[{"$f":"INDEX(Table_Language[#This Row],1,Language_select+1)","v":"Fire"},"Brand","Fire","Français"]
[{"$f":"INDEX(Table_Language[#This Row],1,Language_select+1)","v":"Emissions of hazardous substances"},"Emission von gefährlichen Stoffen","Emissions of hazardous substances","Français"]
[{"$f":"INDEX(Table_Language[#This Row],1,Language_select+1)","v":"Information and indications"},"Informationen und Angaben","Information and indications","Français"]
[{"$f":"INDEX(Table_Language[#This Row],1,Language_select+1)","v":"Signs, signals and warnings"},"Zeichen, Signaleinrichtungen und Warnhinweise","Signs, signals and warnings","Français"]
[{"$f":"INDEX(Table_Language[#This Row],1,Language_select+1)","v":"Marking"},"Kennzeichnung","Marking","Français"]
[{"$f":"INDEX(Table_Language[#This Row],1,Language_select+1)","v":"Instructions"},"Betriebsanleitung","Instructions","Français"]
[{"$f":"INDEX(Table_Language[#This Row],1,Language_select+1)","v":"Vibrations"},"Vibrationen","Vibrations","Français"]
[{"$f":"INDEX(Table_Language[#This Row],1,Language_select+1)","v":"Multiple uses"},"Mehrere Verwendungsmöglichkeiten","Multiple uses","Français"]
[{"$f":"INDEX(Table_Language[#This Row],1,Language_select+1)","v":"Supplementary essential health and safety requirements to offset hazards due to lifting operations"},"durch Hebevorgänge bedingten Gefährdungen","Supplementary essential health and safety requirements to offset hazards due to lifting operations","Français"]
[{"$f":"INDEX(Table_Language[#This Row],1,Language_select+1)","v":"General"},"Allgemeines","General","Français"]
[{"$f":"INDEX(Table_Language[#This Row],1,Language_select+1)","v":"Definitions"},"Begriffsbestimmungen","Definitions","Français"]
[{"$f":"INDEX(Table_Language[#This Row],1,Language_select+1)","v":"Protection against mechanical hazards"},"Schutzmaßnahmen gegen mechanische Gefährdungen","Protection against mechanical hazards","Français"]
[{"$f":"INDEX(Table_Language[#This Row],1,Language_select+1)","v":"Risks due to lack of stability"},"Risiken durch mangelnde Standsicherheit","Risks due to lack of stability","Français"]
[{"$f":"INDEX(Table_Language[#This Row],1,Language_select+1)","v":"Machinery running on guide rails and rail tracks"},"An Führungen oder auf Laufbahnen fahrende Maschinen","Machinery running on guide rails and rail tracks","Français"]
[{"$f":"INDEX(Table_Language[#This Row],1,Language_select+1)","v":"Mechanical strength"},"Festigkeit","Mechanical strength","Français"]
[{"$f":"INDEX(Table_Language[#This Row],1,Language_select+1)","v":"Pulleys, drums, wheels, ropes and chains"},"Rollen, Trommeln, Scheiben, Seile und Ketten","Pulleys, drums, wheels, ropes and chains","Français"]
[{"$f":"INDEX(Table_Language[#This Row],1,Language_select+1)","v":"Lifting accessories and their components"},"Lastaufnahmemittel und ihre Bauteile","Lifting accessories and their components","Français"]
[{"$f":"INDEX(Table_Language[#This Row],1,Language_select+1)","v":"Control of movements"},"Bewegungsbegrenzung","Control of movements","Français"]
[{"$f":"INDEX(Table_Language[#This Row],1,Language_select+1)","v":"Movements of loads during handling"},"Bewegungen von Lasten während der Benutzung","Movements of loads during handling","Français"]
[{"$f":"INDEX(Table_Language[#This Row],1,Language_select+1)","v":"Machinery serving fixed landings"},"Maschinen, die feste Ladestellen anfahren","Machinery serving fixed landings","Français"]
[{"$f":"INDEX(Table_Language[#This Row],1,Language_select+1)","v":"Movements of the carrier"},"Bewegungen des Lastträgers","Movements of the carrier","Français"]
[{"$f":"INDEX(Table_Language[#This Row],1,Language_select+1)","v":"Access to the carrier"},"Zugang zum Lastträger","Access to the carrier","Français"]
[{"$f":"INDEX(Table_Language[#This Row],1,Language_select+1)","v":"Risks due to contact with the moving carrier"},"Risiken durch Kontakt mit dem bewegten Lastträger","Risks due to contact with the moving carrier","Français"]
[{"$f":"INDEX(Table_Language[#This Row],1,Language_select+1)","v":"Risk due to the load falling off the carrier"},"Risiken durch vom Lastträger herabstürzende Lasten","Risk due to the load falling off the carrier","Français"]
[{"$f":"INDEX(Table_Language[#This Row],1,Language_select+1)","v":"Landings"},"Ladestellen","Landings","Français"]
[{"$f":"INDEX(Table_Language[#This Row],1,Language_select+1)","v":"Fitness for purpose"},"Zwecktauglichkeit","Fitness for purpose","Français"]
[{"$f":"INDEX(Table_Language[#This Row],1,Language_select+1)","v":"Requirements for machinery whose power source is other than manual effort"},"Anforderungen an Maschinen, die nicht durch menschliche Kraft angetrieben werden","Requirements for machinery whose power source is other than manual effort","Français"]
[{"$f":"INDEX(Table_Language[#This Row],1,Language_select+1)","v":"Control of movements"},"Bewegungssteuerung","Control of movements","Français"]
[{"$f":"INDEX(Table_Language[#This Row],1,Language_select+1)","v":"Loading control"},"Belastungsbegrenzung","Loading control","Français"]
[{"$f":"INDEX(Table_Language[#This Row],1,Language_select+1)","v":"Installations guided by ropes"},"Seilgeführte Einrichtungen","Installations guided by ropes","Français"]
[{"$f":"INDEX(Table_Language[#This Row],1,Language_select+1)","v":"Information and markings"},"Informationen und Kennzeichnung","Information and markings","Français"]
[{"$f":"INDEX(Table_Language[#This Row],1,Language_select+1)","v":"Chains, ropes and webbing"},"Ketten, Seile und Gurte","Chains, ropes and webbing","Français"]
[{"$f":"INDEX(Table_Language[#This Row],1,Language_select+1)","v":"Lifting accessories"},"Lastaufnahmemittel","Lifting accessories","Français"]
[{"$f":"INDEX(Table_Language[#This Row],1,Language_select+1)","v":"Lifting machinery"},"Maschinen zum Heben von Lasten","Lifting machinery","Français"]
[{"$f":"INDEX(Table_Language[#This Row],1,Language_select+1)","v":"Instructions"},"Betriebsanleitung","Instructions","Français"]
[{"$f":"INDEX(Table_Language[#This Row],1,Language_select+1)","v":"Lifting accessories"},"Lastaufnahmemittel","Lifting accessories","Français"]
[{"$f":"INDEX(Table_Language[#This Row],1,Language_select+1)","v":"Lifting machinery"},"Maschinen zum Heben von Lasten","Lifting machinery","Français"]
[{"$f":"INDEX(Table_Language[#This Row],1,Language_select+1)","v":"Supplementary essential health and safety requirements for machinery intended for underground work"},"zum Einsatz unter Tage bestimmte Maschinen","Supplementary essential health and safety requirements for machinery intended for underground work","Français"]
[{"$f":"INDEX(Table_Language[#This Row],1,Language_select+1)","v":"Risks due to lack of stability"},"Risiken durch mangelnde Standsicherheit","Risks due to lack of stability","Français"]
[{"$f":"INDEX(Table_Language[#This Row],1,Language_select+1)","v":"Movement"},"Bewegungsfreiheit","Movement","Français"]
[{"$f":"INDEX(Table_Language[#This Row],1,Language_select+1)","v":"Control devices"},"Stellteile","Control devices","Français"]
[{"$f":"INDEX(Table_Language[#This Row],1,Language_select+1)","v":"Stopping"},"Anhalten der Fahrbewegung","Stopping","Français"]
[{"$f":"INDEX(Table_Language[#This Row],1,Language_select+1)","v":"Fire"},"Brand","Fire","Français"]
[{"$f":"INDEX(Table_Language[#This Row],1,Language_select+1)","v":"Exhaust emissions"},"Emission von Abgasen","Exhaust emissions","Français"]
[{"$f":"INDEX(Table_Language[#This Row],1,Language_select+1)","v":"Supplementary essential health and safety requirements for machinery presenting particular hazards due to the lifting of persons"},"durch das Heben von Personen bedingte Gefährdungen","Supplementary essential health and safety requirements for machinery presenting particular hazards due to the lifting of persons","Français"]
[{"$f":"INDEX(Table_Language[#This Row],1,Language_select+1)","v":"General"},"Allgemeines","General","Français"]
[{"$f":"INDEX(Table_Language[#This Row],1,Language_select+1)","v":"Mechanical strength"},"Festigkeit","Mechanical strength","Français"]
[{"$f":"INDEX(Table_Language[#This Row],1,Language_select+1)","v":"Loading control for machinery moved by power other than human strength"},"Belastungsbegrenzung bei nicht durch menschliche Kraft angetriebenen Maschinen","Loading control for machinery moved by power other than human strength","Français"]
[{"$f":"INDEX(Table_Language[#This Row],1,Language_select+1)","v":"Control devices"},"Stellteile","Control devices","Français"]
[{"$f":"INDEX(Table_Language[#This Row],1,Language_select+1)","v":"Risks to persons in or on the carrier"},"Risiken für in oder auf dem Lastträger befindliche Personen","Risks to persons in or on the carrier","Français"]
[{"$f":"INDEX(Table_Language[#This Row],1,Language_select+1)","v":"Risks due to movements of the carrier"},"Risiken durch Bewegungen des Lastträgers","Risks due to movements of the carrier","Français"]
[{"$f":"INDEX(Table_Language[#This Row],1,Language_select+1)","v":"Risk of persons falling from the carrier"},"Risiko des Sturzes aus dem Lastträger","Risk of persons falling from the carrier","Français"]
[{"$f":"INDEX(Table_Language[#This Row],1,Language_select+1)","v":"Risk due to objects falling on the carrier"},"Risiken durch auf den Lastträger herabfallende Gegenstände","Risk due to objects falling on the carrier","Français"]
[{"$f":"INDEX(Table_Language[#This Row],1,Language_select+1)","v":"Machinery serving fixed landings"},"Maschinen, die feste Haltestellen anfahren","Machinery serving fixed landings","Français"]
[{"$f":"INDEX(Table_Language[#This Row],1,Language_select+1)","v":"Risks to persons in or on the carrier"},"Risiken für in oder auf dem Lastträger befindliche Personen","Risks to persons in or on the carrier","Français"]
[{"$f":"INDEX(Table_Language[#This Row],1,Language_select+1)","v":"Controls at landings"},"Befehlseinrichtungen an den Haltestellen","Controls at landings","Français"]
[{"$f":"INDEX(Table_Language[#This Row],1,Language_select+1)","v":"Access to the carrier"},"Zugang zum Lastträger","Access to the carrier","Français"]
[{"$f":"INDEX(Table_Language[#This Row],1,Language_select+1)","v":"Markings"},"Kennzeichnung","Markings","Français"]
[{"$f":"INDEX(Table_Language[#This Row],1,Language_select+1)","v":"Message Box"},"Nachrichten Box","Message Box","Français"]
[{"$f":"INDEX(Table_Language[#This Row],1,Language_select+1)","v":"This row can not be deleted.\n\nThis is a headline."},"Diese Zeile können Sie nicht löschen.\n\nDies ist eine Überschrift.","This row can not be deleted.\n\nThis is a headline.","Français"]
[{"$f":"INDEX(Table_Language[#This Row],1,Language_select+1)","v":"This row can not be deleted.\n\nIf the EHSR is not applicable, delete the X from column \"applying EHSR\" and use the filter function to hide this line."},"Diese Zeile können Sie nicht löschen.\n\nWenn diese GSA nicht zutrifft, löschen Sie bitte das X aus Spalte \"GSA trifft zu\" und blenden die Zeile über den Filter aus.","This row can not be deleted.\n\nIf the EHSR is not applicable, delete the X from column \"applying EHSR\" and use the filter function to hide this line.","Français"]
[{"$f":"INDEX(Table_Language[#This Row],1,Language_select+1)","v":"All entries from the selected line will be deleted. Are you sure?"},"Alle Daten in der ausgewählten Zeile werden gelöscht. Sind Sie sicher?","All entries from the selected line will be deleted. Are you sure?","Français"]
[{"$f":"INDEX(Table_Language[#This Row],1,Language_select+1)","v":"Project data"},"Projektdaten","Project data","Données projet"]
[{"$f":"INDEX(Table_Language[#This Row],1,Language_select+1)","v":"Commercial name of the Machinery:"},"Bezeichnung der Maschine:","Commercial name of the Machinery:","Français"]
[{"$f":"INDEX(Table_Language[#This Row],1,Language_select+1)","v":"Machinery type:"},"Maschinentyp:","Machinery type:","Français"]
[{"$f":"INDEX(Table_Language[#This Row],1,Language_select+1)","v":"Serial number:"},"Seriennummer:","Serial number:","Français"]
[{"$f":"INDEX(Table_Language[#This Row],1,Language_select+1)","v":"General description of the machinery:"},"allgemeine Beschreibung der Maschine:","General description of the machinery:","Français"]
[{"$f":"INDEX(Table_Language[#This Row],1,Language_select+1)","v":"Procedures for assessing the conformity:"},"Konformitätsbewertungsverfahren:","Procedures for assessing the conformity:","Français"]
[{"$f":"INDEX(Table_Language[#This Row],1,Language_select+1)","v":"Notified body:"},"notifizierte Stelle:","Notified body:","Français"]
[{"$f":"INDEX(Table_Language[#This Row],1,Language_select+1)","v":"Project leader:"},"Projektleiter:","Project leader:","Français"]
[{"$f":"INDEX(Table_Language[#This Row],1,Language_select+1)","v":"Mechanical designer:"},"Konstrukteur mechanisch:","Mechanical designer:","Français"]
[{"$f":"INDEX(Table_Language[#This Row],1,Language_select+1)","v":"Electrical designer:"},"Konstrukteur elektrisch:","Electrical designer:","Français"]
[{"$f":"INDEX(Table_Language[#This Row],1,Language_select+1)","v":"Control system designer:"},"Konstrukteur Steuerung:","Control system designer:","Français"]
[{"$f":"INDEX(Table_Language[#This Row],1,Language_select+1)","v":"Communication medium designer:"},"Konstrukteur Medien:","Communication medium designer:","Français"]
[{"$f":"INDEX(Table_Language[#This Row],1,Language_select+1)","v":"Authorised person to compile the technical file:"},"Dokumentationsbevollmächtigter:","Authorised person to compile the technical file:","Français"]
[{"$f":"INDEX(Table_Language[#This Row],1,Language_select+1)","v":"Information:\n\nName / Company / Position"},"Hinweis:\n\nName / Unternehmen / Funktion","Information:\n\nName / Company / Position","Français"]
[{"$f":"INDEX(Table_Language[#This Row],1,Language_select+1)","v":"Information:\naccording to annex II 1. A. 2. / 1. B. 2.\nName / Company / Position"},"Hinweis:\nNach Anhang II 1. A. 2. / 1. B. 2.\nName / Unternehmen / Funktion","Information:\naccording to annex II 1. A. 2. / 1. B. 2.\nName / Company / Position","Français"]
[{"$f":"INDEX(Table_Language[#This Row],1,Language_select+1)","v":"Intended use"},"Bestimmungsgemäße Verwendung:","Intended use","Français"]
[{"$f":"INDEX(Table_Language[#This Row],1,Language_select+1)","v":"Reasonably foreseeable misuse (considering customer feedback and known history of accidents)"},"Vernünftigerweise vorhersehbare Fehlanwendung (unter Berücksichtigung von Kundenrückmeldungen und bekannten Unfallgeschichten):","Reasonably foreseeable misuse (considering customer feedback and known history of accidents)","Français"]
[{"$f":"INDEX(Table_Language[#This Row],1,Language_select+1)","v":"Operating modes:"},"Betriebsarten:","Operating modes:","Français"]
[{"$f":"INDEX(Table_Language[#This Row],1,Language_select+1)","v":"Description of the different modes of operation and protective measures."},"Beschreibung der verschiedenen Betriebsarten und Darstellung der ggf. unterschiedlichen Schutzmaßnahmen.","Description of the different modes of operation and protective measures.","Français"]
[{"$f":"INDEX(Table_Language[#This Row],1,Language_select+1)","v":"Field of application:"},"Einsatzbereich:","Field of application:","Français"]
[{"$f":"INDEX(Table_Language[#This Row],1,Language_select+1)","v":"Space limits"},"Räumliche Grenzen ","Space limits","Français"]
[{"$f":"INDEX(Table_Language[#This Row],1,Language_select+1)","v":"the range of movement, space requirements for persons interacting with the machine, such as during operation and maintenance"},"Bewegungsraum, Platzbedarf von Personen, die mit der Maschine umgehen, z.B. während Betrieb und Instandhaltung","the range of movement, space requirements for persons interacting with the machine, such as during operation and maintenance","Français"]
[{"$f":"INDEX(Table_Language[#This Row],1,Language_select+1)","v":"operator–machine interface, machine–power supply interface"},"Schnittstelle(n): Mensch / Energieversorgung - Mensch / Maschine","operator–machine interface, machine–power supply interface","Français"]
[{"$f":"INDEX(Table_Language[#This Row],1,Language_select+1)","v":"Overview drawing including parts list"},"Übersichtszeichnung inkl. Stückliste","Overview drawing including parts list","Français"]
[{"$f":"INDEX(Table_Language[#This Row],1,Language_select+1)","v":"Information:\n\nFilename / Version / Date / Chapter / Page number"},"Hinweis:\n\nDateiname / Version / Datum / Kapitel /  Seitenzahl","Information:\n\nFilename / Version / Date / Chapter / Page number","Français"]
[{"$f":"INDEX(Table_Language[#This Row],1,Language_select+1)","v":"Requirement/design specifications"},"Lasten-/Pflichtenheft","Requirement/design specifications","Français"]
[{"$f":"INDEX(Table_Language[#This Row],1,Language_select+1)","v":"Technical specifications"},"technische Leistungsbeschreibung ","Technical specifications","Français"]
[{"$f":"INDEX(Table_Language[#This Row],1,Language_select+1)","v":"Description on setup and components in the manual chapter XXX"},"Beschreibung zu Aufbau und Komponenten in der Betriebsanleitung Kap. xxx","Description on setup and components in the manual chapter XXX","Français"]
[{"$f":"INDEX(Table_Language[#This Row],1,Language_select+1)","v":"Technical data in the manual chapter XXX"},"technische Daten in der Betriebsanleitung Kap. xxx","Technical data in the manual chapter XXX","Français"]
[{"$f":"INDEX(Table_Language[#This Row],1,Language_select+1)","v":"Time limits"},"Zeitliche Grenzen ","Time limits","Français"]
[{"$f":"INDEX(Table_Language[#This Row],1,Language_select+1)","v":"the life limit of the machinery and/or of some of its components, taking into account its intended use and reasonably foreseeable\nmisuse"},"Grenzen der Lebensdauer der Maschine / einzelner Bauteile, bei bestimmungsgemäßer Verwendung und vorhersehbarer Fehlanwendung","the life limit of the machinery and/or of some of its components, taking into account its intended use and reasonably foreseeable\nmisuse","Français"]
[{"$f":"INDEX(Table_Language[#This Row],1,Language_select+1)","v":"recommended service intervals"},"Empfohlene Wartungsintervalle","recommended service intervals","Français"]
[{"$f":"INDEX(Table_Language[#This Row],1,Language_select+1)","v":"Information:\n\nusually 20 years"},"Hinweis:\n\ngewöhnlich 20 Jahre","Information:\n\nusually 20 years","Français"]
[{"$f":"INDEX(Table_Language[#This Row],1,Language_select+1)","v":"Lifecycle of the machine"},"Lebensdauer der Maschine","Lifecycle of the machine","Français"]
[{"$f":"INDEX(Table_Language[#This Row],1,Language_select+1)","v":"Lifecycle of the wear parts (list)"},"Lebensdauer der Verschleißteile (Liste)","Lifecycle of the wear parts (list)","Français"]
[{"$f":"INDEX(Table_Language[#This Row],1,Language_select+1)","v":"Recommended maintenance intervals (list)"},"Empfohlene Wartungsintervalle (Liste)","Recommended maintenance intervals (list)","Français"]
[{"$f":"INDEX(Table_Language[#This Row],1,Language_select+1)","v":"Other limits"},"Weitere Grenzen","Other limits","Français"]
[{"$f":"INDEX(Table_Language[#This Row],1,Language_select+1)","v":"properties of the material(s) to be processed"},"Eigenschaften der zu bearbeitenden Materialien","properties of the material(s) to be processed","Français"]
[{"$f":"INDEX(Table_Language[#This Row],1,Language_select+1)","v":"housekeeping — the level of cleanliness required"},"erforderlicher Reinlichkeitsgrad","housekeeping — the level of cleanliness required","Français"]
[{"$f":"INDEX(Table_Language[#This Row],1,Language_select+1)","v":"the recommended minimum and maximum temperatures, in the machine / environment"},"Mindest- / Höchsttemperatur in der Umgebung / in der Maschine","the recommended minimum and maximum temperatures, in the machine / environment","Français"]
[{"$f":"INDEX(Table_Language[#This Row],1,Language_select+1)","v":"operation indoors or outdoors, in dry / wet weather, in direct / indirect sunlight"},"Betrieb im Innenraum / Freien bei trockener / nasser Witterung und bei direkter / indirekter Sonneneinstrahlung","operation indoors or outdoors, in dry / wet weather, in direct / indirect sunlight","Français"]
[{"$f":"INDEX(Table_Language[#This Row],1,Language_select+1)","v":"tolerance to dust and wet"},"Staub / Nässeverträglich","tolerance to dust and wet","Français"]
[{"$f":"INDEX(Table_Language[#This Row],1,Language_select+1)","v":"etc."},"etc.","etc.","Français"]
[{"$f":"INDEX(Table_Language[#This Row],1,Language_select+1)","v":"Materials being processed (list with hazards)"},"Materialien die verarbeitet werden (Liste mit Gefährdungen)","Materials being processed (list with hazards)","Français"]
[{"$f":"INDEX(Table_Language[#This Row],1,Language_select+1)","v":"necessary degree of cleanliness"},"erforderlicher Reinlichkeitsgrad","necessary degree of cleanliness","Français"]
[{"$f":"INDEX(Table_Language[#This Row],1,Language_select+1)","v":"Information:\n\nfill out / swept / clean room / etc."},"Hinweis:\n\nausfüllen / Besenrein / Reinraum / etc.","Information:\n\nfill out / swept / clean room / etc.","Français"]
[{"$f":"INDEX(Table_Language[#This Row],1,Language_select+1)","v":"Minimum / maximum temperature in the environment"},"Mindest- / Höchsttemperatur in der Umgebung","Minimum / maximum temperature in the environment","Français"]
[{"$f":"INDEX(Table_Language[#This Row],1,Language_select+1)","v":"Minimum / maximum temperature in the machine"},"Mindest- / Höchsttemperatur in der Maschine","Minimum / maximum temperature in the machine","Français"]
[{"$f":"INDEX(Table_Language[#This Row],1,Language_select+1)","v":"Information:\n\ne.g. -10°C to 70°C"},"Hinweis:\n\nz.B. -10°C bis 70°C","Information:\n\ne.g. -10°C to 70°C","Français"]
[{"$f":"INDEX(Table_Language[#This Row],1,Language_select+1)","v":"Operation indoors / outdoors"},"Betrieb im Innenraum / Freien ","Operation indoors / outdoors","Français"]
[{"$f":"INDEX(Table_Language[#This Row],1,Language_select+1)","v":"Information:\n\nindoors / outdoors"},"Hinweis:\n\nInnenraum / im Freien","Information:\n\nindoors / outdoors","Français"]
[{"$f":"INDEX(Table_Language[#This Row],1,Language_select+1)","v":"at dry / wet weather"},"bei trockener / nasser Witterung","at dry / wet weather","Français"]
[{"$f":"INDEX(Table_Language[#This Row],1,Language_select+1)","v":"at direct / indirect sunlight"},"bei direkter / indirekter Sonneneinstrahlung","at direct / indirect sunlight","Français"]
[{"$f":"INDEX(Table_Language[#This Row],1,Language_select+1)","v":"Tolerance to dust and wet"},"Staub / Nässeverträglich","Tolerance to dust and wet","Français"]
[{"$f":"INDEX(Table_Language[#This Row],1,Language_select+1)","v":"Information:\n\nIP protection class / IP protection class of single parts"},"Hinweis:\n\nAngabe IP Schutzklasse / IP Schutzklassen für einzelne Bereiche","Information:\n\nIP protection class / IP protection class of single parts","Français"]
[{"$f":"INDEX(Table_Language[#This Row],1,Language_select+1)","v":"Subcontractors"},"Unterlieferantenmatrix ","Subcontractors","Français"]
[{"$f":"INDEX(Table_Language[#This Row],1,Language_select+1)","v":"delivery of main assembly (e.g. machinery-components, mechanics, electrics, hydraulic, pneumatic) "},"-       Lieferumfang der Hauptbaugruppen (z. B. Maschinenkomponenten, Mechanik, Elektrik, Hydraulik, Pneumatik)","delivery of main assembly (e.g. machinery-components, mechanics, electrics, hydraulic, pneumatic) ","Français"]
[{"$f":"INDEX(Table_Language[#This Row],1,Language_select+1)","v":"Supplier:"},"Lieferant:","Supplier:","Français"]
[{"$f":"INDEX(Table_Language[#This Row],1,Language_select+1)","v":"Mechanics:"},"Mechanik:","Mechanics:","Français"]
[{"$f":"INDEX(Table_Language[#This Row],1,Language_select+1)","v":"·        Steelwork"},"·        Stahlbau","·        Steelwork","Français"]
[{"$f":"INDEX(Table_Language[#This Row],1,Language_select+1)","v":"·        stationary access (stairs, ladders, platform)"},"·        Ortsfeste Zugänge (Treppen, Leitern, Podeste)","·        stationary access (stairs, ladders, platform)","Français"]
[{"$f":"INDEX(Table_Language[#This Row],1,Language_select+1)","v":"electrics"},"Elektrik:","electrics","Français"]
[{"$f":"INDEX(Table_Language[#This Row],1,Language_select+1)","v":"·        control box incl. PLC"},"·        Schaltschrank inkl. SPS ","·        control box incl. PLC","Français"]
[{"$f":"INDEX(Table_Language[#This Row],1,Language_select+1)","v":"Hydraulic:"},"Hydraulik:","Hydraulic:","Français"]
[{"$f":"INDEX(Table_Language[#This Row],1,Language_select+1)","v":"·        Hydraulic unit, cylinder, valve"},"·        Hydraulikaggregat, Zylinder, Ventile","·        Hydraulic unit, cylinder, valve","Français"]
[{"$f":"INDEX(Table_Language[#This Row],1,Language_select+1)","v":"Pneumatic:"},"Pneumatik:","Pneumatic:","Français"]
[{"$f":"INDEX(Table_Language[#This Row],1,Language_select+1)","v":"·        cylinder, valve"},"·        Zylinder, Ventile","·        cylinder, valve","Français"]
[{"$f":"INDEX(Table_Language[#This Row],1,Language_select+1)","v":"Fluid connection:"},"Medienanschlüsse:","Fluid connection:","Français"]
[{"$f":"INDEX(Table_Language[#This Row],1,Language_select+1)","v":"·        Connection for cooling water, gas and so on"},"·        Anschlüsse für Kühlwasser, Gase, etc.","·        Connection for cooling water, gas and so on","Français"]
[{"$f":"INDEX(Table_Language[#This Row],1,Language_select+1)","v":"Basis of the given table is the EN ISO 12100:2010"},"Die folgende Tabelle basiert auf der EN ISO 12100:2010","Basis of the given table is the EN ISO 12100:2010","Français"]
[{"$f":"INDEX(Table_Language[#This Row],1,Language_select+1)","v":"Phase of machine life cycle"},"Lebensphasen","Phase of machine life cycle","Français"]
[{"$f":"INDEX(Table_Language[#This Row],1,Language_select+1)","v":"Examples of tasks"},"Aufgabenbeispiele des Bedienungspersonals","Examples of tasks","Français"]
[{"$f":"INDEX(Table_Language[#This Row],1,Language_select+1)","v":"qualification required for "},"Erforderliche Qualifikation des ","qualification required for ","Français"]
[{"$f":"INDEX(Table_Language[#This Row],1,Language_select+1)","v":"Operator  [i])"},"Bedienungspersonals [i])","Operator  [i])","Français"]
[{"$f":"INDEX(Table_Language[#This Row],1,Language_select+1)","v":"non-professional operator"},"Laie","non-professional operator","Français"]
[{"$f":"INDEX(Table_Language[#This Row],1,Language_select+1)","v":"skilled / trained"},"Geschultes/ unterwiesenes ","skilled / trained","Français"]
[{"$f":"INDEX(Table_Language[#This Row],1,Language_select+1)","v":"persons [ii])"},"Personal [ii])","persons [ii])","Français"]
[{"$f":"INDEX(Table_Language[#This Row],1,Language_select+1)","v":"specialist [iii])"},"Fachkraft [iii])","specialist [iii])","Français"]
[{"$f":"INDEX(Table_Language[#This Row],1,Language_select+1)","v":"1. Transport"},"1. Transport ","1. Transport","Français"]
[{"$f":"INDEX(Table_Language[#This Row],1,Language_select+1)","v":"-     Lifting"},"-     Anheben;","-     Lifting","Français"]
[{"$f":"INDEX(Table_Language[#This Row],1,Language_select+1)","v":"-     Loading"},"-     Beladen;","-     Loading","Français"]
[{"$f":"INDEX(Table_Language[#This Row],1,Language_select+1)","v":"-     Packing"},"-     Verpacken;","-     Packing","Français"]
[{"$f":"INDEX(Table_Language[#This Row],1,Language_select+1)","v":"-     Transportation"},"-     Transportieren;","-     Transportation","Français"]
[{"$f":"INDEX(Table_Language[#This Row],1,Language_select+1)","v":"-     Unloading"},"-     Entladen;","-     Unloading","Français"]
[{"$f":"INDEX(Table_Language[#This Row],1,Language_select+1)","v":"-     Unpacking"},"-     Auspacken der Maschine oder von Maschinenteilen","-     Unpacking","Français"]
[{"$f":"INDEX(Table_Language[#This Row],1,Language_select+1)","v":"2. Assembly and installation"},"2. Zusammenbau und Installation/ Inbetriebnahme ","2. Assembly and installation","Français"]
[{"$f":"INDEX(Table_Language[#This Row],1,Language_select+1)","v":"-     Adjustments of the machine and its components"},"-     Einstellungen an der Maschine und deren Bauteilen; ","-     Adjustments of the machine and its components","Français"]
[{"$f":"INDEX(Table_Language[#This Row],1,Language_select+1)","v":"-     Assembly of the machine"},"-     Zusammenbau der Maschine; ","-     Assembly of the machine","Français"]
[{"$f":"INDEX(Table_Language[#This Row],1,Language_select+1)","v":"-     Connecting to disposal system (for example, exhaust system, waste water installation)"},"-     Anschluss an die Entsorgungsanlage (z.B. Abluftsystem, Abwasseranlage); ","-     Connecting to disposal system (for example, exhaust system, waste water installation)","Français"]
[{"$f":"INDEX(Table_Language[#This Row],1,Language_select+1)","v":"-     Connecting to power supply (for example, electric power supply, compressed air)"},"-     Anschluss an die Energieversorgung (z.B. Stromversorgung, Druckluft);","-     Connecting to power supply (for example, electric power supply, compressed air)","Français"]
[{"$f":"INDEX(Table_Language[#This Row],1,Language_select+1)","v":"-     Demonstration"},"-     Vorführung;","-     Demonstration","Français"]
[{"$f":"INDEX(Table_Language[#This Row],1,Language_select+1)","v":"-     Feeding, filling, loading of ancillary fluids (for example, lubricant, grease, glue)"},"-     Beschicken, Befüllen, Einbringen von Hilfsflüssigkeiten (z.B. Schmierstoff, Fett, Klebstoff); ","-     Feeding, filling, loading of ancillary fluids (for example, lubricant, grease, glue)","Français"]
[{"$f":"INDEX(Table_Language[#This Row],1,Language_select+1)","v":"-     Fencing"},"-     Anbringen von Schutzgittern; ","-     Fencing","Français"]
[{"$f":"INDEX(Table_Language[#This Row],1,Language_select+1)","v":"-     Fixing, anchoring"},"-     Befestigen, Verankern; ","-     Fixing, anchoring","Français"]
[{"$f":"INDEX(Table_Language[#This Row],1,Language_select+1)","v":"-     Preparations for the installation (for example, foundations, vibration isolators)"},"-     Vorbereitungen für die Installation (z B. Fundamente, Schwingungsdämpfer);","-     Preparations for the installation (for example, foundations, vibration isolators)","Français"]
[{"$f":"INDEX(Table_Language[#This Row],1,Language_select+1)","v":"-     Running the machine without load"},"-     Betrieb der Maschine ohne Last; ","-     Running the machine without load","Français"]
[{"$f":"INDEX(Table_Language[#This Row],1,Language_select+1)","v":"-     Testing"},"-     Prüfung;","-     Testing","Français"]
[{"$f":"INDEX(Table_Language[#This Row],1,Language_select+1)","v":"-     Trials with load or maximum load"},"-     Versuche unter Last oder Höchstlast ","-     Trials with load or maximum load","Français"]
[{"$f":"INDEX(Table_Language[#This Row],1,Language_select+1)","v":"3. Usage"},"3. Verwendung","3. Usage","Français"]
[{"$f":"INDEX(Table_Language[#This Row],1,Language_select+1)","v":"3a Setting Teaching/programming and/or process changeover"},"3a Einrichten/ Einlernen (Teachen)/ Programmieren und/oder Umrüsten","3a Setting Teaching/programming and/or process changeover","Français"]
[{"$f":"INDEX(Table_Language[#This Row],1,Language_select+1)","v":"-     Adjustment and setting of protective devices and other components"},"-     Einstellen und Einrichten von Schutzeinrichtungen und weiteren Bauteilen;","-     Adjustment and setting of protective devices and other components","Français"]
[{"$f":"INDEX(Table_Language[#This Row],1,Language_select+1)","v":"-     Adjustment and setting or verification of functional parameters of the machine (for example, speed, pressure, force, travelling limits)"},"-     Einstellen und Einrichten oder Überprüfen der funktionalen Parameter der Maschine (z.B. Geschwindigkeit, Druck, Kraft, Fahrbegrenzungen);","-     Adjustment and setting or verification of functional parameters of the machine (for example, speed, pressure, force, travelling limits)","Français"]
[{"$f":"INDEX(Table_Language[#This Row],1,Language_select+1)","v":"-     Clamping/fastening the workpiece"},"-     Festklemmen/Befestigen des Werkstückes;","-     Clamping/fastening the workpiece","Français"]
[{"$f":"INDEX(Table_Language[#This Row],1,Language_select+1)","v":"-     Feeding, filling, loading of raw material"},"-     Beschicken, Befüllen, Einbringen der Rohstoffe;","-     Feeding, filling, loading of raw material","Français"]
[{"$f":"INDEX(Table_Language[#This Row],1,Language_select+1)","v":"-     Functional test, trials"},"-     Funktionsprüfungen, Versuche;","-     Functional test, trials","Français"]
[{"$f":"INDEX(Table_Language[#This Row],1,Language_select+1)","v":"-     Mounting or changing tools, tool-setting"},"-     Einsetzen oder Auswechseln von Werkzeugen, Werkzeugeinstellung;","-     Mounting or changing tools, tool-setting","Français"]
[{"$f":"INDEX(Table_Language[#This Row],1,Language_select+1)","v":"-     Programming verification"},"-     Überprüfen der Programmierung;","-     Programming verification","Français"]
[{"$f":"INDEX(Table_Language[#This Row],1,Language_select+1)","v":"-     Verification of the final product"},"-     Überprüfen des Endproduktes ","-     Verification of the final product","Français"]
[{"$f":"INDEX(Table_Language[#This Row],1,Language_select+1)","v":"3b Operation"},"3b Betrieb","3b Operation","Français"]
[{"$f":"INDEX(Table_Language[#This Row],1,Language_select+1)","v":"-     Clamping/fastening the workpiece"},"-     Festklemmen/Befestigen des Werkstückes;","-     Clamping/fastening the workpiece","Français"]
[{"$f":"INDEX(Table_Language[#This Row],1,Language_select+1)","v":"-     Control/inspection"},"-     Steuerung/Inspektion;","-     Control/inspection","Français"]
[{"$f":"INDEX(Table_Language[#This Row],1,Language_select+1)","v":"-     Driving the machine"},"-     Antreiben der Maschine;","-     Driving the machine","Français"]
[{"$f":"INDEX(Table_Language[#This Row],1,Language_select+1)","v":"-     Feeding, filling, loading of raw material"},"-     Beschicken, Befüllen, Einbringen der Rohstoffe;","-     Feeding, filling, loading of raw material","Français"]
[{"$f":"INDEX(Table_Language[#This Row],1,Language_select+1)","v":"-     Manual loading/unloading"},"-     manuelles Beladen/Entladen;","-     Manual loading/unloading","Français"]
[{"$f":"INDEX(Table_Language[#This Row],1,Language_select+1)","v":"-     Minor adjustments and setting of functional parameters of the machine (for example, speed, pressure, force, travel limits)"},"-     geringfügige Einstellungs- und Einrichtvorgänge bei den Funktionsparametern der Maschine (z.B. Geschwindigkeit, Druck, Kraft, Fahrbegrenzungen);","-     Minor adjustments and setting of functional parameters of the machine (for example, speed, pressure, force, travel limits)","Français"]
[{"$f":"INDEX(Table_Language[#This Row],1,Language_select+1)","v":"-     Minor interventions during operation (for example, removing waste material, eliminating jams, local cleaning)"},"-     geringfügige Eingriffe während des Betriebs (z.B. Entnahme von Abfallprodukten, Beseitigen von Blockierungen, lokale Reinigung);","-     Minor interventions during operation (for example, removing waste material, eliminating jams, local cleaning)","Français"]
[{"$f":"INDEX(Table_Language[#This Row],1,Language_select+1)","v":"-     Operating manual controls"},"-     Betreiben der manuellen Steuerungseinrichtungen;","-     Operating manual controls","Français"]
[{"$f":"INDEX(Table_Language[#This Row],1,Language_select+1)","v":"-     Restarting the machine after stopping/interruption"},"-    Neustarten der Maschine nach Stillsetzen/ Unterbrechung;","-     Restarting the machine after stopping/interruption","Français"]
[{"$f":"INDEX(Table_Language[#This Row],1,Language_select+1)","v":"-     Supervision"},"-     Überwachen;","-     Supervision","Français"]
[{"$f":"INDEX(Table_Language[#This Row],1,Language_select+1)","v":"-     Verification of the final product"},"-     Überprüfen des Endproduktes ","-     Verification of the final product","Français"]
[{"$f":"INDEX(Table_Language[#This Row],1,Language_select+1)","v":"3c Cleaning / Maintenance"},"  3c Wartung/ Instandhaltung","3c Cleaning / Maintenance","Français"]
[{"$f":"INDEX(Table_Language[#This Row],1,Language_select+1)","v":"-     Adjustments"},"-     Einstellungen;","-     Adjustments","Français"]
[{"$f":"INDEX(Table_Language[#This Row],1,Language_select+1)","v":"-     Cleaning, disinfection"},"-     Reinigung, Desinfektion;","-     Cleaning, disinfection","Français"]
[{"$f":"INDEX(Table_Language[#This Row],1,Language_select+1)","v":"-     Dismantling/removal of parts, components, devices of the machine"},"-     Demontage/Ausbau von Teilen, Bauteilen,","-     Dismantling/removal of parts, components, devices of the machine","Français"]
[{"$f":"INDEX(Table_Language[#This Row],1,Language_select+1)","v":"-     Setup of the Machine"},"-     Einrichtungen der Maschine;","-     Setup of the Machine","Français"]
[{"$f":"INDEX(Table_Language[#This Row],1,Language_select+1)","v":"-     Housekeeping"},"-     „Housekeeping“;","-     Housekeeping","Français"]
[{"$f":"INDEX(Table_Language[#This Row],1,Language_select+1)","v":"-     Isolation and energy dissipation"},"-     Energietrennung und -ableitung;","-     Isolation and energy dissipation","Français"]
[{"$f":"INDEX(Table_Language[#This Row],1,Language_select+1)","v":"-     Lubrication"},"-     Schmieren;","-     Lubrication","Français"]
[{"$f":"INDEX(Table_Language[#This Row],1,Language_select+1)","v":"-     Replacement of tools"},"-     Austausch von Werkzeugen;","-     Replacement of tools","Français"]
[{"$f":"INDEX(Table_Language[#This Row],1,Language_select+1)","v":"-     Replacement of worn parts"},"-     Austausch von Verschleißteilen;","-     Replacement of worn parts","Français"]
[{"$f":"INDEX(Table_Language[#This Row],1,Language_select+1)","v":"-     Resetting"},"-     erneutes Einrichten;","-     Resetting","Français"]
[{"$f":"INDEX(Table_Language[#This Row],1,Language_select+1)","v":"-     Restoring fluid levels"},"-     Nachfüllen von Betriebsflüssigkeiten;","-     Restoring fluid levels","Français"]
[{"$f":"INDEX(Table_Language[#This Row],1,Language_select+1)","v":"-     Verification of parts, components, devices of the machine"},"-     Überprüfen von Teilen, Bauteilen, Einrichtungen der Maschine ","-     Verification of parts, components, devices of the machine","Français"]
[{"$f":"INDEX(Table_Language[#This Row],1,Language_select+1)","v":"3d Fault-finding/ Troubleshooting"},"  3d Fehlersuche und Fehlerbeseitigung","3d Fault-finding/ Troubleshooting","Français"]
[{"$f":"INDEX(Table_Language[#This Row],1,Language_select+1)","v":"-     Adjustments"},"-     Einstellungen;","-     Adjustments","Français"]
[{"$f":"INDEX(Table_Language[#This Row],1,Language_select+1)","v":"-     Dismantling/removal of parts, components, devices of the machine"},"-     Demontage/Ausbau von Teilen, Bauteilen, Einrichtungen der Maschine;","-     Dismantling/removal of parts, components, devices of the machine","Français"]
[{"$f":"INDEX(Table_Language[#This Row],1,Language_select+1)","v":"-     Fault-finding"},"-     Fehlersuche;","-     Fault-finding","Français"]
[{"$f":"INDEX(Table_Language[#This Row],1,Language_select+1)","v":"-     Isolation and energy dissipation"},"-     Energietrennung und -ableitung;","-     Isolation and energy dissipation","Français"]
[{"$f":"INDEX(Table_Language[#This Row],1,Language_select+1)","v":"-     Recovering from control and protective devices failure"},"-     Wiederanlauf nach Ausfall der Steuerungseinrichtungen und Schutzeinrichtungen;","-     Recovering from control and protective devices failure","Français"]
[{"$f":"INDEX(Table_Language[#This Row],1,Language_select+1)","v":"-     Recovering from jam"},"-     Wiederanlauf nach Blockierung;","-     Recovering from jam","Français"]
[{"$f":"INDEX(Table_Language[#This Row],1,Language_select+1)","v":"-     Repairing"},"-     Reparaturen;","-     Repairing","Français"]
[{"$f":"INDEX(Table_Language[#This Row],1,Language_select+1)","v":"-     Replacement of parts, components, devices of the machine"},"-     Ersatz von Teilen, Bauteilen, Einrichtungen der Maschine;","-     Replacement of parts, components, devices of the machine","Français"]
[{"$f":"INDEX(Table_Language[#This Row],1,Language_select+1)","v":"-     Rescue of trapped persons"},"-     Rettung gefangener Personen;","-     Rescue of trapped persons","Français"]
[{"$f":"INDEX(Table_Language[#This Row],1,Language_select+1)","v":"-     Resetting"},"-     erneutes Einrichten;","-     Resetting","Français"]
[{"$f":"INDEX(Table_Language[#This Row],1,Language_select+1)","v":"-     Verification of parts, components, devices of the machine"},"-     Überprüfen von Teilen, Bauteilen, Einrichtungen der Maschine ","-     Verification of parts, components, devices of the machine","Français"]
[{"$f":"INDEX(Table_Language[#This Row],1,Language_select+1)","v":"4. Dismantling / Disabling"},"  4.  Außerbetriebnahme/ Demontage","4. Dismantling / Disabling","Français"]
[{"$f":"INDEX(Table_Language[#This Row],1,Language_select+1)","v":"-     Disconnection and energy dissipation"},"-     Abtrennen von der Energieversorgung und Energieableitung;","-     Disconnection and energy dissipation","Français"]
[{"$f":"INDEX(Table_Language[#This Row],1,Language_select+1)","v":"-     Dismantling"},"-     Demontage;","-     Dismantling","Français"]
[{"$f":"INDEX(Table_Language[#This Row],1,Language_select+1)","v":"-     Lifting"},"-     Anheben;","-     Lifting","Français"]
[{"$f":"INDEX(Table_Language[#This Row],1,Language_select+1)","v":"-     Loading"},"-     Beladen;","-     Loading","Français"]
[{"$f":"INDEX(Table_Language[#This Row],1,Language_select+1)","v":"-     Packing"},"-     Verpacken;","-     Packing","Français"]
[{"$f":"INDEX(Table_Language[#This Row],1,Language_select+1)","v":"-     Transportation"},"-     Transportieren;","-     Transportation","Français"]
[{"$f":"INDEX(Table_Language[#This Row],1,Language_select+1)","v":"-     Unloading"},"-     Entladen ","-     Unloading","Français"]
[{"$f":"INDEX(Table_Language[#This Row],1,Language_select+1)","v":"Machinery Directive, Annex I, No. 1.1.1 d: \"operator\" means the person or persons installing, operating, adjusting, maintaining, cleaning, repairing or moving machinery"},"Maschinenrichtlinie 2006/42/EG, Anhang I, Nr. 1.1.1 d: \"Bedienungspersonal\" die Person bzw. die Personen, die für Installation, Betrieb, Einrichten, Wartung, Reinigung, Reparatur oder Transport von Maschinen zuständig sind.","Machinery Directive, Annex I, No. 1.1.1 d: \"operator\" means the person or persons installing, operating, adjusting, maintaining, cleaning, repairing or moving machinery","Français"]
[{"$f":"INDEX(Table_Language[#This Row],1,Language_select+1)","v":"Analogue DIN VDE 0105-100: Skilled / trained personnel are persons who have been instructed and trained in the duties with which they are entrusted and the risks which may arise from incorrect behaviour. They also have been advised on the necessary protective devices and precautions. Personal which must be trained or instructed or which is in a general training is only allowed to perform under permanent control of a skilled person."},"Analog DIN VDE 0105-100: Als geschulte/unterwiesene Person gilt eine Person, die über die ihr übertragenen Aufgaben und die möglichen Gefahren bei unsachgemäßem Verhalten unterrichtet und erforderlichenfalls angelernt wurde. Auch über die notwendigen Schutzeinrichtungen und Schutzmaßnahmen wurde sie belehrt. Zu schulendes, anzulernendes, einzuweisendes oder im Rahmen einer allgemeinen Ausbildung befindliches Personal darf nur unter ständiger Aufsicht einer erfahrenen Person tätig werden.","Analogue DIN VDE 0105-100: Skilled / trained personnel are persons who have been instructed and trained in the duties with which they are entrusted and the risks which may arise from incorrect behaviour. They also have been advised on the necessary protective devices and precautions. Personal which must be trained or instructed or which is in a general training is only allowed to perform under permanent control of a skilled person.","Français"]
[{"$f":"INDEX(Table_Language[#This Row],1,Language_select+1)","v":"Analogue DIN VDE 0105-100: A specialist is a qualified person, which based on professional training, knowledge and experience is able to assess assigned duties and will be aware of possible risks. Furthermore this person knows the relevant regulations."},"Analog DIN VDE 0105-100: Als Fachkraft wird eine Person bezeichnet, die auf Grund ihrer fachlichen Ausbildung, Kenntnisse und Erfahrungen die ihr übertragenen Arbeiten beurteilen und mögliche Gefahren erkennen kann. Weiterhin besitzt sie Kenntnis über die einschlägigen Bestimmungen.","Analogue DIN VDE 0105-100: A specialist is a qualified person, which based on professional training, knowledge and experience is able to assess assigned duties and will be aware of possible risks. Furthermore this person knows the relevant regulations.","Français"]
[{"$f":"INDEX(Table_Language[#This Row],1,Language_select+1)","v":"List of Standards"},"Normenliste","List of Standards","Français"]
[{"$f":"INDEX(Table_Language[#This Row],1,Language_select+1)","v":"Refresh"},"Aktualisieren","Refresh","Français"]
[{"$f":"INDEX(Table_Language[#This Row],1,Language_select+1)","v":"Number"},"Nummer","Number","Français"]
[{"$f":"INDEX(Table_Language[#This Row],1,Language_select+1)","v":"Title"},"Titel","Title","Français"]
[{"$f":"INDEX(Table_Language[#This Row],1,Language_select+1)","v":"Version 2.1"},"Version 2.1","Version 2.1","Version 2.1"]
[{"$f":"INDEX(Table_Language[#This Row],1,Language_select+1)","v":"Please asses first, whether \"further reduction of the risk\" is necessary."},"Beurteilen Sie erst, ob eine \"weitere Reduzierung notwendig\" ist.","Please asses first, whether \"further reduction of the risk\" is necessary.","Français"]
[{"$f":"INDEX(Table_Language[#This Row],1,Language_select+1)","v":"Please assign a main number to this hazard."},"Bitte erteilen Sie der Gefährdung erst eine Hauptnummer.","Please assign a main number to this hazard.","Français"]
[{"$f":"INDEX(Table_Language[#This Row],1,Language_select+1)","v":"Please assign a sub number to this hazard."},"Bitte erteilen Sie der Gefährdung erst eine Unternummer.","Please assign a sub number to this hazard.","Français"]
[{"$f":"INDEX(Table_Language[#This Row],1,Language_select+1)","v":"Since a \"further reduction of the risk\" is necessary, you need to create a follow up risk reduction, using the same main number and a new sub number (this lines number +1)."},"Da eine \"weitere Reduzierung notwendig\" ist, müssen Sie zum Abschließen der Zeile erst eine Folgemaßnahme mit neuer Unternummer (diese Unternummer +1) anlegen.","Since a \"further reduction of the risk\" is necessary, you need to create a follow up risk reduction, using the same main number and a new sub number (this lines number +1).","Français"]
[{"$f":"INDEX(Table_Language[#This Row],1,Language_select+1)","v":"Version 2.2"},"Version 2.2","Version 2.2","Version 2.2"]
[{"$f":"INDEX(Table_Language[#This Row],1,Language_select+1)","v":"Attention:\nHereby you are deleting the history of all entries in this table.\nDo you want to continue?"},"Achtung:\nHiermit löschen Sie die Historie über alle Einträge im Tabellenblatt.\nMöchten Sie dies durchführen?","Attention:\nHereby you are deleting the history of all entries in this table.\nDo you want to continue?","Français"]
[{"$f":"INDEX(Table_Language[#This Row],1,Language_select+1)","v":"For this cell, no history exists yet, or the history has been deleted."},"Für diese Zelle existiert noch keine Historie, bzw. die Historie wurde gelöscht.","For this cell, no history exists yet, or the history has been deleted.","Français"]
[{"$f":"INDEX(Table_Language[#This Row],1,Language_select+1)","v":"Safety function (if protective measures are applied)"},"Sicherheitsfunktion (bei steuerungstechnischer Lösung)","Safety function (if protective measures are applied)","Français"]
[{"$f":"INDEX(Table_Language[#This Row],1,Language_select+1)","v":"SISTEMA-File"},"SISTEMA-Datei","SISTEMA-File","Français"]
[{"$f":"INDEX(Table_Language[#This Row],1,Language_select+1)","v":"Risk assessment Log"},"Risikobeurteilung Log","Risk assessment Log","Évaluation des risques Log"]
[{"$f":"INDEX(Table_Language[#This Row],1,Language_select+1)","v":"Aggressive environmental conditions"},"Aggressive Umgebungsbedingungen","Aggressive environmental conditions","Français"]
[{"$f":"INDEX(Table_Language[#This Row],1,Language_select+1)","v":"etc."},"etc.","etc.","Français"]
[{"$f":"INDEX(Table_Language[#This Row],1,Language_select+1)","v":"Version 2.2.5"},"Version 2.2.5","Version 2.2.5","Version 2.2.5"]
[{"$f":"INDEX(Table_Language[#This Row],1,Language_select+1)","v":"Manufacturer:"},"Hersteller:","Manufacturer:","Français"]
[{"$f":"INDEX(Table_Language[#This Row],1,Language_select+1)","v":"Address of the manufacturer:"},"Anschrift des Herstellers:","Address of the manufacturer:","Français"]
[{"$f":"INDEX(Table_Language[#This Row],1,Language_select+1)","v":"Version of the complete document:"},"Version dieses Gesamtdokuments:","Version of the complete document:","Français"]
[{"$f":"INDEX(Table_Language[#This Row],1,Language_select+1)","v":"Date of last change:"},"Datum der letzten Änderung:","Date of last change:","Français"]
[{"$f":"INDEX(Table_Language[#This Row],1,Language_select+1)","v":"Version 2.3.4.2"},"Version 2.3.4.2","Version 2.3.4.2","Version 2.3.4.2"]
[{"$f":"INDEX(Table_Language[#This Row],1,Language_select+1)","v":"Verification-/ Validationfile"},"Verifikations-/ Validierungsdatei","Verification-/ Validationfile","Français"]
[{"$f":"INDEX(Table_Language[#This Row],1,Language_select+1)","v":"Version 2.4"},"Version 2.4","Version 2.4","Version 2.4"]
[{"$f":"INDEX(Table_Language[#This Row],1,Language_select+1)","v":"O"},"W","O","O"]
[{"$f":"INDEX(Table_Language[#This Row],1,Language_select+1)","v":"O"},"W","O","O"]
[{"$f":"INDEX(Table_Language[#This Row],1,Language_select+1)","v":"Setup"},"Einstellungen","Setup","Configuration"]
[{"$f":"INDEX(Table_Language[#This Row],1,Language_select+1)","v":"Attention:\nAccording to Annex I \"General Principles\" No 2:\n\nFor machinery in any event, the principles of safety integration referred to in \n   section 1.1.2 \nand the obligations concerning marking of machinery and instructions referred to in \n   sections 1.7.3 and 1.7.4 \napply."},"Achtung:\nNach Anhang I \"Allgemeine Grundsätze\" Nr. 2 gilt:\n\nFür Maschinen gelten die in \n   Nummer 1.1.2 aufgeführten Grundsätze für die Integration der Sicherheit sowie die in den \n   Nummern 1.7.3 und 1.7.4 aufgeführten Verpflichtungen in Bezug auf die Kennzeichnung der Maschine und die Betriebsanleitung auf jeden Fall.","Attention:\nAccording to Annex I \"General Principles\" No 2:\n\nFor machinery in any event, the principles of safety integration referred to in \n   section 1.1.2 \nand the obligations concerning marking of machinery and instructions referred to in \n   sections 1.7.3 and 1.7.4 \napply.","Attention:\nConformément à Annexe I \"Principes Généraux\" No 2:\n\nAux machine, en tout état de cause, les principes d'intégration de la sécurité visés section 1.1.2 et les obligations concernant le marquage des machines et la notice d'instructions visées sections 1.7.3 et 1.7.4 s'appliquent."]
[{"$f":"INDEX(Table_Language[#This Row],1,Language_select+1)","v":"cancel"},"Abbrechen","cancel","annuler"]
[{"$f":"INDEX(Table_Language[#This Row],1,Language_select+1)","v":"apply"},"Übernehmen","apply","accepter"]
[{"$f":"INDEX(Table_Language[#This Row],1,Language_select+1)","v":"language"},"Sprache","language","langue"]
[{"$f":"INDEX(Table_Language[#This Row],1,Language_select+1)","v":"general"},"Allgemein","general","général"]
[{"$f":"INDEX(Table_Language[#This Row],1,Language_select+1)","v":"visible columns"},"sichtbare Spalten","visible columns","visible colonne"]
[{"$f":"INDEX(Table_Language[#This Row],1,Language_select+1)","v":"delete log"},"Log löschen","delete log","purger log"]
[{"$f":"INDEX(Table_Language[#This Row],1,Language_select+1)","v":"year of construction:"},"Baujahr:","year of construction:","Français"]
[{"$f":"INDEX(Table_Language[#This Row],1,Language_select+1)","v":"Version 2.4.1 alpha"},"Version 2.4.1 alpha","Version 2.4.1 alpha","Version 2.4.1 alpha"]
[{"$f":"INDEX(Table_Language[#This Row],1,Language_select+1)","v":"Language of row"},"Sprache der Zeile","Language of row","Français"]
[{"$f":"INDEX(Table_Language[#This Row],1,Language_select+1)","v":"Version 2.5 (Print version)"},"Version 2.5 (Druckversion)","Version 2.5 (Print version)","Version 2.5"]
[{"$f":"INDEX(Table_Language[#This Row],1,Language_select+1)","v":"Create Word file from risk assessment"},"Word-Datei der Risikobeurteilung erstellen","Create Word file from risk assessment","Français"]
[{"$f":"INDEX(Table_Language[#This Row],1,Language_select+1)","v":"Hazard is covered by the standard?"},"Gefährdung ist von der Norm abgedeckt?","Hazard is covered by the standard?","Français"]
[{"$f":"INDEX(Table_Language[#This Row],1,Language_select+1)","v":"All"},"Alle","All","Français"]
[{"$f":"INDEX(Table_Language[#This Row],1,Language_select+1)","v":"Transport"},"Transport","Transport","Français"]
[{"$f":"INDEX(Table_Language[#This Row],1,Language_select+1)","v":"Assembly and installation, Commissioning"},"Montage und Installation, Inbetriebnahme","Assembly and installation, Commissioning","Français"]
[{"$f":"INDEX(Table_Language[#This Row],1,Language_select+1)","v":"Setting, Teaching/programming and/or process changeover"},"Einrichten, Einlernen (Teachen)/ Programmieren und/oder Umrüsten","Setting, Teaching/programming and/or process changeover","Français"]
[{"$f":"INDEX(Table_Language[#This Row],1,Language_select+1)","v":"Operation"},"Betrieb","Operation","Français"]
[{"$f":"INDEX(Table_Language[#This Row],1,Language_select+1)","v":"Cleaning, Maintenance"},"Reinigung, Instandhaltung","Cleaning, Maintenance","Français"]
[{"$f":"INDEX(Table_Language[#This Row],1,Language_select+1)","v":"Fault-finding/Troubleshooting"},"Fehlersuche und -beseitigung","Fault-finding/Troubleshooting","Français"]
[{"$f":"INDEX(Table_Language[#This Row],1,Language_select+1)","v":"Dismantling, Disabling"},"Demontage, Außer Betrieb nehmen","Dismantling, Disabling","Français"]
[{"$f":"INDEX(Table_Language[#This Row],1,Language_select+1)","v":"applies"},"trifft zu","applies","Français"]
[{"$f":"INDEX(Table_Language[#This Row],1,Language_select+1)","v":"to be decided"},"muss noch entschieden werden","to be decided","Français"]
[{"$f":"INDEX(Table_Language[#This Row],1,Language_select+1)","v":"content is covered / done"},"Inhalt ist abgedeckt / erledigt","content is covered / done","Français"]
[{"$f":"INDEX(Table_Language[#This Row],1,Language_select+1)","v":"must be further considered in EHSR"},"muss weiter behandelt werden","must be further considered in EHSR","Français"]
[{"$f":"INDEX(Table_Language[#This Row],1,Language_select+1)","v":"no further reduction necessary"},"keine weitere Reduzierung notwendig","no further reduction necessary","Français"]
[{"$f":"INDEX(Table_Language[#This Row],1,Language_select+1)","v":"PLEASE PROVIDE INFORMATION!"},"BITTE ANGABEN MACHEN!","PLEASE PROVIDE INFORMATION!","Français"]
[{"$f":"INDEX(Table_Language[#This Row],1,Language_select+1)","v":"covered / EHSR is finished"},"behandelt / betrachtet, GSA-Punkt ist fertig","covered / EHSR is finished","Français"]
[{"$f":"INDEX(Table_Language[#This Row],1,Language_select+1)","v":"not completely covered, more work needed at this EHSR"},"Nicht behandelt / betrachtet, GSA-Punkt muss noch bearbeitet werden","not completely covered, more work needed at this EHSR","Français"]
[{"$f":"INDEX(Table_Language[#This Row],1,Language_select+1)","v":"Risk Estimation before Risk Reduction"},"Risikoeinschätzung vor Risikominimierung:","Risk Estimation before Risk Reduction","Français"]
[{"$f":"INDEX(Table_Language[#This Row],1,Language_select+1)","v":"severity of injury (S)"},"Schwere der Verletzung (S)","severity of injury (S)","Français"]
[{"$f":"INDEX(Table_Language[#This Row],1,Language_select+1)","v":"frequency (F)"},"Häufigkeit (F)","frequency (F)","Français"]
[{"$f":"INDEX(Table_Language[#This Row],1,Language_select+1)","v":"possibility of avoiding (P)"},"Möglichkeit der Vermeidung (P)","possibility of avoiding (P)","Français"]
[{"$f":"INDEX(Table_Language[#This Row],1,Language_select+1)","v":"probability of occurrence (O)"},"Wahrscheinlichkeit (W)","probability of occurrence (O)","Français"]
[{"$f":"INDEX(Table_Language[#This Row],1,Language_select+1)","v":"protective measure"},"Schutzmaßnahme","protective measure","Français"]
[{"$f":"INDEX(Table_Language[#This Row],1,Language_select+1)","v":"Risk Estimation after Risk Reduction"},"Risikoeinschätzung nach Risikominimierung:","Risk Estimation after Risk Reduction","Français"]
[{"$f":"INDEX(Table_Language[#This Row],1,Language_select+1)","v":"1 – starting point for evaluation of safety function’s contribution to risk reduction\nL – low contribution to risk reduction\nH – high contribution to risk reduction\nPLr – required performance level\n\nS – severity of injury\nS1 – slight (normally reversible injury)\nS2 – serious (normally irreversible injury or death)\n\nF – frequency and/or exposure to hazard\nF1 – seldom-to-less-often and/or exposure time is short\nF2 – frequent-to-continuous and/or exposure time is long\n\nP – possibility of avoiding hazard or limiting harm\nP1 – possible under specific conditions\nP2 – scarcely possible\n\nW – (O) probability of occurrence of a hazardous event\nW1 – (O1) low (with justification in commentary!)\nW2 – (O2) normal"},"1 – Startpunkt der Risikobewertung\nL – niedriges Risiko\nH – hohes Risiko\nPLr – erforderlicher Performance Level\n\nS – Schwere der Verletzung S1 und S2\nS1 – leicht (üblicherweise reversible Verletzung)\nS2 – ernst (üblicherweise irreversible Verletzung einschließlich Tod)\n\nF – Häufigkeit und/oder Dauer der Gefährdungsexposition F1 und F2\nF1 – selten bis weniger häufig und/oder die Dauer der Gefährdungsexposition ist kurz\nF2 – häufig bis dauernd und/oder die Dauer der Gefährdungsexposition ist lang\n\nP – Möglichkeit zur Vermeidung der Gefährdung P1 und P2\nP1 – möglich unter bestimmten Bedingungen,\nP2 – kaum möglich\n\nW – Eintrittswahrscheinlichkeit eines Gefährdungsereignisses\nW1 – unwahrscheinlich (mit Begründung im Kommentar!)\nW2 – normale Wahrscheinlichkeit","1 – starting point for evaluation of safety function’s contribution to risk reduction\nL – low contribution to risk reduction\nH – high contribution to risk reduction\nPLr – required performance level\n\nS – severity of injury\nS1 – slight (normally reversible injury)\nS2 – serious (normally irreversible injury or death)\n\nF – frequency and/or exposure to hazard\nF1 – seldom-to-less-often and/or exposure time is short\nF2 – frequent-to-continuous and/or exposure time is long\n\nP – possibility of avoiding hazard or limiting harm\nP1 – possible under specific conditions\nP2 – scarcely possible\n\nW – (O) probability of occurrence of a hazardous event\nW1 – (O1) low (with justification in commentary!)\nW2 – (O2) normal","Français"]
[{"$f":"INDEX(Table_Language[#This Row],1,Language_select+1)","v":"Version 2.5 (changes in part 1)"},"Version 2.5 (Änderungen in Blatt 1)","Version 2.5 (changes in part 1)","Version 2.5"]
[{"$f":"INDEX(Table_Language[#This Row],1,Language_select+1)","v":"please select"},"bitte auswählen","please select","Français"]
[{"$f":"INDEX(Table_Language[#This Row],1,Language_select+1)","v":"Annex VIII - Assessment of conformity with internal checks on the manufacture of machinery"},"Anhang VIII - Bewertung der Konformität mit interner Fertigungskontrolle","Annex VIII - Assessment of conformity with internal checks on the manufacture of machinery","Français"]
[{"$f":"INDEX(Table_Language[#This Row],1,Language_select+1)","v":"Annex IX - EC type-examination"},"Anhang IX - EG-Baumusterprüfung","Annex IX - EC type-examination","Français"]
[{"$f":"INDEX(Table_Language[#This Row],1,Language_select+1)","v":"Annex X - Full quality assurance"},"Anhang X - Umfassende Qualitätssicherung","Annex X - Full quality assurance","Français"]
[{"$f":"INDEX(Table_Language[#This Row],1,Language_select+1)","v":"Annex VIII and IX"},"Anhang VIII und IX","Annex VIII and IX","Français"]
[{"$f":"INDEX(Table_Language[#This Row],1,Language_select+1)","v":"Annex VIII and X"},"Anhang VIII und X","Annex VIII and X","Français"]
[{"$f":"INDEX(Table_Language[#This Row],1,Language_select+1)","v":"Annex IX and X"},"Anhang IX und X","Annex IX and X","Français"]
[{"$f":"INDEX(Table_Language[#This Row],1,Language_select+1)","v":"Annex VIII, IX und X"},"Anhang VIII, IX und X","Annex VIII, IX und X","Français"]
[{"$f":"INDEX(Table_Language[#This Row],1,Language_select+1)","v":"please select"},"bitte auswählen","please select","Français"]
[{"$f":"INDEX(Table_Language[#This Row],1,Language_select+1)","v":"privately"},"Privat","privately","Français"]
[{"$f":"INDEX(Table_Language[#This Row],1,Language_select+1)","v":"Commercial, industrial application"},"Gewerblich, industrieller Einsatz","Commercial, industrial application","Français"]
[{"$f":"INDEX(Table_Language[#This Row],1,Language_select+1)","v":"privately and commercial, industrial application"},"Privat und gewerblich, industrieller Einsatz","privately and commercial, industrial application","Français"]
[{"$f":"INDEX(Table_Language[#This Row],1,Language_select+1)","v":"Create Riskassessment"},"Risikobeurteilung erstellen","Create Riskassessment","Français"]
[{"$f":"INDEX(Table_Language[#This Row],1,Language_select+1)","v":"Are you sure you want to start printing? This takes some time.\nATTENTION: Only visible lines in \"Risk Assessment\" will be printed."},"Sind Sie sicher, dass Sie den Druck starten möchten? Dies dauert erfahrungsgemäß einige Zeit.\nACHTUNG: Nur sichtbare Zeilen im Blatt \"Risikobeurteilung\" werden gedruckt.","Are you sure you want to start printing? This takes some time.\nATTENTION: Only visible lines in \"Risk Assessment\" will be printed.","Français"]
[{"$f":"INDEX(Table_Language[#This Row],1,Language_select+1)","v":"Word template was not found. Please copy the file into the same directory as your risk assessment. Searching for file: "},"Word-Vorlage wurde nicht gefunden. Bitte kopieren Sie die dotm Datei in das Verzeichnis, in dem auch diese Risikobeurteilung liegt. Gesuchte Vorlage: ","Word template was not found. Please copy the file into the same directory as your risk assessment. Searching for file: ","Français"]
[{"$f":"INDEX(Table_Language[#This Row],1,Language_select+1)","v":"A Bookmark is missing from the template. Please check your template. Printing has been cancelled."},"Eine Textmarke wurde in der Word-Berichtsvorlage nicht gefunden. Bitte prüfen Sie die Berichtsvorlage. Die Berichtserstellung wird abgebrochen.","A Bookmark is missing from the template. Please check your template. Printing has been cancelled.","Français"]
[{"$f":"INDEX(Table_Language[#This Row],1,Language_select+1)","v":"Report is finished.\nYou can find the file in your taskbar."},"Report wurde erstellt.\nDie Worddatei finden Sie in Ihrer Taskleiste.","Report is finished.\nYou can find the file in your taskbar.","Français"]
[{"$f":"INDEX(Table_Language[#This Row],1,Language_select+1)","v":"Version 2.5 (rest)"},"Version 2.5 (sonstiges)","Version 2.5 (rest)","Version 2.5"]
[{"$f":"INDEX(Table_Language[#This Row],1,Language_select+1)","v":"reset conditional formats"},"bedingte Formatierung zurücksetzen","reset conditional formats","Français"]
[{"$f":"INDEX(Table_Language[#This Row],1,Language_select+1)","v":"Version 2.5.2 (Error message)"},"Version 2.5.2 (Fehlermeldung)","Version 2.5.2 (Error message)","Version 2.5.2"]
[{"$f":"INDEX(Table_Language[#This Row],1,Language_select+1)","v":"ATTENTION:\nYou have not yet opened the downloaded Word file manually.\nMicrosoft will not open a file containing macros without your permission.\nPlease start Word and go to \"file\" --> \"open\" --> select file.\nAfterwards click on \"Enable Editing\" and close the file.\nDouble clicking the .DOTM File might not work.\nFile: "},"ACHTUNG:\nSie haben die Word-Vorlage noch nie per Hand geöffnet.\nMicrosoft verhindert dann hier das öffnen von Dateien aus dem Internet.\nBitte öffnen Sie die Datei einmal vorher in Word. (Word starten, dann \"Datei\" --> \"Öffnen\" --> Datei auswählen)\nDanach klicken Sie auf \"Bearbeitung aktivieren\" und schließen die Datei.\nDie Datei per Doppelklick zu öffnen könnte nicht ausreichen.\nDatei: ","ATTENTION:\nYou have not yet opened the downloaded Word file manually.\nMicrosoft will not open a file containing macros without your permission.\nPlease start Word and go to \"file\" --> \"open\" --> select file.\nAfterwards click on \"Enable Editing\" and close the file.\nDouble clicking the .DOTM File might not work.\nFile: ","Français"]
[{"$f":"INDEX(Table_Language[#This Row],1,Language_select+1)","v":"Error in Sub RB_Report"},"Fehler in Sub RB_Report","Error in Sub RB_Report","Français"]
[{"$f":"INDEX(Table_Language[#This Row],1,Language_select+1)","v":"\nError Number: "},"\nFehlernummer: ","\nError Number: ","Français"]
[{"$f":"INDEX(Table_Language[#This Row],1,Language_select+1)","v":"\nError Description: "},"\nFehlerbeschreibung: ","\nError Description: ","Français"]
[{"$f":"INDEX(Table_Language[#This Row],1,Language_select+1)","v":"Version 2.5.3 (Printing Statusbar)"},"Version 2.5.3 (Druck-Statusbar)","Version 2.5.3 (Printing Statusbar)","Version 2.5.3"]
[{"$f":"INDEX(Table_Language[#This Row],1,Language_select+1)","v":"Printing in progress"},"Ausdruck wird erstellt","Printing in progress","Français"]
[{"$f":"INDEX(Table_Language[#This Row],1,Language_select+1)","v":"Project Data Items printed:"},"Projektdaten Items gedruckt:","Project Data Items printed:","Français"]
[{"$f":"INDEX(Table_Language[#This Row],1,Language_select+1)","v":"Project Data Items to be printed:"},"Projektdaten Items insgesammt:","Project Data Items to be printed:","Français"]
[{"$f":"INDEX(Table_Language[#This Row],1,Language_select+1)","v":"Lines printed:"},"Risikobeurteilungspunkte gedruckt:","Lines printed:","Français"]
[{"$f":"INDEX(Table_Language[#This Row],1,Language_select+1)","v":"Lines to be printed:"},"Risikobeurteilungspunkte insgesammt:","Lines to be printed:","Français"]
[{"$f":"INDEX(Table_Language[#This Row],1,Language_select+1)","v":"Please be patient during printing…"},"Bitte warten Sie, während der Ausdruck erstellt wird…","Please be patient during printing…","Français"]
[{"$f":"INDEX(Table_Language[#This Row],1,Language_select+1)","v":"Version 2.5.5"},"Version 2.5.5","Version 2.5.5","Version 2.5.5"]
[{"$f":"INDEX(Table_Language[#This Row],1,Language_select+1)","v":"Import Project data, Risk assessment and Own standards"},"Importiere Projektdaten, Risikobeurteilung und Eigene Normen","Import Project data, Risk assessment and Own standards","Français"]
[{"$f":"INDEX(Table_Language[#This Row],1,Language_select+1)","v":"Folder"},"Ordner","Folder","Français"]
[{"$f":"INDEX(Table_Language[#This Row],1,Language_select+1)","v":"File"},"Datei","File","Français"]
[{"$f":"INDEX(Table_Language[#This Row],1,Language_select+1)","v":"Select"},"Auswählen","Select","Français"]
[{"$f":"INDEX(Table_Language[#This Row],1,Language_select+1)","v":"Import"},"Importieren","Import","Français"]
[{"$f":"INDEX(Table_Language[#This Row],1,Language_select+1)","v":"Version 2.5.6.2"},"Version 2.5.6.2","Version 2.5.6.2","Version 2.5.6.2"]
[{"$f":"INDEX(Table_Language[#This Row],1,Language_select+1)","v":"more available, list full"},"mehr verfügbar, Liste voll","more available, list full","Français"]
[{"$f":"INDEX(Table_Language[#This Row],1,Language_select+1)","v":"Version 2.5.6.4"},"Version 2.5.6.4","Version 2.5.6.4","Version 2.5.6.4"]
[{"$f":"INDEX(Table_Language[#This Row],1,Language_select+1)","v":"delete links pointing to old version"},"Links auf alte Version löschen","delete links pointing to old version","Français"]
[{"$f":"INDEX(Table_Language[#This Row],1,Language_select+1)","v":"Version 2.5.6.5"},"Version 2.5.6.5","Version 2.5.6.5","Version 2.5.6.5"]
[{"$f":"INDEX(Table_Language[#This Row],1,Language_select+1)","v":"hazardous event (hazard / hazardous situation)"},"Gefährdungsereignis (Gefährdung / Gefährdungssituation)","hazardous event (hazard / hazardous situation)","événement dangereux"]
[{"$f":"INDEX(Table_Language[#This Row],1,Language_select+1)","v":"potential consequences"},"mögliche Folgen","potential consequences","Français"]
[{"$f":"INDEX(Table_Language[#This Row],1,Language_select+1)","v":"Version 2.6"},"Version 2.6","Version 2.6","Version 2.6"]
[{"$f":"INDEX(Table_Language[#This Row],1,Language_select+1)","v":"Directive"},"Richtlinie","Directive","Français"]
[{"$f":"INDEX(Table_Language[#This Row],1,Language_select+1)","v":"is empty headline"},"Ist leere Überschrift","is empty headline","Français"]
[{"$f":"INDEX(Table_Language[#This Row],1,Language_select+1)","v":"select all"},"Alle auswählen","select all","Français"]
[{"$f":"INDEX(Table_Language[#This Row],1,Language_select+1)","v":"select none"},"Keinen auswählen","select none","Français"]
[{"$f":"INDEX(Table_Language[#This Row],1,Language_select+1)","v":"Version 2.6.1"},"Version 2.6.1","Version 2.6.1","Version 2.6.1"]
[{"$f":"INDEX(Table_Language[#This Row],1,Language_select+1)","v":"given by standard"},"Normvorgabe","given by standard","Français"]
[{"$f":"INDEX(Table_Language[#This Row],1,Language_select+1)","v":"machine type"},"Maschinentyp","machine type","Français"]
[{"$f":"INDEX(Table_Language[#This Row],1,Language_select+1)","v":"EN ISO 13849"},"EN ISO 13849","EN ISO 13849","EN ISO 13849"]
[{"$f":"INDEX(Table_Language[#This Row],1,Language_select+1)","v":"EN 62061"},"EN 62061","EN 62061","EN 62061"]
[{"$f":"INDEX(Table_Language[#This Row],1,Language_select+1)","v":0},null,null,"Français"]
[{"$f":"INDEX(Table_Language[#This Row],1,Language_select+1)","v":0},null,null,"Français"]
[{"$f":"INDEX(Table_Language[#This Row],1,Language_select+1)","v":0},null,null,"Français"]
[{"$f":"INDEX(Table_Language[#This Row],1,Language_select+1)","v":0},null,null,"Français"]
[{"$f":"INDEX(Table_Language[#This Row],1,Language_select+1)","v":0},null,null,"Français"]
[{"$f":"INDEX(Table_Language[#This Row],1,Language_select+1)","v":0},null,null,"Français"]
[{"$f":"INDEX(Table_Language[#This Row],1,Language_select+1)","v":0},null,null,"Français"]
[{"$f":"INDEX(Table_Language[#This Row],1,Language_select+1)","v":0},null,null,"Français"]

{"sheet":"Own Cells","index":6,"n_rows":6,"n_cols":4,"rows_kept":6,"cut":false,"hidden":false,"merged":[]}
["2","Deutsch","English","Français"]
[{"$f":"INDEX(Table_OwnEntries[#This Row],1,Language_select+1)","v":"Sheet Risk Assessment"},"Blatt Risikobeurteilung","Sheet Risk Assessment","Évaluation des risques "]
[{"$f":"INDEX(Table_OwnEntries[#This Row],1,Language_select+1)","v":"Own entry"},"Eigener Eintrag","Own entry","Propre élément"]
[{"$f":"INDEX(Table_OwnEntries[#This Row],1,Language_select+1)","v":"Own entry"},"Eigener Eintrag","Own entry","Propre élément"]
[{"$f":"INDEX(Table_OwnEntries[#This Row],1,Language_select+1)","v":"Project data"},"Projektdaten","Project data","Données projet"]
[{"$f":"INDEX(Table_OwnEntries[#This Row],1,Language_select+1)","v":"Own entry"},"Eigener Eintrag","Own entry","Propre élément"]

{"sheet":"Version","index":7,"n_rows":4,"n_cols":3,"rows_kept":4,"cut":false,"hidden":false,"merged":[]}
["Version","Deutsch","English"]
["2.6.1.4","Anleitung auf www.maschinenrichtlinie.de","Instructions of use at www.maschinenrichtlinie.com"]
[null,"MBT Risikobeurteilung nach maschinenrichtlinie.de\n© MBT Ostermann GmbH\nVersion ","MBT Risk assessment based on maschinenrichtlinie.com\n© MBT Ostermann GmbH\nVersion "]
[null,"Lizenz:\nCC BY 3.0 DE\nNamensnennung 3.0 Deutschland","License:\nCC BY 3.0 DE\nNamensnennung 3.0 Deutschland"]

{"sheet":"EHSR","index":8,"n_rows":184,"n_cols":5,"rows_kept":184,"cut":false,"hidden":false,"merged":[[0,3,2,3],[1,0,2,0],[1,1,1,2]]}
[null,null,null,{"$f":"Language!A535","v":"is empty headline"}]
[{"$f":"Language!A534","v":"Directive"},{"$f":"Language!A6","v":"Essential health and safety requirements"}]
[null,{"$f":"Language!A7","v":"No."},{"$f":"Language!A8","v":"Title"}]
["Richtlinie","Nr.","Bezeichnung","Leere Überschrift","Link"]
["2006 / 42","1.1.",{"$f":"Language!A$83","v":"General remarks"},"x"]
["2006 / 42","1.1.2.",{"$f":"Language!A$84","v":"Principles of safety integration"},"","http://www.maschinenrichtlinie.de/maschinenrichtlinie/neue-mrl-2006-42-eg/sicherheits-anforderungen/fuer-alle-maschinen/integration-der-sicherheit/"]
["2006 / 42","1.1.3.",{"$f":"Language!A$85","v":"Materials and products"},"","http://www.maschinenrichtlinie.de/maschinenrichtlinie/neue-mrl-2006-42-eg/sicherheits-anforderungen/fuer-alle-maschinen/materialien-produkte/"]
["2006 / 42","1.1.4.",{"$f":"Language!A$86","v":"Lighting"},"","http://www.maschinenrichtlinie.de/maschinenrichtlinie/neue-mrl-2006-42-eg/sicherheits-anforderungen/fuer-alle-maschinen/beleuchtung/"]
["2006 / 42","1.1.5.",{"$f":"Language!A$87","v":"Design of machinery to facilitate its handling"},"","http://www.maschinenrichtlinie.de/maschinenrichtlinie/neue-mrl-2006-42-eg/sicherheits-anforderungen/fuer-alle-maschinen/115-konstruktion/"]
["2006 / 42","1.1.6.",{"$f":"Language!A$88","v":"Ergonomics"},"","http://www.maschinenrichtlinie.de/maschinenrichtlinie/neue-mrl-2006-42-eg/sicherheits-anforderungen/fuer-alle-maschinen/116-ergonomie/"]
["2006 / 42","1.1.7.",{"$f":"Language!A$89","v":"Operating positions"},"","http://www.maschinenrichtlinie.de/maschinenrichtlinie/neue-mrl-2006-42-eg/sicherheits-anforderungen/fuer-alle-maschinen/117-bedienungsplaetze/"]
["2006 / 42","1.1.8.",{"$f":"Language!A$90","v":"Seating"},"","http://www.maschinenrichtlinie.de/maschinenrichtlinie/neue-mrl-2006-42-eg/sicherheits-anforderungen/fuer-alle-maschinen/118-sitze/"]
["2006 / 42","1.2.",{"$f":"Language!A$91","v":"Control systems"},"x","http://www.maschinenrichtlinie.de/maschinenrichtlinie/neue-mrl-2006-42-eg/sicherheits-anforderungen/fuer-alle-maschinen/steuerungen-befehlseinrichtung/"]
["2006 / 42","1.2.1.",{"$f":"Language!A$92","v":"Safety and reliability of control systems"},"","http://www.maschinenrichtlinie.de/maschinenrichtlinie/neue-mrl-2006-42-eg/sicherheits-anforderungen/fuer-alle-maschinen/121-steuerungen/"]
["2006 / 42","1.2.2.",{"$f":"Language!A$93","v":"Control devices"},"","http://www.maschinenrichtlinie.de/maschinenrichtlinie/neue-mrl-2006-42-eg/sicherheits-anforderungen/fuer-alle-maschinen/122-stellteile/"]
["2006 / 42","1.2.3.",{"$f":"Language!A$94","v":"Starting"},"","http://www.maschinenrichtlinie.de/maschinenrichtlinie/neue-mrl-2006-42-eg/sicherheits-anforderungen/fuer-alle-maschinen/123-ingangsetzen/"]
["2006 / 42","1.2.4.",{"$f":"Language!A$95","v":"Stopping"},"x"]
["2006 / 42","1.2.4.1.",{"$f":"Language!A$96","v":"Normal stop"},"","http://www.maschinenrichtlinie.de/maschinenrichtlinie/neue-mrl-2006-42-eg/sicherheits-anforderungen/fuer-alle-maschinen/1241-normales-stillsetzen/"]
["2006 / 42","1.2.4.2.",{"$f":"Language!A$97","v":"Operational stop"},"","http://www.maschinenrichtlinie.de/maschinenrichtlinie/neue-mrl-2006-42-eg/sicherheits-anforderungen/fuer-alle-maschinen/betriebsbedingtes-stillsetzen/"]
["2006 / 42","1.2.4.3.",{"$f":"Language!A$98","v":"Emergency stop"},"","http://www.maschinenrichtlinie.de/maschinenrichtlinie/neue-mrl-2006-42-eg/sicherheits-anforderungen/fuer-alle-maschinen/stillsetzen-im-notfall/"]
["2006 / 42","1.2.4.4.",{"$f":"Language!A$99","v":"Assembly of machinery"},"","http://www.maschinenrichtlinie.de/maschinenrichtlinie/neue-mrl-2006-42-eg/sicherheits-anforderungen/fuer-alle-maschinen/gesamtheit-von-maschinen/"]
["2006 / 42","1.2.5.",{"$f":"Language!A$100","v":"Selection of control or operating modes"},"","http://www.maschinenrichtlinie.de/maschinenrichtlinie/neue-mrl-2006-42-eg/sicherheits-anforderungen/fuer-alle-maschinen/betriebsartenwahlschalter/"]
["2006 / 42","1.2.6.",{"$f":"Language!A$101","v":"Failure of the power supply"},"","http://www.maschinenrichtlinie.de/maschinenrichtlinie/neue-mrl-2006-42-eg/sicherheits-anforderungen/fuer-alle-maschinen/energieversorgung/"]
["2006 / 42","1.3.",{"$f":"Language!A$102","v":"Protection against mechanical hazards"},"x"]
["2006 / 42","1.3.1.",{"$f":"Language!A$103","v":"Risk of loss of stability"},"","http://www.maschinenrichtlinie.de/maschinenrichtlinie/neue-mrl-2006-42-eg/sicherheits-anforderungen/fuer-alle-maschinen/verlust-der-standsicherheit/"]
["2006 / 42","1.3.2.",{"$f":"Language!A$104","v":"Risk of break-up during operation"},"","http://www.maschinenrichtlinie.de/maschinenrichtlinie/neue-mrl-2006-42-eg/sicherheits-anforderungen/fuer-alle-maschinen/bruchrisiko-beim-betrieb/"]
["2006 / 42","1.3.3.",{"$f":"Language!A$105","v":"Risks due to falling or ejected objects"},"","http://www.maschinenrichtlinie.de/maschinenrichtlinie/neue-mrl-2006-42-eg/sicherheits-anforderungen/fuer-alle-maschinen/herabfallende-gegenstaende/"]
["2006 / 42","1.3.4.",{"$f":"Language!A$106","v":"Risks due to surfaces, edges or angles"},"","http://www.maschinenrichtlinie.de/maschinenrichtlinie/neue-mrl-2006-42-eg/sicherheits-anforderungen/fuer-alle-maschinen/oberflaechen-kanten-ecken/"]
["2006 / 42","1.3.5.",{"$f":"Language!A$107","v":"Risks related to combined machinery"},"","http://www.maschinenrichtlinie.de/maschinenrichtlinie/neue-mrl-2006-42-eg/sicherheits-anforderungen/fuer-alle-maschinen/mehrfach-kombinierte-maschinen/"]
["2006 / 42","1.3.6.",{"$f":"Language!A$108","v":"Risks related to variations in operating conditions"},"","http://www.maschinenrichtlinie.de/maschinenrichtlinie/neue-mrl-2006-42-eg/sicherheits-anforderungen/fuer-alle-maschinen/verwendungsbedingungen/"]
["2006 / 42","1.3.7.",{"$f":"Language!A$109","v":"Risks related to moving parts"},"","http://www.maschinenrichtlinie.de/maschinenrichtlinie/neue-mrl-2006-42-eg/sicherheits-anforderungen/fuer-alle-maschinen/risiken-durch-bewegliche-teile/"]
["2006 / 42","1.3.8.",{"$f":"Language!A$110","v":"Choice of protection against risks arising from moving parts"},"x","http://www.maschinenrichtlinie.de/maschinenrichtlinie/neue-mrl-2006-42-eg/sicherheits-anforderungen/fuer-alle-maschinen/wahl-der-schutzeinrichtungen/"]
["2006 / 42","1.3.8.1.",{"$f":"Language!A$111","v":"Moving transmission parts"},"","http://www.maschinenrichtlinie.de/maschinenrichtlinie/neue-mrl-2006-42-eg/sicherheits-anforderungen/fuer-alle-maschinen/teile-der-kraftuebertragung.html"]
["2006 / 42","1.3.8.2.",{"$f":"Language!A$112","v":"Moving parts involved in the process"},"","http://www.maschinenrichtlinie.de/maschinenrichtlinie/neue-mrl-2006-42-eg/sicherheits-anforderungen/fuer-alle-maschinen/teile-arbeitsprozess-beteiligt.html"]
["2006 / 42","1.3.9.",{"$f":"Language!A$113","v":"Risks of uncontrolled movements"},"","http://www.maschinenrichtlinie.de/maschinenrichtlinie/neue-mrl-2006-42-eg/sicherheits-anforderungen/fuer-alle-maschinen/unkontrollierte-bewegungen/"]
["2006 / 42","1.4.",{"$f":"Language!A$114","v":"Required characteristics of guards and protective devices"},"x"]
["2006 / 42","1.4.1.",{"$f":"Language!A$115","v":"General requirements"},"","http://www.maschinenrichtlinie.de/maschinenrichtlinie/neue-mrl-2006-42-eg/sicherheits-anforderungen/fuer-alle-maschinen/anforder-schutzeinrichtungen/"]
["2006 / 42","1.4.2.",{"$f":"Language!A$116","v":"Special requirements for guards"},"x","http://www.maschinenrichtlinie.de/maschinenrichtlinie/neue-mrl-2006-42-eg/sicherheits-anforderungen/fuer-alle-maschinen/trennende-schutzeinrichtungen/"]
["2006 / 42","1.4.2.1.",{"$f":"Language!A$117","v":"Fixed guards"},"","http://www.maschinenrichtlinie.de/maschinenrichtlinie/neue-mrl-2006-42-eg/sicherheits-anforderungen/fuer-alle-maschinen/feste-schutzeinrichtungen/"]
["2006 / 42","1.4.2.2.",{"$f":"Language!A$118","v":"Interlocking movable guards"},"","http://www.maschinenrichtlinie.de/maschinenrichtlinie/neue-mrl-2006-42-eg/sicherheits-anforderungen/fuer-alle-maschinen/schutzeinrichtung-verriegelung/"]
["2006 / 42","1.4.2.3.",{"$f":"Language!A$119","v":"Adjustable guards restricting access"},"","http://www.maschinenrichtlinie.de/maschinenrichtlinie/neue-mrl-2006-42-eg/sicherheits-anforderungen/fuer-alle-maschinen/verstellbare-schutzeinrichtung/"]
["2006 / 42","1.4.3.",{"$f":"Language!A$120","v":"Special requirements for protective devices"},"","http://www.maschinenrichtlinie.de/maschinenrichtlinie/neue-mrl-2006-42-eg/sicherheits-anforderungen/fuer-alle-maschinen/nichttrennen-schutzeinrichtung/"]
["2006 / 42","1.5.",{"$f":"Language!A$121","v":"Risks due to other hazards"},"x"]
["2006 / 42","1.5.01.",{"$f":"Language!A$122","v":"Electricity supply"},"","http://www.maschinenrichtlinie.de/maschinenrichtlinie/neue-mrl-2006-42-eg/sicherheits-anforderungen/fuer-alle-maschinen/elektrische-energieversorgung/"]
["2006 / 42","1.5.02.",{"$f":"Language!A$123","v":"Static electricity"},"","http://www.maschinenrichtlinie.de/maschinenrichtlinie/neue-mrl-2006-42-eg/sicherheits-anforderungen/fuer-alle-maschinen/statische-elektrizit/"]
["2006 / 42","1.5.03.",{"$f":"Language!A$124","v":"Energy supply other than electricity"},"","http://www.maschinenrichtlinie.de/maschinenrichtlinie/neue-mrl-2006-42-eg/sicherheits-anforderungen/fuer-alle-maschinen/nichtelektrische-energie/"]
["2006 / 42","1.5.04.",{"$f":"Language!A$125","v":"Errors of fitting"},"","http://www.maschinenrichtlinie.de/maschinenrichtlinie/neue-mrl-2006-42-eg/sicherheits-anforderungen/fuer-alle-maschinen/montagefehler/"]
["2006 / 42","1.5.05.",{"$f":"Language!A$126","v":"Extreme temperatures"},"","http://www.maschinenrichtlinie.de/maschinenrichtlinie/neue-mrl-2006-42-eg/sicherheits-anforderungen/fuer-alle-maschinen/extreme-temperaturen/"]
["2006 / 42","1.5.06.",{"$f":"Language!A$127","v":"Fire"},"","http://www.maschinenrichtlinie.de/maschinenrichtlinie/neue-mrl-2006-42-eg/sicherheits-anforderungen/fuer-alle-maschinen/brand/"]
["2006 / 42","1.5.07.",{"$f":"Language!A$128","v":"Explosion"},"","http://www.maschinenrichtlinie.de/maschinenrichtlinie/neue-mrl-2006-42-eg/sicherheits-anforderungen/fuer-alle-maschinen/explosion/"]
["2006 / 42","1.5.08.",{"$f":"Language!A$129","v":"Noise"},"","http://www.maschinenrichtlinie.de/maschinenrichtlinie/neue-mrl-2006-42-eg/sicherheits-anforderungen/fuer-alle-maschinen/laerm/"]
["2006 / 42","1.5.09.",{"$f":"Language!A$130","v":"Vibrations"},"","http://www.maschinenrichtlinie.de/maschinenrichtlinie/neue-mrl-2006-42-eg/sicherheits-anforderungen/fuer-alle-maschinen/vibrationen/"]
["2006 / 42","1.5.10.",{"$f":"Language!A$131","v":"Radiation"},"","http://www.maschinenrichtlinie.de/maschinenrichtlinie/neue-mrl-2006-42-eg/sicherheits-anforderungen/fuer-alle-maschinen/strahlung/"]
["2006 / 42","1.5.11.",{"$f":"Language!A$132","v":"External radiation"},"","http://www.maschinenrichtlinie.de/maschinenrichtlinie/neue-mrl-2006-42-eg/sicherheits-anforderungen/fuer-alle-maschinen/strahlung-von-aussen/"]
["2006 / 42","1.5.12.",{"$f":"Language!A$133","v":"Laser radiation"},"","http://www.maschinenrichtlinie.de/maschinenrichtlinie/neue-mrl-2006-42-eg/sicherheits-anforderungen/fuer-alle-maschinen/laserstrahlung/"]
["2006 / 42","1.5.13.",{"$f":"Language!A$134","v":"Emissions of hazardous materials and substances"},"","http://www.maschinenrichtlinie.de/maschinenrichtlinie/neue-mrl-2006-42-eg/sicherheits-anforderungen/fuer-alle-maschinen/emissionen/"]
["2006 / 42","1.5.14.",{"$f":"Language!A$135","v":"Risk of being trapped in a machine"},"","http://www.maschinenrichtlinie.de/maschinenrichtlinie/neue-mrl-2006-42-eg/sicherheits-anforderungen/fuer-alle-maschinen/eingeschlossen-werden/"]
["2006 / 42","1.5.15.",{"$f":"Language!A$136","v":"Risk of slipping, tripping or falling"},"","http://www.maschinenrichtlinie.de/maschinenrichtlinie/neue-mrl-2006-42-eg/sicherheits-anforderungen/fuer-alle-maschinen/ausrutschen-stolpern-sturz/"]
["2006 / 42","1.5.16.",{"$f":"Language!A$137","v":"Lightning"},"","http://www.maschinenrichtlinie.de/maschinenrichtlinie/neue-mrl-2006-42-eg/sicherheits-anforderungen/fuer-alle-maschinen/blitzschlag/"]
["2006 / 42","1.6.",{"$f":"Language!A$138","v":"Maintenance"},"x"]
["2006 / 42","1.6.1.",{"$f":"Language!A$139","v":"Machinery maintenance"},"","http://www.maschinenrichtlinie.de/maschinenrichtlinie/neue-mrl-2006-42-eg/sicherheits-anforderungen/fuer-alle-maschinen/wartung-der-maschine/"]
["2006 / 42","1.6.2.",{"$f":"Language!A$140","v":"Access to operating positions and servicing points"},"","http://www.maschinenrichtlinie.de/maschinenrichtlinie/neue-mrl-2006-42-eg/sicherheits-anforderungen/fuer-alle-maschinen/zugang-bedienung-wartung/"]
["2006 / 42","1.6.3.",{"$f":"Language!A$141","v":"Isolation of energy sources"},"","http://www.maschinenrichtlinie.de/maschinenrichtlinie/neue-mrl-2006-42-eg/sicherheits-anforderungen/fuer-alle-maschinen/trennung-von-energiequellen/"]
["2006 / 42","1.6.4.",{"$f":"Language!A$142","v":"Operator intervention"},"","http://www.maschinenrichtlinie.de/maschinenrichtlinie/neue-mrl-2006-42-eg/sicherheits-anforderungen/fuer-alle-maschinen/eingriffe-bedienungspersonal/"]
["2006 / 42","1.6.5.",{"$f":"Language!A$143","v":"Cleaning of internal parts"},"","http://www.maschinenrichtlinie.de/maschinenrichtlinie/neue-mrl-2006-42-eg/sicherheits-anforderungen/fuer-alle-maschinen/reinigung-maschinenteile/"]
["2006 / 42","1.7.",{"$f":"Language!A$144","v":"Information"},"x","http://www.maschinenrichtlinie.de/maschinenrichtlinie/neue-mrl-2006-42-eg/sicherheits-anforderungen/fuer-alle-maschinen/17-informationen/"]
["2006 / 42","1.7.1.",{"$f":"Language!A$145","v":"Information and warnings on the machinery"},"","http://www.maschinenrichtlinie.de/maschinenrichtlinie/neue-mrl-2006-42-eg/sicherheits-anforderungen/fuer-alle-maschinen/informationen-und-warnhinweise/"]
["2006 / 42","1.7.1.1.",{"$f":"Language!A$146","v":"Information and information devices"},"","http://www.maschinenrichtlinie.de/maschinenrichtlinie/neue-mrl-2006-42-eg/sicherheits-anforderungen/fuer-alle-maschinen/informationen-einrichtungen/"]
["2006 / 42","1.7.1.2.",{"$f":"Language!A$147","v":"Warning devices"},"","http://www.maschinenrichtlinie.de/maschinenrichtlinie/neue-mrl-2006-42-eg/sicherheits-anforderungen/fuer-alle-maschinen/warneinrichtungen/"]
["2006 / 42","1.7.2.",{"$f":"Language!A$148","v":"Warning of residual risks"},"","http://www.maschinenrichtlinie.de/maschinenrichtlinie/neue-mrl-2006-42-eg/sicherheits-anforderungen/fuer-alle-maschinen/warnung-vor-restrisiken/"]
["2006 / 42","1.7.3.",{"$f":"Language!A$149","v":"Marking of machinery"},"","http://www.maschinenrichtlinie.de/maschinenrichtlinie/neue-mrl-2006-42-eg/sicherheits-anforderungen/fuer-alle-maschinen/kennzeichnung-der-maschinen/"]
["2006 / 42","1.7.4.",{"$f":"Language!A$150","v":"Instructions"},"","http://www.maschinenrichtlinie.de/maschinenrichtlinie/neue-mrl-2006-42-eg/sicherheits-anforderungen/fuer-alle-maschinen/betriebsanleitung/"]
["2006 / 42","1.7.4.1.",{"$f":"Language!A$151","v":"General principles for the drafting of instructions"},"","http://www.maschinenrichtlinie.de/maschinenrichtlinie/neue-mrl-2006-42-eg/sicherheits-anforderungen/fuer-alle-maschinen/abfassung-betriebsanleitung.html"]
["2006 / 42","1.7.4.2.",{"$f":"Language!A$152","v":"Contents of the instructions"},"","http://www.maschinenrichtlinie.de/maschinenrichtlinie/neue-mrl-2006-42-eg/sicherheits-anforderungen/fuer-alle-maschinen/inhalt-betriebsanleitung.html"]
["2006 / 42","1.7.4.3.",{"$f":"Language!A$153","v":"Sales literature"},"","http://www.maschinenrichtlinie.de/maschinenrichtlinie/neue-mrl-2006-42-eg/sicherheits-anforderungen/fuer-alle-maschinen/verkaufsprospekte.html"]
["2006 / 42","2.",{"$f":"Language!A$154","v":"Supplementary essential health and safety requirements for certain categories of machinery"},"x"]
["2006 / 42","2.1.",{"$f":"Language!A$155","v":"Foodstuffs machinery and machinery for cosmetics or pharmaceutical products"},"x","http://www.maschinenrichtlinie.de/maschinenrichtlinie/neue-mrl-2006-42-eg/sicherheits-anforderungen/nahrungsmittelmaschinen/"]
["2006 / 42","2.1.1.",{"$f":"Language!A$156","v":"General"},"","http://www.maschinenrichtlinie.de/maschinenrichtlinie/neue-mrl-2006-42-eg/sicherheits-anforderungen/nahrungsmittelmaschinen/nahrungsmittelmaschinen-allgem/"]
["2006 / 42","2.1.2.",{"$f":"Language!A$157","v":"Instructions"},"","http://www.maschinenrichtlinie.de/maschinenrichtlinie/neue-mrl-2006-42-eg/sicherheits-anforderungen/nahrungsmittelmaschinen/betriebsanleitung-nahrungsmitt/"]
["2006 / 42","2.2.",{"$f":"Language!A$158","v":"Portable hand-held and/or hand-guided machinery"},"x","http://www.maschinenrichtlinie.de/maschinenrichtlinie/neue-mrl-2006-42-eg/sicherheits-anforderungen/handgehaltene-maschinen/"]
["2006 / 42","2.2.1.",{"$f":"Language!A$159","v":"General"},"","http://www.maschinenrichtlinie.de/maschinenrichtlinie/neue-mrl-2006-42-eg/sicherheits-anforderungen/handgehaltene-maschinen/hand-gehaltene-maschinen-allge/"]
["2006 / 42","2.2.1.1.",{"$f":"Language!A$160","v":"Instructions"},"","http://www.maschinenrichtlinie.de/maschinenrichtlinie/neue-mrl-2006-42-eg/sicherheits-anforderungen/handgehaltene-maschinen/betriebsanleitung-hand-maschin/"]
["2006 / 42","2.2.2.",{"$f":"Language!A$161","v":"Portable fixing and other impact machinery"},"x","http://www.maschinenrichtlinie.de/maschinenrichtlinie/neue-mrl-2006-42-eg/sicherheits-anforderungen/schussgeraete/"]
["2006 / 42","2.2.2.1.",{"$f":"Language!A$162","v":"General"},"","http://www.maschinenrichtlinie.de/maschinenrichtlinie/neue-mrl-2006-42-eg/sicherheits-anforderungen/schussgeraete/schussgeraete-allgemeines/"]
["2006 / 42","2.2.2.2.",{"$f":"Language!A$163","v":"Instructions"},"","http://www.maschinenrichtlinie.de/maschinenrichtlinie/neue-mrl-2006-42-eg/sicherheits-anforderungen/schussgeraete/betriebsanleitung-schussgeraet/"]
["2006 / 42","2.3.",{"$f":"Language!A$164","v":"Machinery for working wood and material with similar physical characteristics"},"","http://www.maschinenrichtlinie.de/maschinenrichtlinie/neue-mrl-2006-42-eg/sicherheits-anforderungen/holzbearbeitungsmaschinen/holzbearbeitungsmaschinen/"]
["2006 / 42","2.4.",{"$f":"Language!A$165","v":"Machinery for pesticide application"},"x","http://www.maschinenrichtlinie.de/maschinenrichtlinie/neue-mrl-2006-42-eg/sicherheits-anforderungen/pestizidausbringungsmaschinen/241-begriffsbestimmung/"]
["2006 / 42","2.4.01.",{"$f":"Language!A$166","v":"Definitions"},"","http://www.maschinenrichtlinie.de/maschinenrichtlinie/neue-mrl-2006-42-eg/sicherheits-anforderungen/pestizidausbringungsmaschinen/241-begriffsbestimmung/"]
["2006 / 42","2.4.02.",{"$f":"Language!A$167","v":"General"},"","http://www.maschinenrichtlinie.de/maschinenrichtlinie/neue-mrl-2006-42-eg/sicherheits-anforderungen/pestizidausbringungsmaschinen/242-allgemeines/"]
["2006 / 42","2.4.03.",{"$f":"Language!A$168","v":"Controls and monitoring"},"","http://www.maschinenrichtlinie.de/maschinenrichtlinie/neue-mrl-2006-42-eg/sicherheits-anforderungen/pestizidausbringungsmaschinen/243-bedienung-und-ueberwachung/"]
["2006 / 42","2.4.04.",{"$f":"Language!A$169","v":"Filling and emptying"},"","http://www.maschinenrichtlinie.de/maschinenrichtlinie/neue-mrl-2006-42-eg/sicherheits-anforderungen/pestizidausbringungsmaschinen/244-fuellung-und-entleerung/"]
["2006 / 42","2.4.05.",{"$f":"Language!A$170","v":"Application of pesticides"},"x","http://www.maschinenrichtlinie.de/maschinenrichtlinie/neue-mrl-2006-42-eg/sicherheits-anforderungen/pestizidausbringungsmaschinen/245-ausbringung-von-pestiziden/"]
["2006 / 42","2.4.05.1.",{"$f":"Language!A$171","v":"Application rate"},"","http://www.maschinenrichtlinie.de/maschinenrichtlinie/neue-mrl-2006-42-eg/sicherheits-anforderungen/pestizidausbringungsmaschinen/245-ausbringung-von-pestiziden/2451-ausbringungsrate/"]
["2006 / 42","2.4.05.2.",{"$f":"Language!A$172","v":"Distribution, deposition and drift of pesticide"},"","http://www.maschinenrichtlinie.de/maschinenrichtlinie/neue-mrl-2006-42-eg/sicherheits-anforderungen/pestizidausbringungsmaschinen/245-ausbringung-von-pestiziden/2452-verteilung-anlagerung-und-abdrift-von-pestiziden/"]
["2006 / 42","2.4.05.3.",{"$f":"Language!A$173","v":"Tests"},"","http://www.maschinenrichtlinie.de/maschinenrichtlinie/neue-mrl-2006-42-eg/sicherheits-anforderungen/pestizidausbringungsmaschinen/245-ausbringung-von-pestiziden/2453-pruefungen/"]
["2006 / 42","2.4.05.4.",{"$f":"Language!A$174","v":"Losses during stoppage"},"","http://www.maschinenrichtlinie.de/maschinenrichtlinie/neue-mrl-2006-42-eg/sicherheits-anforderungen/pestizidausbringungsmaschinen/245-ausbringung-von-pestiziden/2454-unbeabsichtigte-freisetzungen/"]
["2006 / 42","2.4.06.",{"$f":"Language!A$175","v":"Maintenance"},"x","http://www.maschinenrichtlinie.de/maschinenrichtlinie/neue-mrl-2006-42-eg/sicherheits-anforderungen/pestizidausbringungsmaschinen/246-wartung/"]
["2006 / 42","2.4.06.1.",{"$f":"Language!A$176","v":"Cleaning"},"","http://www.maschinenrichtlinie.de/maschinenrichtlinie/neue-mrl-2006-42-eg/sicherheits-anforderungen/pestizidausbringungsmaschinen/246-wartung/2461-reinigung/"]
["2006 / 42","2.4.06.2.",{"$f":"Language!A$177","v":"Servicing"},"","http://www.maschinenrichtlinie.de/maschinenrichtlinie/neue-mrl-2006-42-eg/sicherheits-anforderungen/pestizidausbringungsmaschinen/246-wartung/2462-instandhaltung/"]
["2006 / 42","2.4.07.",{"$f":"Language!A$178","v":"Inspections"},"","http://www.maschinenrichtlinie.de/maschinenrichtlinie/neue-mrl-2006-42-eg/sicherheits-anforderungen/pestizidausbringungsmaschinen/247-kontrollen/"]
["2006 / 42","2.4.08.",{"$f":"Language!A$179","v":"Marking of nozzles, strainers and filters"},"","http://www.maschinenrichtlinie.de/maschinenrichtlinie/neue-mrl-2006-42-eg/sicherheits-anforderungen/pestizidausbringungsmaschinen/248-kennzeichnung/"]
["2006 / 42","2.4.09.",{"$f":"Language!A$180","v":"Indication of pesticide in use"},"","http://www.maschinenrichtlinie.de/maschinenrichtlinie/neue-mrl-2006-42-eg/sicherheits-anforderungen/pestizidausbringungsmaschinen/249-angabe-pestizid/"]
["2006 / 42","2.4.10.",{"$f":"Language!A$181","v":"Instructions"},"","http://www.maschinenrichtlinie.de/maschinenrichtlinie/neue-mrl-2006-42-eg/sicherheits-anforderungen/pestizidausbringungsmaschinen/2410-betriebsanleitung/"]
["2006 / 42","3.",{"$f":"Language!A$182","v":"Supplementary essential health and safety requirements to offset hazards due to the mobility of machinery"},"x","http://www.maschinenrichtlinie.de/maschinenrichtlinie/neue-mrl-2006-42-eg/sicherheits-anforderungen/bewegliche-maschinen/"]
["2006 / 42","3.1.",{"$f":"Language!A$183","v":"General"},"x"]
["2006 / 42","3.1.1.",{"$f":"Language!A$184","v":"Definitions"},"","http://www.maschinenrichtlinie.de/maschinenrichtlinie/neue-mrl-2006-42-eg/sicherheits-anforderungen/bewegliche-maschinen/begriffsbestimmungen-beweglich/"]
["2006 / 42","3.2.",{"$f":"Language!A$185","v":"Work positions"},"x","http://www.maschinenrichtlinie.de/maschinenrichtlinie/neue-mrl-2006-42-eg/sicherheits-anforderungen/bewegliche-maschinen/bedienerplaetze/"]
["2006 / 42","3.2.1.",{"$f":"Language!A$186","v":"Driving position"},"","http://www.maschinenrichtlinie.de/maschinenrichtlinie/neue-mrl-2006-42-eg/sicherheits-anforderungen/bewegliche-maschinen/fahrerplatz-bewegliche-maschin/"]
["2006 / 42","3.2.2.",{"$f":"Language!A$187","v":"Seating"},"","http://www.maschinenrichtlinie.de/maschinenrichtlinie/neue-mrl-2006-42-eg/sicherheits-anforderungen/bewegliche-maschinen/sitze-bewegliche-maschinen/"]
["2006 / 42","3.2.3.",{"$f":"Language!A$188","v":"Positions for other persons"},"","http://www.maschinenrichtlinie.de/maschinenrichtlinie/neue-mrl-2006-42-eg/sicherheits-anforderungen/bewegliche-maschinen/plaetze-fuer-andere-personen/"]
["2006 / 42","3.3.",{"$f":"Language!A$189","v":"Control systems"},"x","http://www.maschinenrichtlinie.de/maschinenrichtlinie/neue-mrl-2006-42-eg/sicherheits-anforderungen/bewegliche-maschinen/steuerung-bewegliche-maschinen/"]
["2006 / 42","3.3.1.",{"$f":"Language!A$190","v":"Control devices"},"","http://www.maschinenrichtlinie.de/maschinenrichtlinie/neue-mrl-2006-42-eg/sicherheits-anforderungen/bewegliche-maschinen/stellteile-bewegliche-maschine/"]
["2006 / 42","3.3.2.",{"$f":"Language!A$191","v":"Starting/moving"},"","http://www.maschinenrichtlinie.de/maschinenrichtlinie/neue-mrl-2006-42-eg/sicherheits-anforderungen/bewegliche-maschinen/ingangsetzen-verfahren-bewegli/"]
["2006 / 42","3.3.3.",{"$f":"Language!A$192","v":"Travelling function"},"","http://www.maschinenrichtlinie.de/maschinenrichtlinie/neue-mrl-2006-42-eg/sicherheits-anforderungen/bewegliche-maschinen/stillsetzen-bremsen-bewegliche/"]
["2006 / 42","3.3.4.",{"$f":"Language!A$193","v":"Movement of pedestrian-controlled machinery"},"","http://www.maschinenrichtlinie.de/maschinenrichtlinie/neue-mrl-2006-42-eg/sicherheits-anforderungen/bewegliche-maschinen/mitgaengergefuehrte-maschinen/"]
["2006 / 42","3.3.5.",{"$f":"Language!A$194","v":"Control circuit failure"},"","http://www.maschinenrichtlinie.de/maschinenrichtlinie/neue-mrl-2006-42-eg/sicherheits-anforderungen/bewegliche-maschinen/stoerung-des-steuerkreises/"]
["2006 / 42","3.4.",{"$f":"Language!A$195","v":"Protection against mechanical hazards"},"x","http://www.maschinenrichtlinie.de/maschinenrichtlinie/anhang-i-sicherheitsanforderungen/bewegliche-maschinen/mechanische-gefaehrdungen/"]
["2006 / 42","3.4.1.",{"$f":"Language!A$196","v":"Uncontrolled movements"},"","http://www.maschinenrichtlinie.de/maschinenrichtlinie/neue-mrl-2006-42-eg/sicherheits-anforderungen/bewegliche-maschinen/unkontrollierte-bewegungen/"]
["2006 / 42","3.4.2.",{"$f":"Language!A$197","v":"Moving transmission parts"},"","http://www.maschinenrichtlinie.de/maschinenrichtlinie/neue-mrl-2006-42-eg/sicherheits-anforderungen/bewegliche-maschinen/beweglich-uebertragungselement/"]
["2006 / 42","3.4.3.",{"$f":"Language!A$198","v":"Roll-over and tip-over"},"","http://www.maschinenrichtlinie.de/maschinenrichtlinie/neue-mrl-2006-42-eg/sicherheits-anforderungen/bewegliche-maschinen/ueberrollen-und-umkippen/"]
["2006 / 42","3.4.4.",{"$f":"Language!A$199","v":"Falling objects"},"","http://www.maschinenrichtlinie.de/maschinenrichtlinie/neue-mrl-2006-42-eg/sicherheits-anforderungen/bewegliche-maschinen/herabfallende-gegenstaende/"]
["2006 / 42","3.4.5.",{"$f":"Language!A$200","v":"Means of access"},"","http://www.maschinenrichtlinie.de/maschinenrichtlinie/neue-mrl-2006-42-eg/sicherheits-anforderungen/bewegliche-maschinen/zugaenge/"]
["2006 / 42","3.4.6.",{"$f":"Language!A$201","v":"Towing devices"},"","http://www.maschinenrichtlinie.de/maschinenrichtlinie/neue-mrl-2006-42-eg/sicherheits-anforderungen/bewegliche-maschinen/anhaengevorrichtungen/"]
["2006 / 42","3.4.7.",{"$f":"Language!A$202","v":"Transmission of power between self-propelled machinery (or tractor) and recipient machinery"},"","http://www.maschinenrichtlinie.de/maschinenrichtlinie/neue-mrl-2006-42-eg/sicherheits-anforderungen/bewegliche-maschinen/kraftuebertragung/"]
["2006 / 42","3.5.",{"$f":"Language!A$203","v":"Protection against other hazards"},"x"]
["2006 / 42","3.5.1.",{"$f":"Language!A$204","v":"Batteries"},"","http://www.maschinenrichtlinie.de/maschinenrichtlinie/neue-mrl-2006-42-eg/sicherheits-anforderungen/bewegliche-maschinen/batterien/"]
["2006 / 42","3.5.2.",{"$f":"Language!A$205","v":"Fire"},"","http://www.maschinenrichtlinie.de/maschinenrichtlinie/neue-mrl-2006-42-eg/sicherheits-anforderungen/bewegliche-maschinen/brand-bewegliche-maschinen/"]
["2006 / 42","3.5.3.",{"$f":"Language!A$206","v":"Emissions of hazardous substances"},"","http://www.maschinenrichtlinie.de/maschinenrichtlinie/neue-mrl-2006-42-eg/sicherheits-anforderungen/bewegliche-maschinen/emission-gefaehrliche-stoffe/"]
["2006 / 42","3.6.",{"$f":"Language!A$207","v":"Information and indications"},"x","http://www.maschinenrichtlinie.de/maschinenrichtlinie/neue-mrl-2006-42-eg/sicherheits-anforderungen/bewegliche-maschinen/informationen-angaben/"]
["2006 / 42","3.6.1.",{"$f":"Language!A$208","v":"Signs, signals and warnings"},"","http://www.maschinenrichtlinie.de/maschinenrichtlinie/neue-mrl-2006-42-eg/sicherheits-anforderungen/bewegliche-maschinen/zeichen-signaleinrichtungen/"]
["2006 / 42","3.6.2.",{"$f":"Language!A$209","v":"Marking"},"","http://www.maschinenrichtlinie.de/maschinenrichtlinie/neue-mrl-2006-42-eg/sicherheits-anforderungen/bewegliche-maschinen/kennzeichnung-bewegliche-masch/"]
["2006 / 42","3.6.3.",{"$f":"Language!A$210","v":"Instructions"},"x"]
["2006 / 42","3.6.3.1.",{"$f":"Language!A$211","v":"Vibrations"},"","http://www.maschinenrichtlinie.de/maschinenrichtlinie/neue-mrl-2006-42-eg/sicherheits-anforderungen/bewegliche-maschinen/vibrationen-betriebsanleitung/"]
["2006 / 42","3.6.3.2.",{"$f":"Language!A$212","v":"Multiple uses"},"","http://www.maschinenrichtlinie.de/maschinenrichtlinie/neue-mrl-2006-42-eg/sicherheits-anforderungen/bewegliche-maschinen/verwendungsmoeglichkeiten/"]
["2006 / 42","4.",{"$f":"Language!A$213","v":"Supplementary essential health and safety requirements to offset hazards due to lifting operations"},"x","http://www.maschinenrichtlinie.de/maschinenrichtlinie/neue-mrl-2006-42-eg/sicherheits-anforderungen/hebemaschinen/hebemaschinen/"]
["2006 / 42","4.1.",{"$f":"Language!A$214","v":"General"},"x"]
["2006 / 42","4.1.1.",{"$f":"Language!A$215","v":"Definitions"},"","http://www.maschinenrichtlinie.de/maschinenrichtlinie/neue-mrl-2006-42-eg/sicherheits-anforderungen/hebemaschinen/begriffsbestimmungen/"]
["2006 / 42","4.1.2.",{"$f":"Language!A$216","v":"Protection against mechanical hazards"},"x"]
["2006 / 42","4.1.2.1.",{"$f":"Language!A$217","v":"Risks due to lack of stability"},"","http://www.maschinenrichtlinie.de/maschinenrichtlinie/neue-mrl-2006-42-eg/sicherheits-anforderungen/hebemaschinen/mangelnde-standsicherheit/"]
["2006 / 42","4.1.2.2.",{"$f":"Language!A$218","v":"Machinery running on guide rails and rail tracks"},"","http://www.maschinenrichtlinie.de/maschinenrichtlinie/neue-mrl-2006-42-eg/sicherheits-anforderungen/hebemaschinen/fuehrungen-laufbahnen/"]
["2006 / 42","4.1.2.3.",{"$f":"Language!A$219","v":"Mechanical strength"},"","http://www.maschinenrichtlinie.de/maschinenrichtlinie/neue-mrl-2006-42-eg/sicherheits-anforderungen/hebemaschinen/festigkeit/"]
["2006 / 42","4.1.2.4.",{"$f":"Language!A$220","v":"Pulleys, drums, wheels, ropes and chains"},"","http://www.maschinenrichtlinie.de/maschinenrichtlinie/neue-mrl-2006-42-eg/sicherheits-anforderungen/hebemaschinen/rollen-trommeln-scheiben-seile/"]
["2006 / 42","4.1.2.5.",{"$f":"Language!A$221","v":"Lifting accessories and their components"},"","http://www.maschinenrichtlinie.de/maschinenrichtlinie/neue-mrl-2006-42-eg/sicherheits-anforderungen/hebemaschinen/lastaufnahmemittel-bauteile/"]
["2006 / 42","4.1.2.6.",{"$f":"Language!A$222","v":"Control of movements"},"","http://www.maschinenrichtlinie.de/maschinenrichtlinie/neue-mrl-2006-42-eg/sicherheits-anforderungen/hebemaschinen/bewegungsbegrenzung/"]
["2006 / 42","4.1.2.7.",{"$f":"Language!A$223","v":"Movements of loads during handling"},"","http://www.maschinenrichtlinie.de/maschinenrichtlinie/neue-mrl-2006-42-eg/sicherheits-anforderungen/hebemaschinen/bewegungen-von-lasten/"]
["2006 / 42","4.1.2.8.",{"$f":"Language!A$224","v":"Machinery serving fixed landings"},"x","http://www.maschinenrichtlinie.de/maschinenrichtlinie/neue-mrl-2006-42-eg/sicherheits-anforderungen/hebemaschinen/feste-ladestellen-anfahren/"]
["2006 / 42","4.1.2.8.1.",{"$f":"Language!A$225","v":"Movements of the carrier"},"","http://www.maschinenrichtlinie.de/maschinenrichtlinie/neue-mrl-2006-42-eg/sicherheits-anforderungen/hebemaschinen/bewegungen-des-lasttraegers/"]
["2006 / 42","4.1.2.8.2.",{"$f":"Language!A$226","v":"Access to the carrier"},"","http://www.maschinenrichtlinie.de/maschinenrichtlinie/neue-mrl-2006-42-eg/sicherheits-anforderungen/hebemaschinen/zugang-zum-lasttraeger/"]
["2006 / 42","4.1.2.8.3.",{"$f":"Language!A$227","v":"Risks due to contact with the moving carrier"},"","http://www.maschinenrichtlinie.de/maschinenrichtlinie/neue-mrl-2006-42-eg/sicherheits-anforderungen/hebemaschinen/kontakt-mit-lasttraeger/"]
["2006 / 42","4.1.2.8.4.",{"$f":"Language!A$228","v":"Risk due to the load falling off the carrier"},"","http://www.maschinenrichtlinie.de/maschinenrichtlinie/neue-mrl-2006-42-eg/sicherheits-anforderungen/hebemaschinen/herabstuerzende-lasten/"]
["2006 / 42","4.1.2.8.5.",{"$f":"Language!A$229","v":"Landings"},"","http://www.maschinenrichtlinie.de/maschinenrichtlinie/neue-mrl-2006-42-eg/sicherheits-anforderungen/hebemaschinen/ladestellen/"]
["2006 / 42","4.1.3.",{"$f":"Language!A$230","v":"Fitness for purpose"},"","http://www.maschinenrichtlinie.de/maschinenrichtlinie/neue-mrl-2006-42-eg/sicherheits-anforderungen/hebemaschinen/zwecktauglichkeit/"]
["2006 / 42","4.2.",{"$f":"Language!A$231","v":"Requirements for machinery whose power source is other than manual effort"},"x"]
["2006 / 42","4.2.1.",{"$f":"Language!A$232","v":"Control of movements"},"","http://www.maschinenrichtlinie.de/maschinenrichtlinie/neue-mrl-2006-42-eg/sicherheits-anforderungen/hebemaschinen/bewegungssteuerung/"]
["2006 / 42","4.2.2.",{"$f":"Language!A$233","v":"Loading control"},"","http://www.maschinenrichtlinie.de/maschinenrichtlinie/neue-mrl-2006-42-eg/sicherheits-anforderungen/hebemaschinen/belastungsbegrenzung/"]
["2006 / 42","4.2.3.",{"$f":"Language!A$234","v":"Installations guided by ropes"},"","http://www.maschinenrichtlinie.de/maschinenrichtlinie/neue-mrl-2006-42-eg/sicherheits-anforderungen/hebemaschinen/seilgefuehrte-einrichtungen/"]
["2006 / 42","4.3.",{"$f":"Language!A$235","v":"Information and markings"},"x","http://www.maschinenrichtlinie.de/maschinenrichtlinie/neue-mrl-2006-42-eg/sicherheits-anforderungen/hebemaschinen/informationen-kennzeichnung/"]
["2006 / 42","4.3.1.",{"$f":"Language!A$236","v":"Chains, ropes and webbing"},"","http://www.maschinenrichtlinie.de/maschinenrichtlinie/neue-mrl-2006-42-eg/sicherheits-anforderungen/hebemaschinen/ketten-seile-gurte/"]
["2006 / 42","4.3.2.",{"$f":"Language!A$237","v":"Lifting accessories"},"","http://www.maschinenrichtlinie.de/maschinenrichtlinie/neue-mrl-2006-42-eg/sicherheits-anforderungen/hebemaschinen/lastaufnahmemittel/"]
["2006 / 42","4.3.3.",{"$f":"Language!A$238","v":"Lifting machinery"},"","http://www.maschinenrichtlinie.de/maschinenrichtlinie/neue-mrl-2006-42-eg/sicherheits-anforderungen/hebemaschinen/info-lastenheben/"]
["2006 / 42","4.4.",{"$f":"Language!A$239","v":"Instructions"},"x"]
["2006 / 42","4.4.1.",{"$f":"Language!A$240","v":"Lifting accessories"},"","http://www.maschinenrichtlinie.de/maschinenrichtlinie/neue-mrl-2006-42-eg/sicherheits-anforderungen/hebemaschinen/lastaufnahmemittel-betriebsanl/"]
["2006 / 42","4.4.2.",{"$f":"Language!A$241","v":"Lifting machinery"},"","http://www.maschinenrichtlinie.de/maschinenrichtlinie/neue-mrl-2006-42-eg/sicherheits-anforderungen/hebemaschinen/lastenheben-betriebsanleit/"]
["2006 / 42","5.",{"$f":"Language!A$242","v":"Supplementary essential health and safety requirements for machinery intended for underground work"},"x","http://www.maschinenrichtlinie.de/maschinenrichtlinie/neue-mrl-2006-42-eg/sicherheits-anforderungen/bergbaumaschinen/maschinen-einsatz-unter-tage/"]
["2006 / 42","5.1.",{"$f":"Language!A$243","v":"Risks due to lack of stability"},"","http://www.maschinenrichtlinie.de/maschinenrichtlinie/anhang-i-sicherheitsanforderungen/bergbaumaschinen/mangelnde-standsicherheit/"]
["2006 / 42","5.2.",{"$f":"Language!A$244","v":"Movement"},"","http://www.maschinenrichtlinie.de/maschinenrichtlinie/neue-mrl-2006-42-eg/sicherheits-anforderungen/bergbaumaschinen/bewegungsfreiheit/"]
["2006 / 42","5.3.",{"$f":"Language!A$245","v":"Control devices"},"","http://www.maschinenrichtlinie.de/maschinenrichtlinie/neue-mrl-2006-42-eg/sicherheits-anforderungen/bergbaumaschinen/stellteile/"]
["2006 / 42","5.4.",{"$f":"Language!A$246","v":"Stopping"},"","http://www.maschinenrichtlinie.de/maschinenrichtlinie/neue-mrl-2006-42-eg/sicherheits-anforderungen/bergbaumaschinen/anhalten-der-fahrbewegung/"]
["2006 / 42","5.5.",{"$f":"Language!A$247","v":"Fire"},"","http://www.maschinenrichtlinie.de/maschinenrichtlinie/neue-mrl-2006-42-eg/sicherheits-anforderungen/bergbaumaschinen/brand/"]
["2006 / 42","5.6.",{"$f":"Language!A$248","v":"Exhaust emissions"},"","http://www.maschinenrichtlinie.de/maschinenrichtlinie/neue-mrl-2006-42-eg/sicherheits-anforderungen/bergbaumaschinen/emission-von-abgasen/"]
["2006 / 42","6.",{"$f":"Language!A$249","v":"Supplementary essential health and safety requirements for machinery presenting particular hazards due to the lifting of persons"},"x","http://www.maschinenrichtlinie.de/maschinenrichtlinie/neue-mrl-2006-42-eg/sicherheits-anforderungen/personenheben/heben-von-personen/"]
["2006 / 42","6.1.",{"$f":"Language!A$250","v":"General"},"x"]
["2006 / 42","6.1.1.",{"$f":"Language!A$251","v":"Mechanical strength"},"","http://www.maschinenrichtlinie.de/maschinenrichtlinie/neue-mrl-2006-42-eg/sicherheits-anforderungen/personenheben/festigkeit/"]
["2006 / 42","6.1.2.",{"$f":"Language!A$252","v":"Loading control for machinery moved by power other than human strength"},"","http://www.maschinenrichtlinie.de/maschinenrichtlinie/neue-mrl-2006-42-eg/sicherheits-anforderungen/personenheben/belastungsbegrenzung/"]
["2006 / 42","6.2.",{"$f":"Language!A$253","v":"Control devices"},"","http://www.maschinenrichtlinie.de/maschinenrichtlinie/neue-mrl-2006-42-eg/sicherheits-anforderungen/personenheben/stellteile/"]
["2006 / 42","6.3.",{"$f":"Language!A$254","v":"Risks to persons in or on the carrier"},"x"]
["2006 / 42","6.3.1.",{"$f":"Language!A$255","v":"Risks due to movements of the carrier"},"","http://www.maschinenrichtlinie.de/maschinenrichtlinie/neue-mrl-2006-42-eg/sicherheits-anforderungen/personenheben/bewegung-des-lasttraegers/"]
["2006 / 42","6.3.2.",{"$f":"Language!A$256","v":"Risk of persons falling from the carrier"},"","http://www.maschinenrichtlinie.de/maschinenrichtlinie/neue-mrl-2006-42-eg/sicherheits-anforderungen/personenheben/sturz-aus-dem-lasttraeger/"]
["2006 / 42","6.3.3.",{"$f":"Language!A$257","v":"Risk due to objects falling on the carrier"},"","http://www.maschinenrichtlinie.de/maschinenrichtlinie/neue-mrl-2006-42-eg/sicherheits-anforderungen/personenheben/herabfallende-gegenstaende/"]
["2006 / 42","6.4.",{"$f":"Language!A$258","v":"Machinery serving fixed landings"},"x","http://www.maschinenrichtlinie.de/maschinenrichtlinie/neue-mrl-2006-42-eg/sicherheits-anforderungen/personenheben/feste-haltestellen/"]
["2006 / 42","6.4.1.",{"$f":"Language!A$259","v":"Risks to persons in or on the carrier"},"","http://www.maschinenrichtlinie.de/maschinenrichtlinie/neue-mrl-2006-42-eg/sicherheits-anforderungen/personenheben/personen-auf-dem-lasttraeger/"]
["2006 / 42","6.4.2.",{"$f":"Language!A$260","v":"Controls at landings"},"","http://www.maschinenrichtlinie.de/maschinenrichtlinie/neue-mrl-2006-42-eg/sicherheits-anforderungen/personenheben/befehlseinrichtung-haltestelle/"]
["2006 / 42","6.4.3.",{"$f":"Language!A$261","v":"Access to the carrier"},"","http://www.maschinenrichtlinie.de/maschinenrichtlinie/neue-mrl-2006-42-eg/sicherheits-anforderungen/personenheben/zugang-zum-lasttraeger/"]
["2006 / 42","6.5.",{"$f":"Language!A$262","v":"Markings"},"","http://www.maschinenrichtlinie.de/maschinenrichtlinie/neue-mrl-2006-42-eg/sicherheits-anforderungen/personenheben/kennzeichnung/"]

{"sheet":"Constants","index":9,"n_rows":11,"n_cols":9,"rows_kept":11,"cut":false,"hidden":true,"merged":[[0,4,0,8],[0,0,0,2]]}
["Constants",null,null,null,"Dropdown Lists"]
["Const_Name","Value","Description",null,"DD_RAColl_HazardExists","DD_RAColl_ContentAlreadyCovered","DD_RAColl_StandardType","DD_RAColl_FurtherReductionNecessary","DD_RAColl_HazardCovered"]
[null,null,null,null,"x","x","C","x","x"]
[null,null,null,null,"-","-","B2","-","-"]
[null,null,null,null,"?",null,"B1"]
[null,null,null,null,null,null,"B"]
[null,null,null,null,null,null,"A"]
[null,null,null,null,null,null,1]
[null,null,null,null,null,null,2]
[null,null,null,null,null,null,3]
[null,null,null,null,null,null,4]