{"text_format":"1","workbook":"xlsx","n_sheets":10,"sheets":["Projektdaten","Risikobeurteilung","Risikobeurteilung Log","B-Normen","EN ISO 12100","Sprache","Eigene Zellen","Version","EHSR","Constants"],"not_rendered":{"charts":0,"images":0,"macros":1,"external_links":0,"defined_names":341,"comments":3,"pivot_tables":0},"unopened":[],"bounds":{"document_bytes":16777216,"sheet_cells":100000,"rows_first":2000,"rows_last":500,"rows_between":2000,"halvings":0,"cell_chars":16384,"cell_head_chars":4096},"cells_cut":0,"cells_raw":0,"read":"whole","date_system":"1900"}

{"sheet":"Projektdaten","index":0,"n_rows":169,"n_cols":5,"rows_kept":169,"cut":false,"hidden":false,"merged":[[158,0,158,1],[77,0,78,0],[77,1,78,1],[77,2,78,2],[77,4,78,4],[150,1,150,4],[152,1,152,4],[154,1,154,4],[141,0,147,0],[107,0,117,0],[118,0,129,0],[79,0,84,0],[97,0,98,0],[85,0,96,0],[99,0,106,0],[24,0,25,0],[75,0,76,0],[75,1,76,1],[130,0,140,0],[66,0,67,0],[29,0,29,1],[28,0,28,1],[30,0,30,1],[37,0,37,1],[44,0,44,1],[65,2,65,4],[64,0,64,4],[38,0,38,1],[39,0,39,1],[65,0,65,1],[45,0,45,1],[46,0,46,1],[47,0,47,1],[48,0,48,1],[49,0,49,1],[50,0,50,1],[71,2,71,4],[97,1,98,1],[75,2,75,4],[76,2,76,4],[66,2,66,4],[67,2,67,4],[68,2,68,4],[69,2,69,4],[70,2,70,4]]}
[{"$f":"Sprache!A267","v":"Projektdaten"}]
[]
[{"$f":"Sprache!A441","v":"Hersteller:"}]
[{"$f":"Sprache!A442","v":"Anschrift des Herstellers:"}]
[{"$f":"Sprache!A443","v":"Version dieses Gesamtdokuments:"}]
[{"$f":"Sprache!A444","v":"Datum der letzten Änderung:"}]
[{"$f":"Sprache!A268","v":"Bezeichnung der Maschine:"}]
[{"$f":"Sprache!A269","v":"Maschinentyp:"}]
[{"$f":"Sprache!A270","v":"Seriennummer:"}]
[{"$f":"Sprache!A458","v":"Baujahr:"}]
[{"$f":"Sprache!A271","v":"allgemeine Beschreibung der Maschine:"}]
[{"$f":"Sprache!A272","v":"Konformitätsbewertungsverfahren:"},{"$f":"Sprache!$A$489","v":"bitte auswählen"}]
[{"$f":"Sprache!A273","v":"notifizierte Stelle:"}]
[]
[]
[{"$f":"Sprache!A274","v":"Projektleiter:"}]
[{"$f":"Sprache!A275","v":"Konstrukteur mechanisch:"}]
[{"$f":"Sprache!A276","v":"Konstrukteur elektrisch:"}]
[{"$f":"Sprache!A277","v":"Konstrukteur Steuerung:"}]
[{"$f":"Sprache!A278","v":"Konstrukteur Medien:"}]
[{"$f":"Sprache!A279","v":"Dokumentationsbevollmächtigter:"}]
[]
[{"$f":"Sprache!A282","v":"Bestimmungsgemäße Verwendung:"}]
[{"$f":"Sprache!A283","v":"Vernünftigerweise vorhersehbare Fehlanwendung (unter Berücksichtigung von Kundenrückmeldungen und bekannten Unfallgeschichten):"}]
[{"$f":"Sprache!A284","v":"Betriebsarten:"},{"$f":"Sprache!A285","v":"Beschreibung der verschiedenen Betriebsarten und Darstellung der ggf. unterschiedlichen Schutzmaßnahmen."}]
[]
[{"$f":"Sprache!A286","v":"Einsatzbereich:"},{"$f":"Sprache!$A$497","v":"bitte auswählen"}]
[]
[{"$f":"Sprache!A287","v":"Räumliche Grenzen "}]
[{"$f":"Sprache!A288","v":"Bewegungsraum, Platzbedarf von Personen, die mit der Maschine umgehen, z.B. während Betrieb und Instandhaltung"}]
[{"$f":"Sprache!A289","v":"Schnittstelle(n): Mensch / Energieversorgung - Mensch / Maschine"}]
[{"$f":"Sprache!A290","v":"Übersichtszeichnung inkl. Stückliste"}]
[{"$f":"Sprache!A292","v":"Lasten-/Pflichtenheft"}]
[{"$f":"Sprache!A293","v":"technische Leistungsbeschreibung "}]
[{"$f":"Sprache!A294","v":"Beschreibung zu Aufbau und Komponenten in der Betriebsanleitung Kap. xxx"}]
[{"$f":"Sprache!A295","v":"technische Daten in der Betriebsanleitung Kap. xxx"}]
[]
[{"$f":"Sprache!A296","v":"Zeitliche Grenzen "}]
[{"$f":"Sprache!A297","v":"Grenzen der Lebensdauer der Maschine / einzelner Bauteile, bei bestimmungsgemäßer Verwendung und vorhersehbarer Fehlanwendung"}]
[{"$f":"Sprache!A298","v":"Empfohlene Wartungsintervalle"}]
[{"$f":"Sprache!A300","v":"Lebensdauer der Maschine"}]
[{"$f":"Sprache!A301","v":"Lebensdauer der Verschleißteile (Liste)"}]
[{"$f":"Sprache!A302","v":"Empfohlene Wartungsintervalle (Liste)"}]
[]
[{"$f":"Sprache!A303","v":"Weitere Grenzen"}]
[{"$f":"Sprache!A304","v":"Eigenschaften der zu bearbeitenden Materialien"}]
[{"$f":"Sprache!A305","v":"erforderlicher Reinlichkeitsgrad"}]
[{"$f":"Sprache!A306","v":"Mindest- / Höchsttemperatur in der Umgebung / in der Maschine"}]
[{"$f":"Sprache!A307","v":"Betrieb im Innenraum / Freien bei trockener / nasser Witterung und bei direkter / indirekter Sonneneinstrahlung"}]
[{"$f":"Sprache!A308","v":"Staub / Nässeverträglich"}]
[{"$f":"Sprache!A309","v":"etc."}]
[{"$f":"Sprache!A310","v":"Materialien die verarbeitet werden (Liste mit Gefährdungen)"}]
[{"$f":"Sprache!A311","v":"erforderlicher Reinlichkeitsgrad"}]
[{"$f":"Sprache!A313","v":"Mindest- / Höchsttemperatur in der Umgebung"}]
[{"$f":"Sprache!A314","v":"Mindest- / Höchsttemperatur in der Maschine"}]
[{"$f":"Sprache!A316","v":"Betrieb im Innenraum / Freien "}]
[{"$f":"Sprache!A318","v":"bei trockener / nasser Witterung"}]
[{"$f":"Sprache!A319","v":"bei direkter / indirekter Sonneneinstrahlung"}]
[{"$f":"Sprache!A320","v":"Staub / Nässeverträglich"}]
[{"$f":"Sprache!A438","v":"Aggressive Umgebungsbedingungen"}]
[{"$f":"Sprache!A439","v":"etc."}]
[]
[]
[]
[{"$f":"Sprache!A322","v":"Unterlieferantenmatrix "}]
[{"$f":"Sprache!A323","v":"-       Lieferumfang der Hauptbaugruppen (z. B. Maschinenkomponenten, Mechanik, Elektrik, Hydraulik, Pneumatik)"},null,{"$f":"Sprache!A324","v":"Lieferant:"}]
[{"$f":"Sprache!A325","v":"Mechanik:"},{"$f":"Sprache!A326","v":"·        Stahlbau"}]
[null,{"$f":"Sprache!A327","v":"·        Ortsfeste Zugänge (Treppen, Leitern, Podeste)"}]
[{"$f":"Sprache!A328","v":"Elektrik:"},{"$f":"Sprache!A329","v":"·        Schaltschrank inkl. SPS "}]
[{"$f":"Sprache!A330","v":"Hydraulik:"},{"$f":"Sprache!A331","v":"·        Hydraulikaggregat, Zylinder, Ventile"}]
[{"$f":"Sprache!A332","v":"Pneumatik:"},{"$f":"Sprache!A333","v":"·        Zylinder, Ventile"}]
[{"$f":"Sprache!A334","v":"Medienanschlüsse:"},{"$f":"Sprache!A335","v":"·        Anschlüsse für Kühlwasser, Gase, etc."}]
[]
[]
[{"$f":"Sprache!A336","v":"Die folgende Tabelle basiert auf der EN ISO 12100:2010"}]
[{"$f":"Sprache!A337","v":"Lebensphasen"},{"$f":"Sprache!A338","v":"Aufgabenbeispiele des Bedienungspersonals"},{"$f":"Sprache!A339","v":"Erforderliche Qualifikation des "}]
[null,null,{"$f":"Sprache!A340","v":"Bedienungspersonals [i])"}]
[null,null,{"$f":"Sprache!A341","v":"Laie"},{"$f":"Sprache!A342","v":"Geschultes/ unterwiesenes "},{"$f":"Sprache!A344","v":"Fachkraft [iii])"}]
[null,null,null,{"$f":"Sprache!A343","v":"Personal [ii])"}]
[{"$f":"Sprache!A345","v":"1. Transport "},{"$f":"Sprache!A346","v":"-     Anheben;"}]
[null,{"$f":"Sprache!A347","v":"-     Beladen;"}]
[null,{"$f":"Sprache!A348","v":"-     Verpacken;"}]
[null,{"$f":"Sprache!A349","v":"-     Transportieren;"}]
[null,{"$f":"Sprache!A350","v":"-     Entladen;"}]
[null,{"$f":"Sprache!A351","v":"-     Auspacken der Maschine oder von Maschinenteilen"}]
[{"$f":"Sprache!A352","v":"2. Zusammenbau und Installation/ Inbetriebnahme "},{"$f":"Sprache!A353","v":"-     Einstellungen an der Maschine und deren Bauteilen; "}]
[null,{"$f":"Sprache!A354","v":"-     Zusammenbau der Maschine; "}]
[null,{"$f":"Sprache!A355","v":"-     Anschluss an die Entsorgungsanlage (z.B. Abluftsystem, Abwasseranlage); "}]
[null,{"$f":"Sprache!A356","v":"-     Anschluss an die Energieversorgung (z.B. Stromversorgung, Druckluft);"}]
[null,{"$f":"Sprache!A357","v":"-     Vorführung;"}]
[null,{"$f":"Sprache!A358","v":"-     Beschicken, Befüllen, Einbringen von Hilfsflüssigkeiten (z.B. Schmierstoff, Fett, Klebstoff); "}]
[null,{"$f":"Sprache!A359","v":"-     Anbringen von Schutzgittern; "}]
[null,{"$f":"Sprache!A360","v":"-     Befestigen, Verankern; "}]
[null,{"$f":"Sprache!A361","v":"-     Vorbereitungen für die Installation (z B. Fundamente, Schwingungsdämpfer);"}]
[null,{"$f":"Sprache!A362","v":"-     Betrieb der Maschine ohne Last; "}]
[null,{"$f":"Sprache!A363","v":"-     Prüfung;"}]
[null,{"$f":"Sprache!A364","v":"-     Versuche unter Last oder Höchstlast "}]
[{"$f":"Sprache!A365","v":"3. Verwendung"}]
[]
[{"$f":"Sprache!A366","v":"3a Einrichten/ Einlernen (Teachen)/ Programmieren und/oder Umrüsten"},{"$f":"Sprache!A367","v":"-     Einstellen und Einrichten von Schutzeinrichtungen und weiteren Bauteilen;"}]
[null,{"$f":"Sprache!A368","v":"-     Einstellen und Einrichten oder Überprüfen der funktionalen Parameter der Maschine (z.B. Geschwindigkeit, Druck, Kraft, Fahrbegrenzungen);"}]
[null,{"$f":"Sprache!A369","v":"-     Festklemmen/Befestigen des Werkstückes;"}]
[null,{"$f":"Sprache!A370","v":"-     Beschicken, Befüllen, Einbringen der Rohstoffe;"}]
[null,{"$f":"Sprache!A371","v":"-     Funktionsprüfungen, Versuche;"}]
[null,{"$f":"Sprache!A372","v":"-     Einsetzen oder Auswechseln von Werkzeugen, Werkzeugeinstellung;"}]
[null,{"$f":"Sprache!A373","v":"-     Überprüfen der Programmierung;"}]
[null,{"$f":"Sprache!A374","v":"-     Überprüfen des Endproduktes "}]
[{"$f":"Sprache!A375","v":"3b Betrieb"},{"$f":"Sprache!A376","v":"-     Festklemmen/Befestigen des Werkstückes;"}]
[null,{"$f":"Sprache!A377","v":"-     Steuerung/Inspektion;"}]
[null,{"$f":"Sprache!A378","v":"-     Antreiben der Maschine;"}]
[null,{"$f":"Sprache!A379","v":"-     Beschicken, Befüllen, Einbringen der Rohstoffe;"}]
[null,{"$f":"Sprache!A380","v":"-     manuelles Beladen/Entladen;"}]
[null,{"$f":"Sprache!A381","v":"-     geringfügige Einstellungs- und Einrichtvorgänge bei den Funktionsparametern der Maschine (z.B. Geschwindigkeit, Druck, Kraft, Fahrbegrenzungen);"}]
[null,{"$f":"Sprache!A382","v":"-     geringfügige Eingriffe während des Betriebs (z.B. Entnahme von Abfallprodukten, Beseitigen von Blockierungen, lokale Reinigung);"}]
[null,{"$f":"Sprache!A383","v":"-     Betreiben der manuellen Steuerungseinrichtungen;"}]
[null,{"$f":"Sprache!A384","v":"-    Neustarten der Maschine nach Stillsetzen/ Unterbrechung;"}]
[null,{"$f":"Sprache!A385","v":"-     Überwachen;"}]
[null,{"$f":"Sprache!A386","v":"-     Überprüfen des Endproduktes "}]
[{"$f":"Sprache!A387","v":"  3c Wartung/ Instandhaltung"},{"$f":"Sprache!A388","v":"-     Einstellungen;"}]
[null,{"$f":"Sprache!A389","v":"-     Reinigung, Desinfektion;"}]
[null,{"$f":"Sprache!A390","v":"-     Demontage/Ausbau von Teilen, Bauteilen,"}]
[null,{"$f":"Sprache!A391","v":"-     Einrichtungen der Maschine;"}]
[null,{"$f":"Sprache!A392","v":"-     „Housekeeping“;"}]
[null,{"$f":"Sprache!A393","v":"-     Energietrennung und -ableitung;"}]
[null,{"$f":"Sprache!A394","v":"-     Schmieren;"}]
[null,{"$f":"Sprache!A395","v":"-     Austausch von Werkzeugen;"}]
[null,{"$f":"Sprache!A396","v":"-     Austausch von Verschleißteilen;"}]
[null,{"$f":"Sprache!A397","v":"-     erneutes Einrichten;"}]
[null,{"$f":"Sprache!A398","v":"-     Nachfüllen von Betriebsflüssigkeiten;"}]
[null,{"$f":"Sprache!A399","v":"-     Überprüfen von Teilen, Bauteilen, Einrichtungen der Maschine "}]
[{"$f":"Sprache!A400","v":"  3d Fehlersuche und Fehlerbeseitigung"},{"$f":"Sprache!A401","v":"-     Einstellungen;"}]
[null,{"$f":"Sprache!A402","v":"-     Demontage/Ausbau von Teilen, Bauteilen, Einrichtungen der Maschine;"}]
[null,{"$f":"Sprache!A403","v":"-     Fehlersuche;"}]
[null,{"$f":"Sprache!A404","v":"-     Energietrennung und -ableitung;"}]
[null,{"$f":"Sprache!A405","v":"-     Wiederanlauf nach Ausfall der Steuerungseinrichtungen und Schutzeinrichtungen;"}]
[null,{"$f":"Sprache!A406","v":"-     Wiederanlauf nach Blockierung;"}]
[null,{"$f":"Sprache!A407","v":"-     Reparaturen;"}]
[null,{"$f":"Sprache!A408","v":"-     Ersatz von Teilen, Bauteilen, Einrichtungen der Maschine;"}]
[null,{"$f":"Sprache!A409","v":"-     Rettung gefangener Personen;"}]
[null,{"$f":"Sprache!A410","v":"-     erneutes Einrichten;"}]
[null,{"$f":"Sprache!A411","v":"-     Überprüfen von Teilen, Bauteilen, Einrichtungen der Maschine "}]
[{"$f":"Sprache!A412","v":"  4.  Außerbetriebnahme/ Demontage"},{"$f":"Sprache!A413","v":"-     Abtrennen von der Energieversorgung und Energieableitung;"}]
[null,{"$f":"Sprache!A414","v":"-     Demontage;"}]
[null,{"$f":"Sprache!A415","v":"-     Anheben;"}]
[null,{"$f":"Sprache!A416","v":"-     Beladen;"}]
[null,{"$f":"Sprache!A417","v":"-     Verpacken;"}]
[null,{"$f":"Sprache!A418","v":"-     Transportieren;"}]
[null,{"$f":"Sprache!A419","v":"-     Entladen "}]
[]
[]
["[i]) ",{"$f":"Sprache!A420","v":"Maschinenrichtlinie 2006/42/EG, Anhang I, Nr. 1.1.1 d: \"Bedienungspersonal\" die Person bzw. die Personen, die für Installation, Betrieb, Einrichten, Wartung, Reinigung, Reparatur oder Transport von Maschinen zuständig sind."}]
[]
["[ii]) ",{"$f":"Sprache!A421","v":"Analog DIN VDE 0105-100: Als geschulte/unterwiesene Person gilt eine Person, die über die ihr übertragenen Aufgaben und die möglichen Gefahren bei unsachgemäßem Verhalten unterrichtet und erforderlichenfalls angelernt wurde. Auch über die notwendigen Schutzeinrichtungen und Schutzmaßnahmen wurde sie belehrt. Zu schulendes, anzulernendes, einzuweisendes oder im Rahmen einer allgemeinen Ausbildung befindliches Personal darf nur unter ständiger Aufsicht einer erfahrenen Person tätig werden."}]
[]
["[iii]) ",{"$f":"Sprache!A422","v":"Analog DIN VDE 0105-100: Als Fachkraft wird eine Person bezeichnet, die auf Grund ihrer fachlichen Ausbildung, Kenntnisse und Erfahrungen die ihr übertragenen Arbeiten beurteilen und mögliche Gefahren erkennen kann. Weiterhin besitzt sie Kenntnis über die einschlägigen Bestimmungen."}]
[]
[]
[]
[{"$f":"Sprache!A423","v":"Normenliste"}]
[{"$f":"Sprache!A425","v":"Nummer"},{"$f":"Sprache!A426","v":"Titel"}]
[null," "]
[]
[]
[]
[]
[]
[]
[]
[null,""]

{"sheet":"Risikobeurteilung","index":1,"n_rows":185,"n_cols":54,"rows_kept":185,"cut":false,"hidden":false,"merged":[[2,3,3,3],[1,1,2,2],[1,20,3,20],[1,19,3,19],[1,18,3,18],[1,9,3,9],[1,6,3,6],[2,12,2,17],[2,11,3,11],[2,4,2,5],[2,10,3,10],[1,7,3,7],[1,8,3,8],[2,43,3,43],[2,40,3,40],[1,34,1,43],[2,29,2,33],[2,38,3,38],[2,37,3,37],[2,35,3,35],[2,36,3,36],[2,34,3,34],[2,41,3,41],[2,42,3,42],[2,39,3,39],[1,53,3,53],[1,50,3,50],[1,49,3,49],[1,52,3,52],[2,44,2,48],[1,44,1,48],[1,51,3,51],[1,21,1,28],[2,21,3,21],[2,28,3,28],[2,22,3,22],[2,23,3,23],[2,24,3,24],[2,25,3,25],[2,26,3,26],[2,27,3,27]]}
[]
[null,{"$f":"Sprache!A3","v":"Laufende Nummer der Gefährdung"},null,null,null,null,{"$f":"Sprache!A9","v":"Original (x=Zeile kann nicht gelöscht werden)"},{"$f":"Sprache!A535","v":"Ist leere Überschrift"},{"$f":"Sprache!A10","v":"Gefährdung vorhanden"},{"$f":"Sprache!A59","v":"Datum der letzten Änderung"},null,null,null,null,null,null,null,null,{"$f":"Sprache!A23","v":"Ort / Gefahrbereich / Position in Zeichnung"},{"$f":"Sprache!A531","v":"Gefährdungsereignis (Gefährdung / Gefährdungssituation)"},{"$f":"Sprache!A25","v":"Gefährdete Personen"},{"$f":"Sprache!A26","v":"Lebensphase (nach EN ISO 12100, Tabelle B.3)"},null,null,null,null,null,null,null,null,null,null,null,null,{"$f":"Sprache!A41","v":"Risikominimierung"},null,null,null,null,null,null,null,null,null,null,null,null,null,null,{"$f":"Sprache!A55","v":"Weitere Reduzierung notwendig?"},{"$f":"Sprache!A57","v":"Kommentar"},{"$f":"Sprache!A58","v":"Bearbeiter"},{"$f":"Sprache!A60","v":"Gefährdung ist behandelt?"},{"$f":"Sprache!A460","v":"Sprache der Zeile"}]
[null,null,null,{"$f":"Sprache!A534","v":"Richtlinie"},{"$f":"Sprache!A6","v":"grundlegende Sicherheits- und Gesundheitsschutzanforderungen"},null,null,null,null,null,{"$f":"Sprache!A12","v":"Inhalt bereits abgedeckt?"},{"$f":"Sprache!A14","v":"Norm-Typ"},{"$f":"Sprache!A16","v":"Gefährdungen nach (harmonisierter) Norm"},null,null,null,null,null,null,null,null,{"$f":"Sprache!A27","v":"Alle"},{"$f":"Sprache!A28","v":"Transport"},{"$f":"Sprache!A29","v":"Montage und Installation\nInbetriebnahme"},{"$f":"Sprache!A30","v":"Einrichten\nEinlernen (Teachen)/ Programmieren und/oder Umrüsten"},{"$f":"Sprache!A31","v":"Betrieb"},{"$f":"Sprache!A32","v":"Reinigung\nInstandhaltung"},{"$f":"Sprache!A33","v":"Fehlersuche und -beseitigung"},{"$f":"Sprache!A34","v":"Demontage\nAußer Betrieb nehmen"},{"$f":"Sprache!A35","v":"Risiko- einschätzung"},null,null,null,null,{"$f":"Sprache!A42","v":"konstruktiv"},{"$f":"Sprache!A43","v":"sicherheitstechnisch"},{"$f":"Sprache!A44","v":"informativ"},{"$f":"Sprache!A45","v":"Beschreibung der Risikominderung"},{"$f":"Sprache!A46","v":"angewandte technische Spezifikation / harmonisierte B / C Norm"},{"$f":"Sprache!A47","v":"Titel"},{"$f":"Sprache!A48","v":"Fundstelle in Norm"},{"$f":"Sprache!A435","v":"Sicherheitsfunktion (bei steuerungstechnischer Lösung)"},{"$f":"Sprache!A446","v":"Verifikations-/ Validierungsdatei"},{"$f":"Sprache!A49","v":"technischer Bericht / Prüfergebnis"},{"$f":"Sprache!A50","v":"Risiko- einschätzung"}]
[null,{"$f":"Sprache!A4","v":"Haupt"},{"$f":"Sprache!A5","v":"Unter"},null,{"$f":"Sprache!A7","v":"Nr."},{"$f":"Sprache!A8","v":"Bezeichnung"},null,null,null,null,null,null,{"$f":"Sprache!A17","v":"Norm Nummer"},{"$f":"Sprache!A18","v":"Norm Titel"},{"$f":"Sprache!A19","v":"Abschnitt / Detail"},{"$f":"Sprache!A20","v":"Norminhalt (eingekürzt und bearbeitet)"},{"$f":"Sprache!A21","v":"Ursprung"},{"$f":"Sprache!A532","v":"mögliche Folgen"},null,null,null,null,null,null,null,null,null,null,null,{"$f":"Sprache!A37","v":"S"},{"$f":"Sprache!A38","v":"F"},{"$f":"Sprache!A39","v":"P"},{"$f":"Sprache!A448","v":"W"},{"$f":"Sprache!A40","v":"Risiko"},null,null,null,null,null,null,null,null,null,null,{"$f":"Sprache!A51","v":"S"},{"$f":"Sprache!A52","v":"F"},{"$f":"Sprache!A53","v":"P"},{"$f":"Sprache!A449","v":"W"},{"$f":"Sprache!A54","v":"Risiko"}]
["Spalte1","Haupt","Unter","Richtlinie","Nr.","Bezeichnung","Original","Leere Überschrift","Gefährdung vorhanden","Datum der letzten Änderung","Inhalt bereits abgedeckt?","Norm-Typ","Norm Nummer","Norm Titel","Abschnitt / Detail","Norminhalt (eingekürzt und bearbeitet)","Ursprung","mögliche Auswirkung","Ort / Gefahrbereich / Position in Zeichnung","Gefährdung / Gefährdungssituation","Gefährdete Personen","Alle","Transport","Montage und Installation In Betrieb nehmen","Einrichten Einlernen (Teachen)/ Programmieren und/oder Umrüsten","Betrieb","Reinigung Instandhaltung","Fehlersuche und -beseitigung","Demontage Außer Betrieb nehmen","S","F","P","W","Risiko","konstruktiv","sicherheitstechnisch","informativ","Beschreibung der Risikominderung","angewandte technische Spezifikation / harmonisierte B / C Norm","Titel","Fundstelle in Norm","Sicherheitsfunktion","Verifikation Validation","technischer Bericht / Prüfergebnis","S2","F2","P2","W2","Risiko2","Weitere Reduzierung notwendig?","Kommentar","Bearbeiter","Gefährdung ist behandelt?","Sprache der Zeile"]
[null,null,null,"2006 / 42","1.1.",{"$f":"Sprache!A$83","v":"Allgemeines"},"x","x","x",null,null,null,null,null,null,null,null,null,null,null,null,null,null,null,null,null,null,null,null,null,null,null,null,{"$f":"IF((Table_RiskAssessment[[#This Row],[S]]* Table_RiskAssessment[[#This Row],[F]]* Table_RiskAssessment[[#This Row],[P]]>0),IF(Table_RiskAssessment[[#This Row],[S]]=1,IF(Table_RiskAssessment[[#This Row],[F]]=1,IF(Table_RiskAssessment[[#This Row],[P]]=1,\"a\",IF(Table_RiskAssessment[[#This Row],[W]]=1,\"a\",\"b\")),IF(Table_RiskAssessment[[#This Row],[P]]=1,IF(Table_RiskAssessment[[#This Row],[W]]=1,\"a\",\"b\"),IF(Table_RiskAssessment[[#This Row],[W]]=1,\"b\",\"c\"))),IF(Table_RiskAssessment[[#This Row],[F]]=1,IF(Table_RiskAssessment[[#This Row],[P]]=1,IF(Table_RiskAssessment[[#This Row],[W]]=1,\"b\",\"c\"),IF(Table_RiskAssessment[[#This Row],[W]]=1,\"c\",\"d\")),IF(Table_RiskAssessment[[#This Row],[P]]=1,IF(Table_RiskAssessment[[#This Row],[W]]=1,\"c\",\"d\"),IF(Table_RiskAssessment[[#This Row],[W]]=1,\"d\",\"e\")))),\"?\")","v":"?"},null,null,null,null,null,null,null,null,null,null,null,null,null,null,{"$f":"IF((Table_RiskAssessment[[#This Row],[S2]]* Table_RiskAssessment[[#This Row],[F2]]* Table_RiskAssessment[[#This Row],[P2]]>0),IF(Table_RiskAssessment[[#This Row],[S2]]=1,IF(Table_RiskAssessment[[#This Row],[F2]]=1,IF(Table_RiskAssessment[[#This Row],[P2]]=1,\"a\",IF(Table_RiskAssessment[[#This Row],[W2]]=1,\"a\",\"b\")),IF(Table_RiskAssessment[[#This Row],[P2]]=1,IF(Table_RiskAssessment[[#This Row],[W2]]=1,\"a\",\"b\"),IF(Table_RiskAssessment[[#This Row],[W2]]=1,\"b\",\"c\"))),IF(Table_RiskAssessment[[#This Row],[F2]]=1,IF(Table_RiskAssessment[[#This Row],[P2]]=1,IF(Table_RiskAssessment[[#This Row],[W2]]=1,\"b\",\"c\"),IF(Table_RiskAssessment[[#This Row],[W2]]=1,\"c\",\"d\")),IF(Table_RiskAssessment[[#This Row],[P2]]=1,IF(Table_RiskAssessment[[#This Row],[W2]]=1,\"c\",\"d\"),IF(Table_RiskAssessment[[#This Row],[W2]]=1,\"d\",\"e\")))),\"?\")","v":"?"},null,null,null,"-"]
[null,null,null,"2006 / 42","1.1.2.",{"$f":"Sprache!A$84","v":"Grundsätze für die Integration der Sicherheit"},"x","","x",null,null,null,null,null,null,null,null,null,null,null,null,null,null,null,null,null,null,null,null,null,null,null,null,{"$f":"IF((Table_RiskAssessment[[#This Row],[S]]* Table_RiskAssessment[[#This Row],[F]]* Table_RiskAssessment[[#This Row],[P]]>0),IF(Table_RiskAssessment[[#This Row],[S]]=1,IF(Table_RiskAssessment[[#This Row],[F]]=1,IF(Table_RiskAssessment[[#This Row],[P]]=1,\"a\",IF(Table_RiskAssessment[[#This Row],[W]]=1,\"a\",\"b\")),IF(Table_RiskAssessment[[#This Row],[P]]=1,IF(Table_RiskAssessment[[#This Row],[W]]=1,\"a\",\"b\"),IF(Table_RiskAssessment[[#This Row],[W]]=1,\"b\",\"c\"))),IF(Table_RiskAssessment[[#This Row],[F]]=1,IF(Table_RiskAssessment[[#This Row],[P]]=1,IF(Table_RiskAssessment[[#This Row],[W]]=1,\"b\",\"c\"),IF(Table_RiskAssessment[[#This Row],[W]]=1,\"c\",\"d\")),IF(Table_RiskAssessment[[#This Row],[P]]=1,IF(Table_RiskAssessment[[#This Row],[W]]=1,\"c\",\"d\"),IF(Table_RiskAssessment[[#This Row],[W]]=1,\"d\",\"e\")))),\"?\")","v":"?"},null,null,null,null,null,null,null,null,null,null,null,null,null,null,{"$f":"IF((Table_RiskAssessment[[#This Row],[S2]]* Table_RiskAssessment[[#This Row],[F2]]* Table_RiskAssessment[[#This Row],[P2]]>0),IF(Table_RiskAssessment[[#This Row],[S2]]=1,IF(Table_RiskAssessment[[#This Row],[F2]]=1,IF(Table_RiskAssessment[[#This Row],[P2]]=1,\"a\",IF(Table_RiskAssessment[[#This Row],[W2]]=1,\"a\",\"b\")),IF(Table_RiskAssessment[[#This Row],[P2]]=1,IF(Table_RiskAssessment[[#This Row],[W2]]=1,\"a\",\"b\"),IF(Table_RiskAssessment[[#This Row],[W2]]=1,\"b\",\"c\"))),IF(Table_RiskAssessment[[#This Row],[F2]]=1,IF(Table_RiskAssessment[[#This Row],[P2]]=1,IF(Table_RiskAssessment[[#This Row],[W2]]=1,\"b\",\"c\"),IF(Table_RiskAssessment[[#This Row],[W2]]=1,\"c\",\"d\")),IF(Table_RiskAssessment[[#This Row],[P2]]=1,IF(Table_RiskAssessment[[#This Row],[W2]]=1,\"c\",\"d\"),IF(Table_RiskAssessment[[#This Row],[W2]]=1,\"d\",\"e\")))),\"?\")","v":"?"},null,null,null,"-"]
[null,null,null,"2006 / 42","1.1.3.",{"$f":"Sprache!A$85","v":"Materialien und Produkte"},"x","","x",null,null,null,null,null,null,null,null,null,null,null,null,null,null,null,null,null,null,null,null,null,null,null,null,{"$f":"IF((Table_RiskAssessment[[#This Row],[S]]* Table_RiskAssessment[[#This Row],[F]]* Table_RiskAssessment[[#This Row],[P]]>0),IF(Table_RiskAssessment[[#This Row],[S]]=1,IF(Table_RiskAssessment[[#This Row],[F]]=1,IF(Table_RiskAssessment[[#This Row],[P]]=1,\"a\",IF(Table_RiskAssessment[[#This Row],[W]]=1,\"a\",\"b\")),IF(Table_RiskAssessment[[#This Row],[P]]=1,IF(Table_RiskAssessment[[#This Row],[W]]=1,\"a\",\"b\"),IF(Table_RiskAssessment[[#This Row],[W]]=1,\"b\",\"c\"))),IF(Table_RiskAssessment[[#This Row],[F]]=1,IF(Table_RiskAssessment[[#This Row],[P]]=1,IF(Table_RiskAssessment[[#This Row],[W]]=1,\"b\",\"c\"),IF(Table_RiskAssessment[[#This Row],[W]]=1,\"c\",\"d\")),IF(Table_RiskAssessment[[#This Row],[P]]=1,IF(Table_RiskAssessment[[#This Row],[W]]=1,\"c\",\"d\"),IF(Table_RiskAssessment[[#This Row],[W]]=1,\"d\",\"e\")))),\"?\")","v":"?"},null,null,null,null,null,null,null,null,null,null,null,null,null,null,{"$f":"IF((Table_RiskAssessment[[#This Row],[S2]]* Table_RiskAssessment[[#This Row],[F2]]* Table_RiskAssessment[[#This Row],[P2]]>0),IF(Table_RiskAssessment[[#This Row],[S2]]=1,IF(Table_RiskAssessment[[#This Row],[F2]]=1,IF(Table_RiskAssessment[[#This Row],[P2]]=1,\"a\",IF(Table_RiskAssessment[[#This Row],[W2]]=1,\"a\",\"b\")),IF(Table_RiskAssessment[[#This Row],[P2]]=1,IF(Table_RiskAssessment[[#This Row],[W2]]=1,\"a\",\"b\"),IF(Table_RiskAssessment[[#This Row],[W2]]=1,\"b\",\"c\"))),IF(Table_RiskAssessment[[#This Row],[F2]]=1,IF(Table_RiskAssessment[[#This Row],[P2]]=1,IF(Table_RiskAssessment[[#This Row],[W2]]=1,\"b\",\"c\"),IF(Table_RiskAssessment[[#This Row],[W2]]=1,\"c\",\"d\")),IF(Table_RiskAssessment[[#This Row],[P2]]=1,IF(Table_RiskAssessment[[#This Row],[W2]]=1,\"c\",\"d\"),IF(Table_RiskAssessment[[#This Row],[W2]]=1,\"d\",\"e\")))),\"?\")","v":"?"},null,null,null,"-"]
[null,null,null,"2006 / 42","1.1.4.",{"$f":"Sprache!A$86","v":"Beleuchtung"},"x","","x",null,null,null,"---",null,null,null,null,null,null,null,null,null,null,null,null,null,null,null,null,null,null,null,null,{"$f":"IF((Table_RiskAssessment[[#This Row],[S]]* Table_RiskAssessment[[#This Row],[F]]* Table_RiskAssessment[[#This Row],[P]]>0),IF(Table_RiskAssessment[[#This Row],[S]]=1,IF(Table_RiskAssessment[[#This Row],[F]]=1,IF(Table_RiskAssessment[[#This Row],[P]]=1,\"a\",IF(Table_RiskAssessment[[#This Row],[W]]=1,\"a\",\"b\")),IF(Table_RiskAssessment[[#This Row],[P]]=1,IF(Table_RiskAssessment[[#This Row],[W]]=1,\"a\",\"b\"),IF(Table_RiskAssessment[[#This Row],[W]]=1,\"b\",\"c\"))),IF(Table_RiskAssessment[[#This Row],[F]]=1,IF(Table_RiskAssessment[[#This Row],[P]]=1,IF(Table_RiskAssessment[[#This Row],[W]]=1,\"b\",\"c\"),IF(Table_RiskAssessment[[#This Row],[W]]=1,\"c\",\"d\")),IF(Table_RiskAssessment[[#This Row],[P]]=1,IF(Table_RiskAssessment[[#This Row],[W]]=1,\"c\",\"d\"),IF(Table_RiskAssessment[[#This Row],[W]]=1,\"d\",\"e\")))),\"?\")","v":"?"},null,null,null,null,"---",null,null,null,null,null,null,null,null,null,{"$f":"IF((Table_RiskAssessment[[#This Row],[S2]]* Table_RiskAssessment[[#This Row],[F2]]* Table_RiskAssessment[[#This Row],[P2]]>0),IF(Table_RiskAssessment[[#This Row],[S2]]=1,IF(Table_RiskAssessment[[#This Row],[F2]]=1,IF(Table_RiskAssessment[[#This Row],[P2]]=1,\"a\",IF(Table_RiskAssessment[[#This Row],[W2]]=1,\"a\",\"b\")),IF(Table_RiskAssessment[[#This Row],[P2]]=1,IF(Table_RiskAssessment[[#This Row],[W2]]=1,\"a\",\"b\"),IF(Table_RiskAssessment[[#This Row],[W2]]=1,\"b\",\"c\"))),IF(Table_RiskAssessment[[#This Row],[F2]]=1,IF(Table_RiskAssessment[[#This Row],[P2]]=1,IF(Table_RiskAssessment[[#This Row],[W2]]=1,\"b\",\"c\"),IF(Table_RiskAssessment[[#This Row],[W2]]=1,\"c\",\"d\")),IF(Table_RiskAssessment[[#This Row],[P2]]=1,IF(Table_RiskAssessment[[#This Row],[W2]]=1,\"c\",\"d\"),IF(Table_RiskAssessment[[#This Row],[W2]]=1,\"d\",\"e\")))),\"?\")","v":"?"},null,null,null,"-"]
[null,null,null,"2006 / 42","1.1.5.",{"$f":"Sprache!A$87","v":"Konstruktion der Maschine im Hinblick auf die Handhabung"},"x","","x",null,null,null,null,null,null,null,null,null,null,null,null,null,null,null,null,null,null,null,null,null,null,null,null,{"$f":"IF((Table_RiskAssessment[[#This Row],[S]]* Table_RiskAssessment[[#This Row],[F]]* Table_RiskAssessment[[#This Row],[P]]>0),IF(Table_RiskAssessment[[#This Row],[S]]=1,IF(Table_RiskAssessment[[#This Row],[F]]=1,IF(Table_RiskAssessment[[#This Row],[P]]=1,\"a\",IF(Table_RiskAssessment[[#This Row],[W]]=1,\"a\",\"b\")),IF(Table_RiskAssessment[[#This Row],[P]]=1,IF(Table_RiskAssessment[[#This Row],[W]]=1,\"a\",\"b\"),IF(Table_RiskAssessment[[#This Row],[W]]=1,\"b\",\"c\"))),IF(Table_RiskAssessment[[#This Row],[F]]=1,IF(Table_RiskAssessment[[#This Row],[P]]=1,IF(Table_RiskAssessment[[#This Row],[W]]=1,\"b\",\"c\"),IF(Table_RiskAssessment[[#This Row],[W]]=1,\"c\",\"d\")),IF(Table_RiskAssessment[[#This Row],[P]]=1,IF(Table_RiskAssessment[[#This Row],[W]]=1,\"c\",\"d\"),IF(Table_RiskAssessment[[#This Row],[W]]=1,\"d\",\"e\")))),\"?\")","v":"?"},null,null,null,null,null,null,null,null,null,null,null,null,null,null,{"$f":"IF((Table_RiskAssessment[[#This Row],[S2]]* Table_RiskAssessment[[#This Row],[F2]]* Table_RiskAssessment[[#This Row],[P2]]>0),IF(Table_RiskAssessment[[#This Row],[S2]]=1,IF(Table_RiskAssessment[[#This Row],[F2]]=1,IF(Table_RiskAssessment[[#This Row],[P2]]=1,\"a\",IF(Table_RiskAssessment[[#This Row],[W2]]=1,\"a\",\"b\")),IF(Table_RiskAssessment[[#This Row],[P2]]=1,IF(Table_RiskAssessment[[#This Row],[W2]]=1,\"a\",\"b\"),IF(Table_RiskAssessment[[#This Row],[W2]]=1,\"b\",\"c\"))),IF(Table_RiskAssessment[[#This Row],[F2]]=1,IF(Table_RiskAssessment[[#This Row],[P2]]=1,IF(Table_RiskAssessment[[#This Row],[W2]]=1,\"b\",\"c\"),IF(Table_RiskAssessment[[#This Row],[W2]]=1,\"c\",\"d\")),IF(Table_RiskAssessment[[#This Row],[P2]]=1,IF(Table_RiskAssessment[[#This Row],[W2]]=1,\"c\",\"d\"),IF(Table_RiskAssessment[[#This Row],[W2]]=1,\"d\",\"e\")))),\"?\")","v":"?"},null,null,null,"-"]
[null,null,null,"2006 / 42","1.1.6.",{"$f":"Sprache!A$88","v":"Ergonomie"},"x","","x",null,null,null,"---",null,null,null,null,null,null,null,null,null,null,null,null,null,null,null,null,null,null,null,null,{"$f":"IF((Table_RiskAssessment[[#This Row],[S]]* Table_RiskAssessment[[#This Row],[F]]* Table_RiskAssessment[[#This Row],[P]]>0),IF(Table_RiskAssessment[[#This Row],[S]]=1,IF(Table_RiskAssessment[[#This Row],[F]]=1,IF(Table_RiskAssessment[[#This Row],[P]]=1,\"a\",IF(Table_RiskAssessment[[#This Row],[W]]=1,\"a\",\"b\")),IF(Table_RiskAssessment[[#This Row],[P]]=1,IF(Table_RiskAssessment[[#This Row],[W]]=1,\"a\",\"b\"),IF(Table_RiskAssessment[[#This Row],[W]]=1,\"b\",\"c\"))),IF(Table_RiskAssessment[[#This Row],[F]]=1,IF(Table_RiskAssessment[[#This Row],[P]]=1,IF(Table_RiskAssessment[[#This Row],[W]]=1,\"b\",\"c\"),IF(Table_RiskAssessment[[#This Row],[W]]=1,\"c\",\"d\")),IF(Table_RiskAssessment[[#This Row],[P]]=1,IF(Table_RiskAssessment[[#This Row],[W]]=1,\"c\",\"d\"),IF(Table_RiskAssessment[[#This Row],[W]]=1,\"d\",\"e\")))),\"?\")","v":"?"},null,null,null,null,"---",null,null,null,null,null,null,null,null,null,{"$f":"IF((Table_RiskAssessment[[#This Row],[S2]]* Table_RiskAssessment[[#This Row],[F2]]* Table_RiskAssessment[[#This Row],[P2]]>0),IF(Table_RiskAssessment[[#This Row],[S2]]=1,IF(Table_RiskAssessment[[#This Row],[F2]]=1,IF(Table_RiskAssessment[[#This Row],[P2]]=1,\"a\",IF(Table_RiskAssessment[[#This Row],[W2]]=1,\"a\",\"b\")),IF(Table_RiskAssessment[[#This Row],[P2]]=1,IF(Table_RiskAssessment[[#This Row],[W2]]=1,\"a\",\"b\"),IF(Table_RiskAssessment[[#This Row],[W2]]=1,\"b\",\"c\"))),IF(Table_RiskAssessment[[#This Row],[F2]]=1,IF(Table_RiskAssessment[[#This Row],[P2]]=1,IF(Table_RiskAssessment[[#This Row],[W2]]=1,\"b\",\"c\"),IF(Table_RiskAssessment[[#This Row],[W2]]=1,\"c\",\"d\")),IF(Table_RiskAssessment[[#This Row],[P2]]=1,IF(Table_RiskAssessment[[#This Row],[W2]]=1,\"c\",\"d\"),IF(Table_RiskAssessment[[#This Row],[W2]]=1,\"d\",\"e\")))),\"?\")","v":"?"},null,null,null,"-"]
[null,null,null,"2006 / 42","1.1.7.",{"$f":"Sprache!A$89","v":"Bedienungsplätze"},"x","","x",null,null,null,null,null,null,null,null,null,null,null,null,null,null,null,null,null,null,null,null,null,null,null,null,{"$f":"IF((Table_RiskAssessment[[#This Row],[S]]* Table_RiskAssessment[[#This Row],[F]]* Table_RiskAssessment[[#This Row],[P]]>0),IF(Table_RiskAssessment[[#This Row],[S]]=1,IF(Table_RiskAssessment[[#This Row],[F]]=1,IF(Table_RiskAssessment[[#This Row],[P]]=1,\"a\",IF(Table_RiskAssessment[[#This Row],[W]]=1,\"a\",\"b\")),IF(Table_RiskAssessment[[#This Row],[P]]=1,IF(Table_RiskAssessment[[#This Row],[W]]=1,\"a\",\"b\"),IF(Table_RiskAssessment[[#This Row],[W]]=1,\"b\",\"c\"))),IF(Table_RiskAssessment[[#This Row],[F]]=1,IF(Table_RiskAssessment[[#This Row],[P]]=1,IF(Table_RiskAssessment[[#This Row],[W]]=1,\"b\",\"c\"),IF(Table_RiskAssessment[[#This Row],[W]]=1,\"c\",\"d\")),IF(Table_RiskAssessment[[#This Row],[P]]=1,IF(Table_RiskAssessment[[#This Row],[W]]=1,\"c\",\"d\"),IF(Table_RiskAssessment[[#This Row],[W]]=1,\"d\",\"e\")))),\"?\")","v":"?"},null,null,null,null,null,null,null,null,null,null,null,null,null,null,{"$f":"IF((Table_RiskAssessment[[#This Row],[S2]]* Table_RiskAssessment[[#This Row],[F2]]* Table_RiskAssessment[[#This Row],[P2]]>0),IF(Table_RiskAssessment[[#This Row],[S2]]=1,IF(Table_RiskAssessment[[#This Row],[F2]]=1,IF(Table_RiskAssessment[[#This Row],[P2]]=1,\"a\",IF(Table_RiskAssessment[[#This Row],[W2]]=1,\"a\",\"b\")),IF(Table_RiskAssessment[[#This Row],[P2]]=1,IF(Table_RiskAssessment[[#This Row],[W2]]=1,\"a\",\"b\"),IF(Table_RiskAssessment[[#This Row],[W2]]=1,\"b\",\"c\"))),IF(Table_RiskAssessment[[#This Row],[F2]]=1,IF(Table_RiskAssessment[[#This Row],[P2]]=1,IF(Table_RiskAssessment[[#This Row],[W2]]=1,\"b\",\"c\"),IF(Table_RiskAssessment[[#This Row],[W2]]=1,\"c\",\"d\")),IF(Table_RiskAssessment[[#This Row],[P2]]=1,IF(Table_RiskAssessment[[#This Row],[W2]]=1,\"c\",\"d\"),IF(Table_RiskAssessment[[#This Row],[W2]]=1,\"d\",\"e\")))),\"?\")","v":"?"},null,null,null,"-"]
[null,null,null,"2006 / 42","1.1.8.",{"$f":"Sprache!A$90","v":"Sitze"},"x","","x",null,null,null,null,null,null,null,null,null,null,null,null,null,null,null,null,null,null,null,null,null,null,null,null,{"$f":"IF((Table_RiskAssessment[[#This Row],[S]]* Table_RiskAssessment[[#This Row],[F]]* Table_RiskAssessment[[#This Row],[P]]>0),IF(Table_RiskAssessment[[#This Row],[S]]=1,IF(Table_RiskAssessment[[#This Row],[F]]=1,IF(Table_RiskAssessment[[#This Row],[P]]=1,\"a\",IF(Table_RiskAssessment[[#This Row],[W]]=1,\"a\",\"b\")),IF(Table_RiskAssessment[[#This Row],[P]]=1,IF(Table_RiskAssessment[[#This Row],[W]]=1,\"a\",\"b\"),IF(Table_RiskAssessment[[#This Row],[W]]=1,\"b\",\"c\"))),IF(Table_RiskAssessment[[#This Row],[F]]=1,IF(Table_RiskAssessment[[#This Row],[P]]=1,IF(Table_RiskAssessment[[#This Row],[W]]=1,\"b\",\"c\"),IF(Table_RiskAssessment[[#This Row],[W]]=1,\"c\",\"d\")),IF(Table_RiskAssessment[[#This Row],[P]]=1,IF(Table_RiskAssessment[[#This Row],[W]]=1,\"c\",\"d\"),IF(Table_RiskAssessment[[#This Row],[W]]=1,\"d\",\"e\")))),\"?\")","v":"?"},null,null,null,null,null,null,null,null,null,null,null,null,null,null,{"$f":"IF((Table_RiskAssessment[[#This Row],[S2]]* Table_RiskAssessment[[#This Row],[F2]]* Table_RiskAssessment[[#This Row],[P2]]>0),IF(Table_RiskAssessment[[#This Row],[S2]]=1,IF(Table_RiskAssessment[[#This Row],[F2]]=1,IF(Table_RiskAssessment[[#This Row],[P2]]=1,\"a\",IF(Table_RiskAssessment[[#This Row],[W2]]=1,\"a\",\"b\")),IF(Table_RiskAssessment[[#This Row],[P2]]=1,IF(Table_RiskAssessment[[#This Row],[W2]]=1,\"a\",\"b\"),IF(Table_RiskAssessment[[#This Row],[W2]]=1,\"b\",\"c\"))),IF(Table_RiskAssessment[[#This Row],[F2]]=1,IF(Table_RiskAssessment[[#This Row],[P2]]=1,IF(Table_RiskAssessment[[#This Row],[W2]]=1,\"b\",\"c\"),IF(Table_RiskAssessment[[#This Row],[W2]]=1,\"c\",\"d\")),IF(Table_RiskAssessment[[#This Row],[P2]]=1,IF(Table_RiskAssessment[[#This Row],[W2]]=1,\"c\",\"d\"),IF(Table_RiskAssessment[[#This Row],[W2]]=1,\"d\",\"e\")))),\"?\")","v":"?"},null,null,null,"-"]
[null,null,null,"2006 / 42","1.2.",{"$f":"Sprache!A$91","v":"Steuerungen und Befehlseinrichtungen"},"x","x","x",null,null,null,null,null,null,null,null,null,null,null,null,null,null,null,null,null,null,null,null,null,null,null,null,{"$f":"IF((Table_RiskAssessment[[#This Row],[S]]* Table_RiskAssessment[[#This Row],[F]]* Table_RiskAssessment[[#This Row],[P]]>0),IF(Table_RiskAssessment[[#This Row],[S]]=1,IF(Table_RiskAssessment[[#This Row],[F]]=1,IF(Table_RiskAssessment[[#This Row],[P]]=1,\"a\",IF(Table_RiskAssessment[[#This Row],[W]]=1,\"a\",\"b\")),IF(Table_RiskAssessment[[#This Row],[P]]=1,IF(Table_RiskAssessment[[#This Row],[W]]=1,\"a\",\"b\"),IF(Table_RiskAssessment[[#This Row],[W]]=1,\"b\",\"c\"))),IF(Table_RiskAssessment[[#This Row],[F]]=1,IF(Table_RiskAssessment[[#This Row],[P]]=1,IF(Table_RiskAssessment[[#This Row],[W]]=1,\"b\",\"c\"),IF(Table_RiskAssessment[[#This Row],[W]]=1,\"c\",\"d\")),IF(Table_RiskAssessment[[#This Row],[P]]=1,IF(Table_RiskAssessment[[#This Row],[W]]=1,\"c\",\"d\"),IF(Table_RiskAssessment[[#This Row],[W]]=1,\"d\",\"e\")))),\"?\")","v":"?"},null,null,null,null,null,null,null,null,null,null,null,null,null,null,{"$f":"IF((Table_RiskAssessment[[#This Row],[S2]]* Table_RiskAssessment[[#This Row],[F2]]* Table_RiskAssessment[[#This Row],[P2]]>0),IF(Table_RiskAssessment[[#This Row],[S2]]=1,IF(Table_RiskAssessment[[#This Row],[F2]]=1,IF(Table_RiskAssessment[[#This Row],[P2]]=1,\"a\",IF(Table_RiskAssessment[[#This Row],[W2]]=1,\"a\",\"b\")),IF(Table_RiskAssessment[[#This Row],[P2]]=1,IF(Table_RiskAssessment[[#This Row],[W2]]=1,\"a\",\"b\"),IF(Table_RiskAssessment[[#This Row],[W2]]=1,\"b\",\"c\"))),IF(Table_RiskAssessment[[#This Row],[F2]]=1,IF(Table_RiskAssessment[[#This Row],[P2]]=1,IF(Table_RiskAssessment[[#This Row],[W2]]=1,\"b\",\"c\"),IF(Table_RiskAssessment[[#This Row],[W2]]=1,\"c\",\"d\")),IF(Table_RiskAssessment[[#This Row],[P2]]=1,IF(Table_RiskAssessment[[#This Row],[W2]]=1,\"c\",\"d\"),IF(Table_RiskAssessment[[#This Row],[W2]]=1,\"d\",\"e\")))),\"?\")","v":"?"},null,null,null,"-"]
[null,null,null,"2006 / 42","1.2.1.",{"$f":"Sprache!A$92","v":"Sicherheit und Zuverlässigkeit von Steuerungen "},"x","","x",null,null,null,"---",null,null,null,null,null,null,null,null,null,null,null,null,null,null,null,null,null,null,null,null,{"$f":"IF((Table_RiskAssessment[[#This Row],[S]]* Table_RiskAssessment[[#This Row],[F]]* Table_RiskAssessment[[#This Row],[P]]>0),IF(Table_RiskAssessment[[#This Row],[S]]=1,IF(Table_RiskAssessment[[#This Row],[F]]=1,IF(Table_RiskAssessment[[#This Row],[P]]=1,\"a\",IF(Table_RiskAssessment[[#This Row],[W]]=1,\"a\",\"b\")),IF(Table_RiskAssessment[[#This Row],[P]]=1,IF(Table_RiskAssessment[[#This Row],[W]]=1,\"a\",\"b\"),IF(Table_RiskAssessment[[#This Row],[W]]=1,\"b\",\"c\"))),IF(Table_RiskAssessment[[#This Row],[F]]=1,IF(Table_RiskAssessment[[#This Row],[P]]=1,IF(Table_RiskAssessment[[#This Row],[W]]=1,\"b\",\"c\"),IF(Table_RiskAssessment[[#This Row],[W]]=1,\"c\",\"d\")),IF(Table_RiskAssessment[[#This Row],[P]]=1,IF(Table_RiskAssessment[[#This Row],[W]]=1,\"c\",\"d\"),IF(Table_RiskAssessment[[#This Row],[W]]=1,\"d\",\"e\")))),\"?\")","v":"?"},null,null,null,null,"---",null,null,null,null,null,null,null,null,null,{"$f":"IF((Table_RiskAssessment[[#This Row],[S2]]* Table_RiskAssessment[[#This Row],[F2]]* Table_RiskAssessment[[#This Row],[P2]]>0),IF(Table_RiskAssessment[[#This Row],[S2]]=1,IF(Table_RiskAssessment[[#This Row],[F2]]=1,IF(Table_RiskAssessment[[#This Row],[P2]]=1,\"a\",IF(Table_RiskAssessment[[#This Row],[W2]]=1,\"a\",\"b\")),IF(Table_RiskAssessment[[#This Row],[P2]]=1,IF(Table_RiskAssessment[[#This Row],[W2]]=1,\"a\",\"b\"),IF(Table_RiskAssessment[[#This Row],[W2]]=1,\"b\",\"c\"))),IF(Table_RiskAssessment[[#This Row],[F2]]=1,IF(Table_RiskAssessment[[#This Row],[P2]]=1,IF(Table_RiskAssessment[[#This Row],[W2]]=1,\"b\",\"c\"),IF(Table_RiskAssessment[[#This Row],[W2]]=1,\"c\",\"d\")),IF(Table_RiskAssessment[[#This Row],[P2]]=1,IF(Table_RiskAssessment[[#This Row],[W2]]=1,\"c\",\"d\"),IF(Table_RiskAssessment[[#This Row],[W2]]=1,\"d\",\"e\")))),\"?\")","v":"?"},null,null,null,"-"]
[null,null,null,"2006 / 42","1.2.2.",{"$f":"Sprache!A$93","v":"Stellteile "},"x","","x",null,null,null,"---",null,null,null,null,null,null,null,null,null,null,null,null,null,null,null,null,null,null,null,null,{"$f":"IF((Table_RiskAssessment[[#This Row],[S]]* Table_RiskAssessment[[#This Row],[F]]* Table_RiskAssessment[[#This Row],[P]]>0),IF(Table_RiskAssessment[[#This Row],[S]]=1,IF(Table_RiskAssessment[[#This Row],[F]]=1,IF(Table_RiskAssessment[[#This Row],[P]]=1,\"a\",IF(Table_RiskAssessment[[#This Row],[W]]=1,\"a\",\"b\")),IF(Table_RiskAssessment[[#This Row],[P]]=1,IF(Table_RiskAssessment[[#This Row],[W]]=1,\"a\",\"b\"),IF(Table_RiskAssessment[[#This Row],[W]]=1,\"b\",\"c\"))),IF(Table_RiskAssessment[[#This Row],[F]]=1,IF(Table_RiskAssessment[[#This Row],[P]]=1,IF(Table_RiskAssessment[[#This Row],[W]]=1,\"b\",\"c\"),IF(Table_RiskAssessment[[#This Row],[W]]=1,\"c\",\"d\")),IF(Table_RiskAssessment[[#This Row],[P]]=1,IF(Table_RiskAssessment[[#This Row],[W]]=1,\"c\",\"d\"),IF(Table_RiskAssessment[[#This Row],[W]]=1,\"d\",\"e\")))),\"?\")","v":"?"},null,null,null,null,"---",null,null,null,null,null,null,null,null,null,{"$f":"IF((Table_RiskAssessment[[#This Row],[S2]]* Table_RiskAssessment[[#This Row],[F2]]* Table_RiskAssessment[[#This Row],[P2]]>0),IF(Table_RiskAssessment[[#This Row],[S2]]=1,IF(Table_RiskAssessment[[#This Row],[F2]]=1,IF(Table_RiskAssessment[[#This Row],[P2]]=1,\"a\",IF(Table_RiskAssessment[[#This Row],[W2]]=1,\"a\",\"b\")),IF(Table_RiskAssessment[[#This Row],[P2]]=1,IF(Table_RiskAssessment[[#This Row],[W2]]=1,\"a\",\"b\"),IF(Table_RiskAssessment[[#This Row],[W2]]=1,\"b\",\"c\"))),IF(Table_RiskAssessment[[#This Row],[F2]]=1,IF(Table_RiskAssessment[[#This Row],[P2]]=1,IF(Table_RiskAssessment[[#This Row],[W2]]=1,\"b\",\"c\"),IF(Table_RiskAssessment[[#This Row],[W2]]=1,\"c\",\"d\")),IF(Table_RiskAssessment[[#This Row],[P2]]=1,IF(Table_RiskAssessment[[#This Row],[W2]]=1,\"c\",\"d\"),IF(Table_RiskAssessment[[#This Row],[W2]]=1,\"d\",\"e\")))),\"?\")","v":"?"},null,null,null,"-"]
[null,null,null,"2006 / 42","1.2.3.",{"$f":"Sprache!A$94","v":"Ingangsetzen "},"x","","x",null,null,null,"---",null,null,null,null,null,null,null,null,null,null,null,null,null,null,null,null,null,null,null,null,{"$f":"IF((Table_RiskAssessment[[#This Row],[S]]* Table_RiskAssessment[[#This Row],[F]]* Table_RiskAssessment[[#This Row],[P]]>0),IF(Table_RiskAssessment[[#This Row],[S]]=1,IF(Table_RiskAssessment[[#This Row],[F]]=1,IF(Table_RiskAssessment[[#This Row],[P]]=1,\"a\",IF(Table_RiskAssessment[[#This Row],[W]]=1,\"a\",\"b\")),IF(Table_RiskAssessment[[#This Row],[P]]=1,IF(Table_RiskAssessment[[#This Row],[W]]=1,\"a\",\"b\"),IF(Table_RiskAssessment[[#This Row],[W]]=1,\"b\",\"c\"))),IF(Table_RiskAssessment[[#This Row],[F]]=1,IF(Table_RiskAssessment[[#This Row],[P]]=1,IF(Table_RiskAssessment[[#This Row],[W]]=1,\"b\",\"c\"),IF(Table_RiskAssessment[[#This Row],[W]]=1,\"c\",\"d\")),IF(Table_RiskAssessment[[#This Row],[P]]=1,IF(Table_RiskAssessment[[#This Row],[W]]=1,\"c\",\"d\"),IF(Table_RiskAssessment[[#This Row],[W]]=1,\"d\",\"e\")))),\"?\")","v":"?"},null,null,null,null,"---",null,null,null,null,null,null,null,null,null,{"$f":"IF((Table_RiskAssessment[[#This Row],[S2]]* Table_RiskAssessment[[#This Row],[F2]]* Table_RiskAssessment[[#This Row],[P2]]>0),IF(Table_RiskAssessment[[#This Row],[S2]]=1,IF(Table_RiskAssessment[[#This Row],[F2]]=1,IF(Table_RiskAssessment[[#This Row],[P2]]=1,\"a\",IF(Table_RiskAssessment[[#This Row],[W2]]=1,\"a\",\"b\")),IF(Table_RiskAssessment[[#This Row],[P2]]=1,IF(Table_RiskAssessment[[#This Row],[W2]]=1,\"a\",\"b\"),IF(Table_RiskAssessment[[#This Row],[W2]]=1,\"b\",\"c\"))),IF(Table_RiskAssessment[[#This Row],[F2]]=1,IF(Table_RiskAssessment[[#This Row],[P2]]=1,IF(Table_RiskAssessment[[#This Row],[W2]]=1,\"b\",\"c\"),IF(Table_RiskAssessment[[#This Row],[W2]]=1,\"c\",\"d\")),IF(Table_RiskAssessment[[#This Row],[P2]]=1,IF(Table_RiskAssessment[[#This Row],[W2]]=1,\"c\",\"d\"),IF(Table_RiskAssessment[[#This Row],[W2]]=1,\"d\",\"e\")))),\"?\")","v":"?"},null,null,null,"-"]
[null,null,null,"2006 / 42","1.2.4.",{"$f":"Sprache!A$95","v":"Stillsetzen "},"x","x","x",null,null,null,null,null,null,null,null,null,null,null,null,null,null,null,null,null,null,null,null,null,null,null,null,{"$f":"IF((Table_RiskAssessment[[#This Row],[S]]* Table_RiskAssessment[[#This Row],[F]]* Table_RiskAssessment[[#This Row],[P]]>0),IF(Table_RiskAssessment[[#This Row],[S]]=1,IF(Table_RiskAssessment[[#This Row],[F]]=1,IF(Table_RiskAssessment[[#This Row],[P]]=1,\"a\",IF(Table_RiskAssessment[[#This Row],[W]]=1,\"a\",\"b\")),IF(Table_RiskAssessment[[#This Row],[P]]=1,IF(Table_RiskAssessment[[#This Row],[W]]=1,\"a\",\"b\"),IF(Table_RiskAssessment[[#This Row],[W]]=1,\"b\",\"c\"))),IF(Table_RiskAssessment[[#This Row],[F]]=1,IF(Table_RiskAssessment[[#This Row],[P]]=1,IF(Table_RiskAssessment[[#This Row],[W]]=1,\"b\",\"c\"),IF(Table_RiskAssessment[[#This Row],[W]]=1,\"c\",\"d\")),IF(Table_RiskAssessment[[#This Row],[P]]=1,IF(Table_RiskAssessment[[#This Row],[W]]=1,\"c\",\"d\"),IF(Table_RiskAssessment[[#This Row],[W]]=1,\"d\",\"e\")))),\"?\")","v":"?"},null,null,null,null,null,null,null,null,null,null,null,null,null,null,{"$f":"IF((Table_RiskAssessment[[#This Row],[S2]]* Table_RiskAssessment[[#This Row],[F2]]* Table_RiskAssessment[[#This Row],[P2]]>0),IF(Table_RiskAssessment[[#This Row],[S2]]=1,IF(Table_RiskAssessment[[#This Row],[F2]]=1,IF(Table_RiskAssessment[[#This Row],[P2]]=1,\"a\",IF(Table_RiskAssessment[[#This Row],[W2]]=1,\"a\",\"b\")),IF(Table_RiskAssessment[[#This Row],[P2]]=1,IF(Table_RiskAssessment[[#This Row],[W2]]=1,\"a\",\"b\"),IF(Table_RiskAssessment[[#This Row],[W2]]=1,\"b\",\"c\"))),IF(Table_RiskAssessment[[#This Row],[F2]]=1,IF(Table_RiskAssessment[[#This Row],[P2]]=1,IF(Table_RiskAssessment[[#This Row],[W2]]=1,\"b\",\"c\"),IF(Table_RiskAssessment[[#This Row],[W2]]=1,\"c\",\"d\")),IF(Table_RiskAssessment[[#This Row],[P2]]=1,IF(Table_RiskAssessment[[#This Row],[W2]]=1,\"c\",\"d\"),IF(Table_RiskAssessment[[#This Row],[W2]]=1,\"d\",\"e\")))),\"?\")","v":"?"},null,null,null,"-"]
[null,null,null,"2006 / 42","1.2.4.1.",{"$f":"Sprache!A$96","v":"Normales Stillsetzen "},"x","","x",null,null,null,null,null,null,null,null,null,null,null,null,null,null,null,null,null,null,null,null,null,null,null,null,{"$f":"IF((Table_RiskAssessment[[#This Row],[S]]* Table_RiskAssessment[[#This Row],[F]]* Table_RiskAssessment[[#This Row],[P]]>0),IF(Table_RiskAssessment[[#This Row],[S]]=1,IF(Table_RiskAssessment[[#This Row],[F]]=1,IF(Table_RiskAssessment[[#This Row],[P]]=1,\"a\",IF(Table_RiskAssessment[[#This Row],[W]]=1,\"a\",\"b\")),IF(Table_RiskAssessment[[#This Row],[P]]=1,IF(Table_RiskAssessment[[#This Row],[W]]=1,\"a\",\"b\"),IF(Table_RiskAssessment[[#This Row],[W]]=1,\"b\",\"c\"))),IF(Table_RiskAssessment[[#This Row],[F]]=1,IF(Table_RiskAssessment[[#This Row],[P]]=1,IF(Table_RiskAssessment[[#This Row],[W]]=1,\"b\",\"c\"),IF(Table_RiskAssessment[[#This Row],[W]]=1,\"c\",\"d\")),IF(Table_RiskAssessment[[#This Row],[P]]=1,IF(Table_RiskAssessment[[#This Row],[W]]=1,\"c\",\"d\"),IF(Table_RiskAssessment[[#This Row],[W]]=1,\"d\",\"e\")))),\"?\")","v":"?"},null,null,null,null,null,null,null,null,null,null,null,null,null,null,{"$f":"IF((Table_RiskAssessment[[#This Row],[S2]]* Table_RiskAssessment[[#This Row],[F2]]* Table_RiskAssessment[[#This Row],[P2]]>0),IF(Table_RiskAssessment[[#This Row],[S2]]=1,IF(Table_RiskAssessment[[#This Row],[F2]]=1,IF(Table_RiskAssessment[[#This Row],[P2]]=1,\"a\",IF(Table_RiskAssessment[[#This Row],[W2]]=1,\"a\",\"b\")),IF(Table_RiskAssessment[[#This Row],[P2]]=1,IF(Table_RiskAssessment[[#This Row],[W2]]=1,\"a\",\"b\"),IF(Table_RiskAssessment[[#This Row],[W2]]=1,\"b\",\"c\"))),IF(Table_RiskAssessment[[#This Row],[F2]]=1,IF(Table_RiskAssessment[[#This Row],[P2]]=1,IF(Table_RiskAssessment[[#This Row],[W2]]=1,\"b\",\"c\"),IF(Table_RiskAssessment[[#This Row],[W2]]=1,\"c\",\"d\")),IF(Table_RiskAssessment[[#This Row],[P2]]=1,IF(Table_RiskAssessment[[#This Row],[W2]]=1,\"c\",\"d\"),IF(Table_RiskAssessment[[#This Row],[W2]]=1,\"d\",\"e\")))),\"?\")","v":"?"},null,null,null,"-"]
[null,null,null,"2006 / 42","1.2.4.2.",{"$f":"Sprache!A$97","v":"Betriebsbedingtes Stillsetzen "},"x","","x",null,null,null,null,null,null,null,null,null,null,null,null,null,null,null,null,null,null,null,null,null,null,null,null,{"$f":"IF((Table_RiskAssessment[[#This Row],[S]]* Table_RiskAssessment[[#This Row],[F]]* Table_RiskAssessment[[#This Row],[P]]>0),IF(Table_RiskAssessment[[#This Row],[S]]=1,IF(Table_RiskAssessment[[#This Row],[F]]=1,IF(Table_RiskAssessment[[#This Row],[P]]=1,\"a\",IF(Table_RiskAssessment[[#This Row],[W]]=1,\"a\",\"b\")),IF(Table_RiskAssessment[[#This Row],[P]]=1,IF(Table_RiskAssessment[[#This Row],[W]]=1,\"a\",\"b\"),IF(Table_RiskAssessment[[#This Row],[W]]=1,\"b\",\"c\"))),IF(Table_RiskAssessment[[#This Row],[F]]=1,IF(Table_RiskAssessment[[#This Row],[P]]=1,IF(Table_RiskAssessment[[#This Row],[W]]=1,\"b\",\"c\"),IF(Table_RiskAssessment[[#This Row],[W]]=1,\"c\",\"d\")),IF(Table_RiskAssessment[[#This Row],[P]]=1,IF(Table_RiskAssessment[[#This Row],[W]]=1,\"c\",\"d\"),IF(Table_RiskAssessment[[#This Row],[W]]=1,\"d\",\"e\")))),\"?\")","v":"?"},null,null,null,null,null,null,null,null,null,null,null,null,null,null,{"$f":"IF((Table_RiskAssessment[[#This Row],[S2]]* Table_RiskAssessment[[#This Row],[F2]]* Table_RiskAssessment[[#This Row],[P2]]>0),IF(Table_RiskAssessment[[#This Row],[S2]]=1,IF(Table_RiskAssessment[[#This Row],[F2]]=1,IF(Table_RiskAssessment[[#This Row],[P2]]=1,\"a\",IF(Table_RiskAssessment[[#This Row],[W2]]=1,\"a\",\"b\")),IF(Table_RiskAssessment[[#This Row],[P2]]=1,IF(Table_RiskAssessment[[#This Row],[W2]]=1,\"a\",\"b\"),IF(Table_RiskAssessment[[#This Row],[W2]]=1,\"b\",\"c\"))),IF(Table_RiskAssessment[[#This Row],[F2]]=1,IF(Table_RiskAssessment[[#This Row],[P2]]=1,IF(Table_RiskAssessment[[#This Row],[W2]]=1,\"b\",\"c\"),IF(Table_RiskAssessment[[#This Row],[W2]]=1,\"c\",\"d\")),IF(Table_RiskAssessment[[#This Row],[P2]]=1,IF(Table_RiskAssessment[[#This Row],[W2]]=1,\"c\",\"d\"),IF(Table_RiskAssessment[[#This Row],[W2]]=1,\"d\",\"e\")))),\"?\")","v":"?"},null,null,null,"-"]
[null,null,null,"2006 / 42","1.2.4.3.",{"$f":"Sprache!A$98","v":"Stillsetzen im Notfall "},"x","","x",null,null,null,"---",null,null,null,null,null,null,null,null,null,null,null,null,null,null,null,null,null,null,null,null,{"$f":"IF((Table_RiskAssessment[[#This Row],[S]]* Table_RiskAssessment[[#This Row],[F]]* Table_RiskAssessment[[#This Row],[P]]>0),IF(Table_RiskAssessment[[#This Row],[S]]=1,IF(Table_RiskAssessment[[#This Row],[F]]=1,IF(Table_RiskAssessment[[#This Row],[P]]=1,\"a\",IF(Table_RiskAssessment[[#This Row],[W]]=1,\"a\",\"b\")),IF(Table_RiskAssessment[[#This Row],[P]]=1,IF(Table_RiskAssessment[[#This Row],[W]]=1,\"a\",\"b\"),IF(Table_RiskAssessment[[#This Row],[W]]=1,\"b\",\"c\"))),IF(Table_RiskAssessment[[#This Row],[F]]=1,IF(Table_RiskAssessment[[#This Row],[P]]=1,IF(Table_RiskAssessment[[#This Row],[W]]=1,\"b\",\"c\"),IF(Table_RiskAssessment[[#This Row],[W]]=1,\"c\",\"d\")),IF(Table_RiskAssessment[[#This Row],[P]]=1,IF(Table_RiskAssessment[[#This Row],[W]]=1,\"c\",\"d\"),IF(Table_RiskAssessment[[#This Row],[W]]=1,\"d\",\"e\")))),\"?\")","v":"?"},null,null,null,null,"---",null,null,null,null,null,null,null,null,null,{"$f":"IF((Table_RiskAssessment[[#This Row],[S2]]* Table_RiskAssessment[[#This Row],[F2]]* Table_RiskAssessment[[#This Row],[P2]]>0),IF(Table_RiskAssessment[[#This Row],[S2]]=1,IF(Table_RiskAssessment[[#This Row],[F2]]=1,IF(Table_RiskAssessment[[#This Row],[P2]]=1,\"a\",IF(Table_RiskAssessment[[#This Row],[W2]]=1,\"a\",\"b\")),IF(Table_RiskAssessment[[#This Row],[P2]]=1,IF(Table_RiskAssessment[[#This Row],[W2]]=1,\"a\",\"b\"),IF(Table_RiskAssessment[[#This Row],[W2]]=1,\"b\",\"c\"))),IF(Table_RiskAssessment[[#This Row],[F2]]=1,IF(Table_RiskAssessment[[#This Row],[P2]]=1,IF(Table_RiskAssessment[[#This Row],[W2]]=1,\"b\",\"c\"),IF(Table_RiskAssessment[[#This Row],[W2]]=1,\"c\",\"d\")),IF(Table_RiskAssessment[[#This Row],[P2]]=1,IF(Table_RiskAssessment[[#This Row],[W2]]=1,\"c\",\"d\"),IF(Table_RiskAssessment[[#This Row],[W2]]=1,\"d\",\"e\")))),\"?\")","v":"?"},null,null,null,"-"]
[null,null,null,"2006 / 42","1.2.4.4.",{"$f":"Sprache!A$99","v":"Gesamtheit von Maschinen "},"x","","x",null,null,null,null,null,null,null,null,null,null,null,null,null,null,null,null,null,null,null,null,null,null,null,null,{"$f":"IF((Table_RiskAssessment[[#This Row],[S]]* Table_RiskAssessment[[#This Row],[F]]* Table_RiskAssessment[[#This Row],[P]]>0),IF(Table_RiskAssessment[[#This Row],[S]]=1,IF(Table_RiskAssessment[[#This Row],[F]]=1,IF(Table_RiskAssessment[[#This Row],[P]]=1,\"a\",IF(Table_RiskAssessment[[#This Row],[W]]=1,\"a\",\"b\")),IF(Table_RiskAssessment[[#This Row],[P]]=1,IF(Table_RiskAssessment[[#This Row],[W]]=1,\"a\",\"b\"),IF(Table_RiskAssessment[[#This Row],[W]]=1,\"b\",\"c\"))),IF(Table_RiskAssessment[[#This Row],[F]]=1,IF(Table_RiskAssessment[[#This Row],[P]]=1,IF(Table_RiskAssessment[[#This Row],[W]]=1,\"b\",\"c\"),IF(Table_RiskAssessment[[#This Row],[W]]=1,\"c\",\"d\")),IF(Table_RiskAssessment[[#This Row],[P]]=1,IF(Table_RiskAssessment[[#This Row],[W]]=1,\"c\",\"d\"),IF(Table_RiskAssessment[[#This Row],[W]]=1,\"d\",\"e\")))),\"?\")","v":"?"},null,null,null,null,null,null,null,null,null,null,null,null,null,null,{"$f":"IF((Table_RiskAssessment[[#This Row],[S2]]* Table_RiskAssessment[[#This Row],[F2]]* Table_RiskAssessment[[#This Row],[P2]]>0),IF(Table_RiskAssessment[[#This Row],[S2]]=1,IF(Table_RiskAssessment[[#This Row],[F2]]=1,IF(Table_RiskAssessment[[#This Row],[P2]]=1,\"a\",IF(Table_RiskAssessment[[#This Row],[W2]]=1,\"a\",\"b\")),IF(Table_RiskAssessment[[#This Row],[P2]]=1,IF(Table_RiskAssessment[[#This Row],[W2]]=1,\"a\",\"b\"),IF(Table_RiskAssessment[[#This Row],[W2]]=1,\"b\",\"c\"))),IF(Table_RiskAssessment[[#This Row],[F2]]=1,IF(Table_RiskAssessment[[#This Row],[P2]]=1,IF(Table_RiskAssessment[[#This Row],[W2]]=1,\"b\",\"c\"),IF(Table_RiskAssessment[[#This Row],[W2]]=1,\"c\",\"d\")),IF(Table_RiskAssessment[[#This Row],[P2]]=1,IF(Table_RiskAssessment[[#This Row],[W2]]=1,\"c\",\"d\"),IF(Table_RiskAssessment[[#This Row],[W2]]=1,\"d\",\"e\")))),\"?\")","v":"?"},null,null,null,"-"]
[null,null,null,"2006 / 42","1.2.5.",{"$f":"Sprache!A$100","v":"Wahl der Steuerungs- oder Betriebsarten "},"x","","x",null,null,null,null,null,null,null,null,null,null,null,null,null,null,null,null,null,null,null,null,null,null,null,null,{"$f":"IF((Table_RiskAssessment[[#This Row],[S]]* Table_RiskAssessment[[#This Row],[F]]* Table_RiskAssessment[[#This Row],[P]]>0),IF(Table_RiskAssessment[[#This Row],[S]]=1,IF(Table_RiskAssessment[[#This Row],[F]]=1,IF(Table_RiskAssessment[[#This Row],[P]]=1,\"a\",IF(Table_RiskAssessment[[#This Row],[W]]=1,\"a\",\"b\")),IF(Table_RiskAssessment[[#This Row],[P]]=1,IF(Table_RiskAssessment[[#This Row],[W]]=1,\"a\",\"b\"),IF(Table_RiskAssessment[[#This Row],[W]]=1,\"b\",\"c\"))),IF(Table_RiskAssessment[[#This Row],[F]]=1,IF(Table_RiskAssessment[[#This Row],[P]]=1,IF(Table_RiskAssessment[[#This Row],[W]]=1,\"b\",\"c\"),IF(Table_RiskAssessment[[#This Row],[W]]=1,\"c\",\"d\")),IF(Table_RiskAssessment[[#This Row],[P]]=1,IF(Table_RiskAssessment[[#This Row],[W]]=1,\"c\",\"d\"),IF(Table_RiskAssessment[[#This Row],[W]]=1,\"d\",\"e\")))),\"?\")","v":"?"},null,null,null,null,null,null,null,null,null,null,null,null,null,null,{"$f":"IF((Table_RiskAssessment[[#This Row],[S2]]* Table_RiskAssessment[[#This Row],[F2]]* Table_RiskAssessment[[#This Row],[P2]]>0),IF(Table_RiskAssessment[[#This Row],[S2]]=1,IF(Table_RiskAssessment[[#This Row],[F2]]=1,IF(Table_RiskAssessment[[#This Row],[P2]]=1,\"a\",IF(Table_RiskAssessment[[#This Row],[W2]]=1,\"a\",\"b\")),IF(Table_RiskAssessment[[#This Row],[P2]]=1,IF(Table_RiskAssessment[[#This Row],[W2]]=1,\"a\",\"b\"),IF(Table_RiskAssessment[[#This Row],[W2]]=1,\"b\",\"c\"))),IF(Table_RiskAssessment[[#This Row],[F2]]=1,IF(Table_RiskAssessment[[#This Row],[P2]]=1,IF(Table_RiskAssessment[[#This Row],[W2]]=1,\"b\",\"c\"),IF(Table_RiskAssessment[[#This Row],[W2]]=1,\"c\",\"d\")),IF(Table_RiskAssessment[[#This Row],[P2]]=1,IF(Table_RiskAssessment[[#This Row],[W2]]=1,\"c\",\"d\"),IF(Table_RiskAssessment[[#This Row],[W2]]=1,\"d\",\"e\")))),\"?\")","v":"?"},null,null,null,"-"]
[null,null,null,"2006 / 42","1.2.6.",{"$f":"Sprache!A$101","v":"Störung der Energieversorgung "},"x","","x",null,null,null,null,null,null,null,null,null,null,null,null,null,null,null,null,null,null,null,null,null,null,null,null,{"$f":"IF((Table_RiskAssessment[[#This Row],[S]]* Table_RiskAssessment[[#This Row],[F]]* Table_RiskAssessment[[#This Row],[P]]>0),IF(Table_RiskAssessment[[#This Row],[S]]=1,IF(Table_RiskAssessment[[#This Row],[F]]=1,IF(Table_RiskAssessment[[#This Row],[P]]=1,\"a\",IF(Table_RiskAssessment[[#This Row],[W]]=1,\"a\",\"b\")),IF(Table_RiskAssessment[[#This Row],[P]]=1,IF(Table_RiskAssessment[[#This Row],[W]]=1,\"a\",\"b\"),IF(Table_RiskAssessment[[#This Row],[W]]=1,\"b\",\"c\"))),IF(Table_RiskAssessment[[#This Row],[F]]=1,IF(Table_RiskAssessment[[#This Row],[P]]=1,IF(Table_RiskAssessment[[#This Row],[W]]=1,\"b\",\"c\"),IF(Table_RiskAssessment[[#This Row],[W]]=1,\"c\",\"d\")),IF(Table_RiskAssessment[[#This Row],[P]]=1,IF(Table_RiskAssessment[[#This Row],[W]]=1,\"c\",\"d\"),IF(Table_RiskAssessment[[#This Row],[W]]=1,\"d\",\"e\")))),\"?\")","v":"?"},null,null,null,null,null,null,null,null,null,null,null,null,null,null,{"$f":"IF((Table_RiskAssessment[[#This Row],[S2]]* Table_RiskAssessment[[#This Row],[F2]]* Table_RiskAssessment[[#This Row],[P2]]>0),IF(Table_RiskAssessment[[#This Row],[S2]]=1,IF(Table_RiskAssessment[[#This Row],[F2]]=1,IF(Table_RiskAssessment[[#This Row],[P2]]=1,\"a\",IF(Table_RiskAssessment[[#This Row],[W2]]=1,\"a\",\"b\")),IF(Table_RiskAssessment[[#This Row],[P2]]=1,IF(Table_RiskAssessment[[#This Row],[W2]]=1,\"a\",\"b\"),IF(Table_RiskAssessment[[#This Row],[W2]]=1,\"b\",\"c\"))),IF(Table_RiskAssessment[[#This Row],[F2]]=1,IF(Table_RiskAssessment[[#This Row],[P2]]=1,IF(Table_RiskAssessment[[#This Row],[W2]]=1,\"b\",\"c\"),IF(Table_RiskAssessment[[#This Row],[W2]]=1,\"c\",\"d\")),IF(Table_RiskAssessment[[#This Row],[P2]]=1,IF(Table_RiskAssessment[[#This Row],[W2]]=1,\"c\",\"d\"),IF(Table_RiskAssessment[[#This Row],[W2]]=1,\"d\",\"e\")))),\"?\")","v":"?"},null,null,null,"-"]
[null,null,null,"2006 / 42","1.3.",{"$f":"Sprache!A$102","v":"Schutzmaßnahmen gegen mechanische Gefährdungen "},"x","x","x",null,null,null,null,null,null,null,null,null,null,null,null,null,null,null,null,null,null,null,null,null,null,null,null,{"$f":"IF((Table_RiskAssessment[[#This Row],[S]]* Table_RiskAssessment[[#This Row],[F]]* Table_RiskAssessment[[#This Row],[P]]>0),IF(Table_RiskAssessment[[#This Row],[S]]=1,IF(Table_RiskAssessment[[#This Row],[F]]=1,IF(Table_RiskAssessment[[#This Row],[P]]=1,\"a\",IF(Table_RiskAssessment[[#This Row],[W]]=1,\"a\",\"b\")),IF(Table_RiskAssessment[[#This Row],[P]]=1,IF(Table_RiskAssessment[[#This Row],[W]]=1,\"a\",\"b\"),IF(Table_RiskAssessment[[#This Row],[W]]=1,\"b\",\"c\"))),IF(Table_RiskAssessment[[#This Row],[F]]=1,IF(Table_RiskAssessment[[#This Row],[P]]=1,IF(Table_RiskAssessment[[#This Row],[W]]=1,\"b\",\"c\"),IF(Table_RiskAssessment[[#This Row],[W]]=1,\"c\",\"d\")),IF(Table_RiskAssessment[[#This Row],[P]]=1,IF(Table_RiskAssessment[[#This Row],[W]]=1,\"c\",\"d\"),IF(Table_RiskAssessment[[#This Row],[W]]=1,\"d\",\"e\")))),\"?\")","v":"?"},null,null,null,null,null,null,null,null,null,null,null,null,null,null,{"$f":"IF((Table_RiskAssessment[[#This Row],[S2]]* Table_RiskAssessment[[#This Row],[F2]]* Table_RiskAssessment[[#This Row],[P2]]>0),IF(Table_RiskAssessment[[#This Row],[S2]]=1,IF(Table_RiskAssessment[[#This Row],[F2]]=1,IF(Table_RiskAssessment[[#This Row],[P2]]=1,\"a\",IF(Table_RiskAssessment[[#This Row],[W2]]=1,\"a\",\"b\")),IF(Table_RiskAssessment[[#This Row],[P2]]=1,IF(Table_RiskAssessment[[#This Row],[W2]]=1,\"a\",\"b\"),IF(Table_RiskAssessment[[#This Row],[W2]]=1,\"b\",\"c\"))),IF(Table_RiskAssessment[[#This Row],[F2]]=1,IF(Table_RiskAssessment[[#This Row],[P2]]=1,IF(Table_RiskAssessment[[#This Row],[W2]]=1,\"b\",\"c\"),IF(Table_RiskAssessment[[#This Row],[W2]]=1,\"c\",\"d\")),IF(Table_RiskAssessment[[#This Row],[P2]]=1,IF(Table_RiskAssessment[[#This Row],[W2]]=1,\"c\",\"d\"),IF(Table_RiskAssessment[[#This Row],[W2]]=1,\"d\",\"e\")))),\"?\")","v":"?"},null,null,null,"-"]
[null,null,null,"2006 / 42","1.3.1.",{"$f":"Sprache!A$103","v":"Risiko des Verlusts der Standsicherheit "},"x","","x",null,null,null,null,null,null,null,null,null,null,null,null,null,null,null,null,null,null,null,null,null,null,null,null,{"$f":"IF((Table_RiskAssessment[[#This Row],[S]]* Table_RiskAssessment[[#This Row],[F]]* Table_RiskAssessment[[#This Row],[P]]>0),IF(Table_RiskAssessment[[#This Row],[S]]=1,IF(Table_RiskAssessment[[#This Row],[F]]=1,IF(Table_RiskAssessment[[#This Row],[P]]=1,\"a\",IF(Table_RiskAssessment[[#This Row],[W]]=1,\"a\",\"b\")),IF(Table_RiskAssessment[[#This Row],[P]]=1,IF(Table_RiskAssessment[[#This Row],[W]]=1,\"a\",\"b\"),IF(Table_RiskAssessment[[#This Row],[W]]=1,\"b\",\"c\"))),IF(Table_RiskAssessment[[#This Row],[F]]=1,IF(Table_RiskAssessment[[#This Row],[P]]=1,IF(Table_RiskAssessment[[#This Row],[W]]=1,\"b\",\"c\"),IF(Table_RiskAssessment[[#This Row],[W]]=1,\"c\",\"d\")),IF(Table_RiskAssessment[[#This Row],[P]]=1,IF(Table_RiskAssessment[[#This Row],[W]]=1,\"c\",\"d\"),IF(Table_RiskAssessment[[#This Row],[W]]=1,\"d\",\"e\")))),\"?\")","v":"?"},null,null,null,null,null,null,null,null,null,null,null,null,null,null,{"$f":"IF((Table_RiskAssessment[[#This Row],[S2]]* Table_RiskAssessment[[#This Row],[F2]]* Table_RiskAssessment[[#This Row],[P2]]>0),IF(Table_RiskAssessment[[#This Row],[S2]]=1,IF(Table_RiskAssessment[[#This Row],[F2]]=1,IF(Table_RiskAssessment[[#This Row],[P2]]=1,\"a\",IF(Table_RiskAssessment[[#This Row],[W2]]=1,\"a\",\"b\")),IF(Table_RiskAssessment[[#This Row],[P2]]=1,IF(Table_RiskAssessment[[#This Row],[W2]]=1,\"a\",\"b\"),IF(Table_RiskAssessment[[#This Row],[W2]]=1,\"b\",\"c\"))),IF(Table_RiskAssessment[[#This Row],[F2]]=1,IF(Table_RiskAssessment[[#This Row],[P2]]=1,IF(Table_RiskAssessment[[#This Row],[W2]]=1,\"b\",\"c\"),IF(Table_RiskAssessment[[#This Row],[W2]]=1,\"c\",\"d\")),IF(Table_RiskAssessment[[#This Row],[P2]]=1,IF(Table_RiskAssessment[[#This Row],[W2]]=1,\"c\",\"d\"),IF(Table_RiskAssessment[[#This Row],[W2]]=1,\"d\",\"e\")))),\"?\")","v":"?"},null,null,null,"-"]
[null,null,null,"2006 / 42","1.3.2.",{"$f":"Sprache!A$104","v":"Bruchrisiko beim Betrieb "},"x","","x",null,null,null,"---",null,null,null,null,null,null,null,null,null,null,null,null,null,null,null,null,null,null,null,null,{"$f":"IF((Table_RiskAssessment[[#This Row],[S]]* Table_RiskAssessment[[#This Row],[F]]* Table_RiskAssessment[[#This Row],[P]]>0),IF(Table_RiskAssessment[[#This Row],[S]]=1,IF(Table_RiskAssessment[[#This Row],[F]]=1,IF(Table_RiskAssessment[[#This Row],[P]]=1,\"a\",IF(Table_RiskAssessment[[#This Row],[W]]=1,\"a\",\"b\")),IF(Table_RiskAssessment[[#This Row],[P]]=1,IF(Table_RiskAssessment[[#This Row],[W]]=1,\"a\",\"b\"),IF(Table_RiskAssessment[[#This Row],[W]]=1,\"b\",\"c\"))),IF(Table_RiskAssessment[[#This Row],[F]]=1,IF(Table_RiskAssessment[[#This Row],[P]]=1,IF(Table_RiskAssessment[[#This Row],[W]]=1,\"b\",\"c\"),IF(Table_RiskAssessment[[#This Row],[W]]=1,\"c\",\"d\")),IF(Table_RiskAssessment[[#This Row],[P]]=1,IF(Table_RiskAssessment[[#This Row],[W]]=1,\"c\",\"d\"),IF(Table_RiskAssessment[[#This Row],[W]]=1,\"d\",\"e\")))),\"?\")","v":"?"},null,null,null,null,"---",null,null,null,null,null,null,null,null,null,{"$f":"IF((Table_RiskAssessment[[#This Row],[S2]]* Table_RiskAssessment[[#This Row],[F2]]* Table_RiskAssessment[[#This Row],[P2]]>0),IF(Table_RiskAssessment[[#This Row],[S2]]=1,IF(Table_RiskAssessment[[#This Row],[F2]]=1,IF(Table_RiskAssessment[[#This Row],[P2]]=1,\"a\",IF(Table_RiskAssessment[[#This Row],[W2]]=1,\"a\",\"b\")),IF(Table_RiskAssessment[[#This Row],[P2]]=1,IF(Table_RiskAssessment[[#This Row],[W2]]=1,\"a\",\"b\"),IF(Table_RiskAssessment[[#This Row],[W2]]=1,\"b\",\"c\"))),IF(Table_RiskAssessment[[#This Row],[F2]]=1,IF(Table_RiskAssessment[[#This Row],[P2]]=1,IF(Table_RiskAssessment[[#This Row],[W2]]=1,\"b\",\"c\"),IF(Table_RiskAssessment[[#This Row],[W2]]=1,\"c\",\"d\")),IF(Table_RiskAssessment[[#This Row],[P2]]=1,IF(Table_RiskAssessment[[#This Row],[W2]]=1,\"c\",\"d\"),IF(Table_RiskAssessment[[#This Row],[W2]]=1,\"d\",\"e\")))),\"?\")","v":"?"},null,null,null,"-"]
[null,null,null,"2006 / 42","1.3.3.",{"$f":"Sprache!A$105","v":"Risiken durch herabfallende oder herausgeschleuderte Gegenstände "},"x","","x",null,null,null,null,null,null,null,null,null,null,null,null,null,null,null,null,null,null,null,null,null,null,null,null,{"$f":"IF((Table_RiskAssessment[[#This Row],[S]]* Table_RiskAssessment[[#This Row],[F]]* Table_RiskAssessment[[#This Row],[P]]>0),IF(Table_RiskAssessment[[#This Row],[S]]=1,IF(Table_RiskAssessment[[#This Row],[F]]=1,IF(Table_RiskAssessment[[#This Row],[P]]=1,\"a\",IF(Table_RiskAssessment[[#This Row],[W]]=1,\"a\",\"b\")),IF(Table_RiskAssessment[[#This Row],[P]]=1,IF(Table_RiskAssessment[[#This Row],[W]]=1,\"a\",\"b\"),IF(Table_RiskAssessment[[#This Row],[W]]=1,\"b\",\"c\"))),IF(Table_RiskAssessment[[#This Row],[F]]=1,IF(Table_RiskAssessment[[#This Row],[P]]=1,IF(Table_RiskAssessment[[#This Row],[W]]=1,\"b\",\"c\"),IF(Table_RiskAssessment[[#This Row],[W]]=1,\"c\",\"d\")),IF(Table_RiskAssessment[[#This Row],[P]]=1,IF(Table_RiskAssessment[[#This Row],[W]]=1,\"c\",\"d\"),IF(Table_RiskAssessment[[#This Row],[W]]=1,\"d\",\"e\")))),\"?\")","v":"?"},null,null,null,null,null,null,null,null,null,null,null,null,null,null,{"$f":"IF((Table_RiskAssessment[[#This Row],[S2]]* Table_RiskAssessment[[#This Row],[F2]]* Table_RiskAssessment[[#This Row],[P2]]>0),IF(Table_RiskAssessment[[#This Row],[S2]]=1,IF(Table_RiskAssessment[[#This Row],[F2]]=1,IF(Table_RiskAssessment[[#This Row],[P2]]=1,\"a\",IF(Table_RiskAssessment[[#This Row],[W2]]=1,\"a\",\"b\")),IF(Table_RiskAssessment[[#This Row],[P2]]=1,IF(Table_RiskAssessment[[#This Row],[W2]]=1,\"a\",\"b\"),IF(Table_RiskAssessment[[#This Row],[W2]]=1,\"b\",\"c\"))),IF(Table_RiskAssessment[[#This Row],[F2]]=1,IF(Table_RiskAssessment[[#This Row],[P2]]=1,IF(Table_RiskAssessment[[#This Row],[W2]]=1,\"b\",\"c\"),IF(Table_RiskAssessment[[#This Row],[W2]]=1,\"c\",\"d\")),IF(Table_RiskAssessment[[#This Row],[P2]]=1,IF(Table_RiskAssessment[[#This Row],[W2]]=1,\"c\",\"d\"),IF(Table_RiskAssessment[[#This Row],[W2]]=1,\"d\",\"e\")))),\"?\")","v":"?"},null,null,null,"-"]
[null,null,null,"2006 / 42","1.3.4.",{"$f":"Sprache!A$106","v":"Risiken durch Oberflächen, Kanten und Ecken "},"x","","x",null,null,null,null,null,null,null,null,null,null,null,null,null,null,null,null,null,null,null,null,null,null,null,null,{"$f":"IF((Table_RiskAssessment[[#This Row],[S]]* Table_RiskAssessment[[#This Row],[F]]* Table_RiskAssessment[[#This Row],[P]]>0),IF(Table_RiskAssessment[[#This Row],[S]]=1,IF(Table_RiskAssessment[[#This Row],[F]]=1,IF(Table_RiskAssessment[[#This Row],[P]]=1,\"a\",IF(Table_RiskAssessment[[#This Row],[W]]=1,\"a\",\"b\")),IF(Table_RiskAssessment[[#This Row],[P]]=1,IF(Table_RiskAssessment[[#This Row],[W]]=1,\"a\",\"b\"),IF(Table_RiskAssessment[[#This Row],[W]]=1,\"b\",\"c\"))),IF(Table_RiskAssessment[[#This Row],[F]]=1,IF(Table_RiskAssessment[[#This Row],[P]]=1,IF(Table_RiskAssessment[[#This Row],[W]]=1,\"b\",\"c\"),IF(Table_RiskAssessment[[#This Row],[W]]=1,\"c\",\"d\")),IF(Table_RiskAssessment[[#This Row],[P]]=1,IF(Table_RiskAssessment[[#This Row],[W]]=1,\"c\",\"d\"),IF(Table_RiskAssessment[[#This Row],[W]]=1,\"d\",\"e\")))),\"?\")","v":"?"},null,null,null,null,null,null,null,null,null,null,null,null,null,null,{"$f":"IF((Table_RiskAssessment[[#This Row],[S2]]* Table_RiskAssessment[[#This Row],[F2]]* Table_RiskAssessment[[#This Row],[P2]]>0),IF(Table_RiskAssessment[[#This Row],[S2]]=1,IF(Table_RiskAssessment[[#This Row],[F2]]=1,IF(Table_RiskAssessment[[#This Row],[P2]]=1,\"a\",IF(Table_RiskAssessment[[#This Row],[W2]]=1,\"a\",\"b\")),IF(Table_RiskAssessment[[#This Row],[P2]]=1,IF(Table_RiskAssessment[[#This Row],[W2]]=1,\"a\",\"b\"),IF(Table_RiskAssessment[[#This Row],[W2]]=1,\"b\",\"c\"))),IF(Table_RiskAssessment[[#This Row],[F2]]=1,IF(Table_RiskAssessment[[#This Row],[P2]]=1,IF(Table_RiskAssessment[[#This Row],[W2]]=1,\"b\",\"c\"),IF(Table_RiskAssessment[[#This Row],[W2]]=1,\"c\",\"d\")),IF(Table_RiskAssessment[[#This Row],[P2]]=1,IF(Table_RiskAssessment[[#This Row],[W2]]=1,\"c\",\"d\"),IF(Table_RiskAssessment[[#This Row],[W2]]=1,\"d\",\"e\")))),\"?\")","v":"?"},null,null,null,"-"]
[null,null,null,"2006 / 42","1.3.5.",{"$f":"Sprache!A$107","v":"Risiken durch mehrfach kombinierte Maschinen "},"x","","x",null,null,null,null,null,null,null,null,null,null,null,null,null,null,null,null,null,null,null,null,null,null,null,null,{"$f":"IF((Table_RiskAssessment[[#This Row],[S]]* Table_RiskAssessment[[#This Row],[F]]* Table_RiskAssessment[[#This Row],[P]]>0),IF(Table_RiskAssessment[[#This Row],[S]]=1,IF(Table_RiskAssessment[[#This Row],[F]]=1,IF(Table_RiskAssessment[[#This Row],[P]]=1,\"a\",IF(Table_RiskAssessment[[#This Row],[W]]=1,\"a\",\"b\")),IF(Table_RiskAssessment[[#This Row],[P]]=1,IF(Table_RiskAssessment[[#This Row],[W]]=1,\"a\",\"b\"),IF(Table_RiskAssessment[[#This Row],[W]]=1,\"b\",\"c\"))),IF(Table_RiskAssessment[[#This Row],[F]]=1,IF(Table_RiskAssessment[[#This Row],[P]]=1,IF(Table_RiskAssessment[[#This Row],[W]]=1,\"b\",\"c\"),IF(Table_RiskAssessment[[#This Row],[W]]=1,\"c\",\"d\")),IF(Table_RiskAssessment[[#This Row],[P]]=1,IF(Table_RiskAssessment[[#This Row],[W]]=1,\"c\",\"d\"),IF(Table_RiskAssessment[[#This Row],[W]]=1,\"d\",\"e\")))),\"?\")","v":"?"},null,null,null,null,null,null,null,null,null,null,null,null,null,null,{"$f":"IF((Table_RiskAssessment[[#This Row],[S2]]* Table_RiskAssessment[[#This Row],[F2]]* Table_RiskAssessment[[#This Row],[P2]]>0),IF(Table_RiskAssessment[[#This Row],[S2]]=1,IF(Table_RiskAssessment[[#This Row],[F2]]=1,IF(Table_RiskAssessment[[#This Row],[P2]]=1,\"a\",IF(Table_RiskAssessment[[#This Row],[W2]]=1,\"a\",\"b\")),IF(Table_RiskAssessment[[#This Row],[P2]]=1,IF(Table_RiskAssessment[[#This Row],[W2]]=1,\"a\",\"b\"),IF(Table_RiskAssessment[[#This Row],[W2]]=1,\"b\",\"c\"))),IF(Table_RiskAssessment[[#This Row],[F2]]=1,IF(Table_RiskAssessment[[#This Row],[P2]]=1,IF(Table_RiskAssessment[[#This Row],[W2]]=1,\"b\",\"c\"),IF(Table_RiskAssessment[[#This Row],[W2]]=1,\"c\",\"d\")),IF(Table_RiskAssessment[[#This Row],[P2]]=1,IF(Table_RiskAssessment[[#This Row],[W2]]=1,\"c\",\"d\"),IF(Table_RiskAssessment[[#This Row],[W2]]=1,\"d\",\"e\")))),\"?\")","v":"?"},null,null,null,"-"]
[null,null,null,"2006 / 42","1.3.6.",{"$f":"Sprache!A$108","v":"Risiken durch Änderung der Verwendungsbedingungen "},"x","","x",null,null,null,null,null,null,null,null,null,null,null,null,null,null,null,null,null,null,null,null,null,null,null,null,{"$f":"IF((Table_RiskAssessment[[#This Row],[S]]* Table_RiskAssessment[[#This Row],[F]]* Table_RiskAssessment[[#This Row],[P]]>0),IF(Table_RiskAssessment[[#This Row],[S]]=1,IF(Table_RiskAssessment[[#This Row],[F]]=1,IF(Table_RiskAssessment[[#This Row],[P]]=1,\"a\",IF(Table_RiskAssessment[[#This Row],[W]]=1,\"a\",\"b\")),IF(Table_RiskAssessment[[#This Row],[P]]=1,IF(Table_RiskAssessment[[#This Row],[W]]=1,\"a\",\"b\"),IF(Table_RiskAssessment[[#This Row],[W]]=1,\"b\",\"c\"))),IF(Table_RiskAssessment[[#This Row],[F]]=1,IF(Table_RiskAssessment[[#This Row],[P]]=1,IF(Table_RiskAssessment[[#This Row],[W]]=1,\"b\",\"c\"),IF(Table_RiskAssessment[[#This Row],[W]]=1,\"c\",\"d\")),IF(Table_RiskAssessment[[#This Row],[P]]=1,IF(Table_RiskAssessment[[#This Row],[W]]=1,\"c\",\"d\"),IF(Table_RiskAssessment[[#This Row],[W]]=1,\"d\",\"e\")))),\"?\")","v":"?"},null,null,null,null,null,null,null,null,null,null,null,null,null,null,{"$f":"IF((Table_RiskAssessment[[#This Row],[S2]]* Table_RiskAssessment[[#This Row],[F2]]* Table_RiskAssessment[[#This Row],[P2]]>0),IF(Table_RiskAssessment[[#This Row],[S2]]=1,IF(Table_RiskAssessment[[#This Row],[F2]]=1,IF(Table_RiskAssessment[[#This Row],[P2]]=1,\"a\",IF(Table_RiskAssessment[[#This Row],[W2]]=1,\"a\",\"b\")),IF(Table_RiskAssessment[[#This Row],[P2]]=1,IF(Table_RiskAssessment[[#This Row],[W2]]=1,\"a\",\"b\"),IF(Table_RiskAssessment[[#This Row],[W2]]=1,\"b\",\"c\"))),IF(Table_RiskAssessment[[#This Row],[F2]]=1,IF(Table_RiskAssessment[[#This Row],[P2]]=1,IF(Table_RiskAssessment[[#This Row],[W2]]=1,\"b\",\"c\"),IF(Table_RiskAssessment[[#This Row],[W2]]=1,\"c\",\"d\")),IF(Table_RiskAssessment[[#This Row],[P2]]=1,IF(Table_RiskAssessment[[#This Row],[W2]]=1,\"c\",\"d\"),IF(Table_RiskAssessment[[#This Row],[W2]]=1,\"d\",\"e\")))),\"?\")","v":"?"},null,null,null,"-"]
[null,null,null,"2006 / 42","1.3.7.",{"$f":"Sprache!A$109","v":"Risiken durch bewegliche Teile "},"x","","x",null,null,null,"---",null,null,null,null,null,null,null,null,null,null,null,null,null,null,null,null,null,null,null,null,{"$f":"IF((Table_RiskAssessment[[#This Row],[S]]* Table_RiskAssessment[[#This Row],[F]]* Table_RiskAssessment[[#This Row],[P]]>0),IF(Table_RiskAssessment[[#This Row],[S]]=1,IF(Table_RiskAssessment[[#This Row],[F]]=1,IF(Table_RiskAssessment[[#This Row],[P]]=1,\"a\",IF(Table_RiskAssessment[[#This Row],[W]]=1,\"a\",\"b\")),IF(Table_RiskAssessment[[#This Row],[P]]=1,IF(Table_RiskAssessment[[#This Row],[W]]=1,\"a\",\"b\"),IF(Table_RiskAssessment[[#This Row],[W]]=1,\"b\",\"c\"))),IF(Table_RiskAssessment[[#This Row],[F]]=1,IF(Table_RiskAssessment[[#This Row],[P]]=1,IF(Table_RiskAssessment[[#This Row],[W]]=1,\"b\",\"c\"),IF(Table_RiskAssessment[[#This Row],[W]]=1,\"c\",\"d\")),IF(Table_RiskAssessment[[#This Row],[P]]=1,IF(Table_RiskAssessment[[#This Row],[W]]=1,\"c\",\"d\"),IF(Table_RiskAssessment[[#This Row],[W]]=1,\"d\",\"e\")))),\"?\")","v":"?"},null,null,null,null,"---",null,null,null,null,null,null,null,null,null,{"$f":"IF((Table_RiskAssessment[[#This Row],[S2]]* Table_RiskAssessment[[#This Row],[F2]]* Table_RiskAssessment[[#This Row],[P2]]>0),IF(Table_RiskAssessment[[#This Row],[S2]]=1,IF(Table_RiskAssessment[[#This Row],[F2]]=1,IF(Table_RiskAssessment[[#This Row],[P2]]=1,\"a\",IF(Table_RiskAssessment[[#This Row],[W2]]=1,\"a\",\"b\")),IF(Table_RiskAssessment[[#This Row],[P2]]=1,IF(Table_RiskAssessment[[#This Row],[W2]]=1,\"a\",\"b\"),IF(Table_RiskAssessment[[#This Row],[W2]]=1,\"b\",\"c\"))),IF(Table_RiskAssessment[[#This Row],[F2]]=1,IF(Table_RiskAssessment[[#This Row],[P2]]=1,IF(Table_RiskAssessment[[#This Row],[W2]]=1,\"b\",\"c\"),IF(Table_RiskAssessment[[#This Row],[W2]]=1,\"c\",\"d\")),IF(Table_RiskAssessment[[#This Row],[P2]]=1,IF(Table_RiskAssessment[[#This Row],[W2]]=1,\"c\",\"d\"),IF(Table_RiskAssessment[[#This Row],[W2]]=1,\"d\",\"e\")))),\"?\")","v":"?"},null,null,null,"-"]
[null,null,null,"2006 / 42","1.3.8.",{"$f":"Sprache!A$110","v":"Wahl der Schutzeinrichtungen gegen Risiken durch bewegliche Teile "},"x","x","x",null,null,null,null,null,null,null,null,null,null,null,null,null,null,null,null,null,null,null,null,null,null,null,null,{"$f":"IF((Table_RiskAssessment[[#This Row],[S]]* Table_RiskAssessment[[#This Row],[F]]* Table_RiskAssessment[[#This Row],[P]]>0),IF(Table_RiskAssessment[[#This Row],[S]]=1,IF(Table_RiskAssessment[[#This Row],[F]]=1,IF(Table_RiskAssessment[[#This Row],[P]]=1,\"a\",IF(Table_RiskAssessment[[#This Row],[W]]=1,\"a\",\"b\")),IF(Table_RiskAssessment[[#This Row],[P]]=1,IF(Table_RiskAssessment[[#This Row],[W]]=1,\"a\",\"b\"),IF(Table_RiskAssessment[[#This Row],[W]]=1,\"b\",\"c\"))),IF(Table_RiskAssessment[[#This Row],[F]]=1,IF(Table_RiskAssessment[[#This Row],[P]]=1,IF(Table_RiskAssessment[[#This Row],[W]]=1,\"b\",\"c\"),IF(Table_RiskAssessment[[#This Row],[W]]=1,\"c\",\"d\")),IF(Table_RiskAssessment[[#This Row],[P]]=1,IF(Table_RiskAssessment[[#This Row],[W]]=1,\"c\",\"d\"),IF(Table_RiskAssessment[[#This Row],[W]]=1,\"d\",\"e\")))),\"?\")","v":"?"},null,null,null,null,null,null,null,null,null,null,null,null,null,null,{"$f":"IF((Table_RiskAssessment[[#This Row],[S2]]* Table_RiskAssessment[[#This Row],[F2]]* Table_RiskAssessment[[#This Row],[P2]]>0),IF(Table_RiskAssessment[[#This Row],[S2]]=1,IF(Table_RiskAssessment[[#This Row],[F2]]=1,IF(Table_RiskAssessment[[#This Row],[P2]]=1,\"a\",IF(Table_RiskAssessment[[#This Row],[W2]]=1,\"a\",\"b\")),IF(Table_RiskAssessment[[#This Row],[P2]]=1,IF(Table_RiskAssessment[[#This Row],[W2]]=1,\"a\",\"b\"),IF(Table_RiskAssessment[[#This Row],[W2]]=1,\"b\",\"c\"))),IF(Table_RiskAssessment[[#This Row],[F2]]=1,IF(Table_RiskAssessment[[#This Row],[P2]]=1,IF(Table_RiskAssessment[[#This Row],[W2]]=1,\"b\",\"c\"),IF(Table_RiskAssessment[[#This Row],[W2]]=1,\"c\",\"d\")),IF(Table_RiskAssessment[[#This Row],[P2]]=1,IF(Table_RiskAssessment[[#This Row],[W2]]=1,\"c\",\"d\"),IF(Table_RiskAssessment[[#This Row],[W2]]=1,\"d\",\"e\")))),\"?\")","v":"?"},null,null,null,"-"]
[null,null,null,"2006 / 42","1.3.8.1.",{"$f":"Sprache!A$111","v":"Bewegliche Teile der Kraftübertragung "},"x","","x",null,null,null,null,null,null,null,null,null,null,null,null,null,null,null,null,null,null,null,null,null,null,null,null,{"$f":"IF((Table_RiskAssessment[[#This Row],[S]]* Table_RiskAssessment[[#This Row],[F]]* Table_RiskAssessment[[#This Row],[P]]>0),IF(Table_RiskAssessment[[#This Row],[S]]=1,IF(Table_RiskAssessment[[#This Row],[F]]=1,IF(Table_RiskAssessment[[#This Row],[P]]=1,\"a\",IF(Table_RiskAssessment[[#This Row],[W]]=1,\"a\",\"b\")),IF(Table_RiskAssessment[[#This Row],[P]]=1,IF(Table_RiskAssessment[[#This Row],[W]]=1,\"a\",\"b\"),IF(Table_RiskAssessment[[#This Row],[W]]=1,\"b\",\"c\"))),IF(Table_RiskAssessment[[#This Row],[F]]=1,IF(Table_RiskAssessment[[#This Row],[P]]=1,IF(Table_RiskAssessment[[#This Row],[W]]=1,\"b\",\"c\"),IF(Table_RiskAssessment[[#This Row],[W]]=1,\"c\",\"d\")),IF(Table_RiskAssessment[[#This Row],[P]]=1,IF(Table_RiskAssessment[[#This Row],[W]]=1,\"c\",\"d\"),IF(Table_RiskAssessment[[#This Row],[W]]=1,\"d\",\"e\")))),\"?\")","v":"?"},null,null,null,null,null,null,null,null,null,null,null,null,null,null,{"$f":"IF((Table_RiskAssessment[[#This Row],[S2]]* Table_RiskAssessment[[#This Row],[F2]]* Table_RiskAssessment[[#This Row],[P2]]>0),IF(Table_RiskAssessment[[#This Row],[S2]]=1,IF(Table_RiskAssessment[[#This Row],[F2]]=1,IF(Table_RiskAssessment[[#This Row],[P2]]=1,\"a\",IF(Table_RiskAssessment[[#This Row],[W2]]=1,\"a\",\"b\")),IF(Table_RiskAssessment[[#This Row],[P2]]=1,IF(Table_RiskAssessment[[#This Row],[W2]]=1,\"a\",\"b\"),IF(Table_RiskAssessment[[#This Row],[W2]]=1,\"b\",\"c\"))),IF(Table_RiskAssessment[[#This Row],[F2]]=1,IF(Table_RiskAssessment[[#This Row],[P2]]=1,IF(Table_RiskAssessment[[#This Row],[W2]]=1,\"b\",\"c\"),IF(Table_RiskAssessment[[#This Row],[W2]]=1,\"c\",\"d\")),IF(Table_RiskAssessment[[#This Row],[P2]]=1,IF(Table_RiskAssessment[[#This Row],[W2]]=1,\"c\",\"d\"),IF(Table_RiskAssessment[[#This Row],[W2]]=1,\"d\",\"e\")))),\"?\")","v":"?"},null,null,null,"-"]
[null,null,null,"2006 / 42","1.3.8.2.",{"$f":"Sprache!A$112","v":"Bewegliche Teile, die am Arbeitsprozess beteiligt sind "},"x","","x",null,null,null,null,null,null,null,null,null,null,null,null,null,null,null,null,null,null,null,null,null,null,null,null,{"$f":"IF((Table_RiskAssessment[[#This Row],[S]]* Table_RiskAssessment[[#This Row],[F]]* Table_RiskAssessment[[#This Row],[P]]>0),IF(Table_RiskAssessment[[#This Row],[S]]=1,IF(Table_RiskAssessment[[#This Row],[F]]=1,IF(Table_RiskAssessment[[#This Row],[P]]=1,\"a\",IF(Table_RiskAssessment[[#This Row],[W]]=1,\"a\",\"b\")),IF(Table_RiskAssessment[[#This Row],[P]]=1,IF(Table_RiskAssessment[[#This Row],[W]]=1,\"a\",\"b\"),IF(Table_RiskAssessment[[#This Row],[W]]=1,\"b\",\"c\"))),IF(Table_RiskAssessment[[#This Row],[F]]=1,IF(Table_RiskAssessment[[#This Row],[P]]=1,IF(Table_RiskAssessment[[#This Row],[W]]=1,\"b\",\"c\"),IF(Table_RiskAssessment[[#This Row],[W]]=1,\"c\",\"d\")),IF(Table_RiskAssessment[[#This Row],[P]]=1,IF(Table_RiskAssessment[[#This Row],[W]]=1,\"c\",\"d\"),IF(Table_RiskAssessment[[#This Row],[W]]=1,\"d\",\"e\")))),\"?\")","v":"?"},null,null,null,null,null,null,null,null,null,null,null,null,null,null,{"$f":"IF((Table_RiskAssessment[[#This Row],[S2]]* Table_RiskAssessment[[#This Row],[F2]]* Table_RiskAssessment[[#This Row],[P2]]>0),IF(Table_RiskAssessment[[#This Row],[S2]]=1,IF(Table_RiskAssessment[[#This Row],[F2]]=1,IF(Table_RiskAssessment[[#This Row],[P2]]=1,\"a\",IF(Table_RiskAssessment[[#This Row],[W2]]=1,\"a\",\"b\")),IF(Table_RiskAssessment[[#This Row],[P2]]=1,IF(Table_RiskAssessment[[#This Row],[W2]]=1,\"a\",\"b\"),IF(Table_RiskAssessment[[#This Row],[W2]]=1,\"b\",\"c\"))),IF(Table_RiskAssessment[[#This Row],[F2]]=1,IF(Table_RiskAssessment[[#This Row],[P2]]=1,IF(Table_RiskAssessment[[#This Row],[W2]]=1,\"b\",\"c\"),IF(Table_RiskAssessment[[#This Row],[W2]]=1,\"c\",\"d\")),IF(Table_RiskAssessment[[#This Row],[P2]]=1,IF(Table_RiskAssessment[[#This Row],[W2]]=1,\"c\",\"d\"),IF(Table_RiskAssessment[[#This Row],[W2]]=1,\"d\",\"e\")))),\"?\")","v":"?"},null,null,null,"-"]
[null,null,null,"2006 / 42","1.3.9.",{"$f":"Sprache!A$113","v":"Risiko unkontrollierter Bewegungen "},"x","","x",null,null,null,null,null,null,null,null,null,null,null,null,null,null,null,null,null,null,null,null,null,null,null,null,{"$f":"IF((Table_RiskAssessment[[#This Row],[S]]* Table_RiskAssessment[[#This Row],[F]]* Table_RiskAssessment[[#This Row],[P]]>0),IF(Table_RiskAssessment[[#This Row],[S]]=1,IF(Table_RiskAssessment[[#This Row],[F]]=1,IF(Table_RiskAssessment[[#This Row],[P]]=1,\"a\",IF(Table_RiskAssessment[[#This Row],[W]]=1,\"a\",\"b\")),IF(Table_RiskAssessment[[#This Row],[P]]=1,IF(Table_RiskAssessment[[#This Row],[W]]=1,\"a\",\"b\"),IF(Table_RiskAssessment[[#This Row],[W]]=1,\"b\",\"c\"))),IF(Table_RiskAssessment[[#This Row],[F]]=1,IF(Table_RiskAssessment[[#This Row],[P]]=1,IF(Table_RiskAssessment[[#This Row],[W]]=1,\"b\",\"c\"),IF(Table_RiskAssessment[[#This Row],[W]]=1,\"c\",\"d\")),IF(Table_RiskAssessment[[#This Row],[P]]=1,IF(Table_RiskAssessment[[#This Row],[W]]=1,\"c\",\"d\"),IF(Table_RiskAssessment[[#This Row],[W]]=1,\"d\",\"e\")))),\"?\")","v":"?"},null,null,null,null,null,null,null,null,null,null,null,null,null,null,{"$f":"IF((Table_RiskAssessment[[#This Row],[S2]]* Table_RiskAssessment[[#This Row],[F2]]* Table_RiskAssessment[[#This Row],[P2]]>0),IF(Table_RiskAssessment[[#This Row],[S2]]=1,IF(Table_RiskAssessment[[#This Row],[F2]]=1,IF(Table_RiskAssessment[[#This Row],[P2]]=1,\"a\",IF(Table_RiskAssessment[[#This Row],[W2]]=1,\"a\",\"b\")),IF(Table_RiskAssessment[[#This Row],[P2]]=1,IF(Table_RiskAssessment[[#This Row],[W2]]=1,\"a\",\"b\"),IF(Table_RiskAssessment[[#This Row],[W2]]=1,\"b\",\"c\"))),IF(Table_RiskAssessment[[#This Row],[F2]]=1,IF(Table_RiskAssessment[[#This Row],[P2]]=1,IF(Table_RiskAssessment[[#This Row],[W2]]=1,\"b\",\"c\"),IF(Table_RiskAssessment[[#This Row],[W2]]=1,\"c\",\"d\")),IF(Table_RiskAssessment[[#This Row],[P2]]=1,IF(Table_RiskAssessment[[#This Row],[W2]]=1,\"c\",\"d\"),IF(Table_RiskAssessment[[#This Row],[W2]]=1,\"d\",\"e\")))),\"?\")","v":"?"},null,null,null,"-"]
[null,null,null,"2006 / 42","1.4.",{"$f":"Sprache!A$114","v":"Anforderungen an Schutzeinrichtungen "},"x","x","x",null,null,null,null,null,null,null,null,null,null,null,null,null,null,null,null,null,null,null,null,null,null,null,null,{"$f":"IF((Table_RiskAssessment[[#This Row],[S]]* Table_RiskAssessment[[#This Row],[F]]* Table_RiskAssessment[[#This Row],[P]]>0),IF(Table_RiskAssessment[[#This Row],[S]]=1,IF(Table_RiskAssessment[[#This Row],[F]]=1,IF(Table_RiskAssessment[[#This Row],[P]]=1,\"a\",IF(Table_RiskAssessment[[#This Row],[W]]=1,\"a\",\"b\")),IF(Table_RiskAssessment[[#This Row],[P]]=1,IF(Table_RiskAssessment[[#This Row],[W]]=1,\"a\",\"b\"),IF(Table_RiskAssessment[[#This Row],[W]]=1,\"b\",\"c\"))),IF(Table_RiskAssessment[[#This Row],[F]]=1,IF(Table_RiskAssessment[[#This Row],[P]]=1,IF(Table_RiskAssessment[[#This Row],[W]]=1,\"b\",\"c\"),IF(Table_RiskAssessment[[#This Row],[W]]=1,\"c\",\"d\")),IF(Table_RiskAssessment[[#This Row],[P]]=1,IF(Table_RiskAssessment[[#This Row],[W]]=1,\"c\",\"d\"),IF(Table_RiskAssessment[[#This Row],[W]]=1,\"d\",\"e\")))),\"?\")","v":"?"},null,null,null,null,null,null,null,null,null,null,null,null,null,null,{"$f":"IF((Table_RiskAssessment[[#This Row],[S2]]* Table_RiskAssessment[[#This Row],[F2]]* Table_RiskAssessment[[#This Row],[P2]]>0),IF(Table_RiskAssessment[[#This Row],[S2]]=1,IF(Table_RiskAssessment[[#This Row],[F2]]=1,IF(Table_RiskAssessment[[#This Row],[P2]]=1,\"a\",IF(Table_RiskAssessment[[#This Row],[W2]]=1,\"a\",\"b\")),IF(Table_RiskAssessment[[#This Row],[P2]]=1,IF(Table_RiskAssessment[[#This Row],[W2]]=1,\"a\",\"b\"),IF(Table_RiskAssessment[[#This Row],[W2]]=1,\"b\",\"c\"))),IF(Table_RiskAssessment[[#This Row],[F2]]=1,IF(Table_RiskAssessment[[#This Row],[P2]]=1,IF(Table_RiskAssessment[[#This Row],[W2]]=1,\"b\",\"c\"),IF(Table_RiskAssessment[[#This Row],[W2]]=1,\"c\",\"d\")),IF(Table_RiskAssessment[[#This Row],[P2]]=1,IF(Table_RiskAssessment[[#This Row],[W2]]=1,\"c\",\"d\"),IF(Table_RiskAssessment[[#This Row],[W2]]=1,\"d\",\"e\")))),\"?\")","v":"?"},null,null,null,"-"]
[null,null,null,"2006 / 42","1.4.1.",{"$f":"Sprache!A$115","v":"Allgemeine Anforderungen "},"x","","x",null,null,null,null,null,null,null,null,null,null,null,null,null,null,null,null,null,null,null,null,null,null,null,null,{"$f":"IF((Table_RiskAssessment[[#This Row],[S]]* Table_RiskAssessment[[#This Row],[F]]* Table_RiskAssessment[[#This Row],[P]]>0),IF(Table_RiskAssessment[[#This Row],[S]]=1,IF(Table_RiskAssessment[[#This Row],[F]]=1,IF(Table_RiskAssessment[[#This Row],[P]]=1,\"a\",IF(Table_RiskAssessment[[#This Row],[W]]=1,\"a\",\"b\")),IF(Table_RiskAssessment[[#This Row],[P]]=1,IF(Table_RiskAssessment[[#This Row],[W]]=1,\"a\",\"b\"),IF(Table_RiskAssessment[[#This Row],[W]]=1,\"b\",\"c\"))),IF(Table_RiskAssessment[[#This Row],[F]]=1,IF(Table_RiskAssessment[[#This Row],[P]]=1,IF(Table_RiskAssessment[[#This Row],[W]]=1,\"b\",\"c\"),IF(Table_RiskAssessment[[#This Row],[W]]=1,\"c\",\"d\")),IF(Table_RiskAssessment[[#This Row],[P]]=1,IF(Table_RiskAssessment[[#This Row],[W]]=1,\"c\",\"d\"),IF(Table_RiskAssessment[[#This Row],[W]]=1,\"d\",\"e\")))),\"?\")","v":"?"},null,null,null,null,null,null,null,null,null,null,null,null,null,null,{"$f":"IF((Table_RiskAssessment[[#This Row],[S2]]* Table_RiskAssessment[[#This Row],[F2]]* Table_RiskAssessment[[#This Row],[P2]]>0),IF(Table_RiskAssessment[[#This Row],[S2]]=1,IF(Table_RiskAssessment[[#This Row],[F2]]=1,IF(Table_RiskAssessment[[#This Row],[P2]]=1,\"a\",IF(Table_RiskAssessment[[#This Row],[W2]]=1,\"a\",\"b\")),IF(Table_RiskAssessment[[#This Row],[P2]]=1,IF(Table_RiskAssessment[[#This Row],[W2]]=1,\"a\",\"b\"),IF(Table_RiskAssessment[[#This Row],[W2]]=1,\"b\",\"c\"))),IF(Table_RiskAssessment[[#This Row],[F2]]=1,IF(Table_RiskAssessment[[#This Row],[P2]]=1,IF(Table_RiskAssessment[[#This Row],[W2]]=1,\"b\",\"c\"),IF(Table_RiskAssessment[[#This Row],[W2]]=1,\"c\",\"d\")),IF(Table_RiskAssessment[[#This Row],[P2]]=1,IF(Table_RiskAssessment[[#This Row],[W2]]=1,\"c\",\"d\"),IF(Table_RiskAssessment[[#This Row],[W2]]=1,\"d\",\"e\")))),\"?\")","v":"?"},null,null,null,"-"]
[null,null,null,"2006 / 42","1.4.2.",{"$f":"Sprache!A$116","v":"Besondere Anforderungen an trennende Schutzeinrichtungen "},"x","x","x",null,null,null,"---",null,null,null,null,null,null,null,null,null,null,null,null,null,null,null,null,null,null,null,null,{"$f":"IF((Table_RiskAssessment[[#This Row],[S]]* Table_RiskAssessment[[#This Row],[F]]* Table_RiskAssessment[[#This Row],[P]]>0),IF(Table_RiskAssessment[[#This Row],[S]]=1,IF(Table_RiskAssessment[[#This Row],[F]]=1,IF(Table_RiskAssessment[[#This Row],[P]]=1,\"a\",IF(Table_RiskAssessment[[#This Row],[W]]=1,\"a\",\"b\")),IF(Table_RiskAssessment[[#This Row],[P]]=1,IF(Table_RiskAssessment[[#This Row],[W]]=1,\"a\",\"b\"),IF(Table_RiskAssessment[[#This Row],[W]]=1,\"b\",\"c\"))),IF(Table_RiskAssessment[[#This Row],[F]]=1,IF(Table_RiskAssessment[[#This Row],[P]]=1,IF(Table_RiskAssessment[[#This Row],[W]]=1,\"b\",\"c\"),IF(Table_RiskAssessment[[#This Row],[W]]=1,\"c\",\"d\")),IF(Table_RiskAssessment[[#This Row],[P]]=1,IF(Table_RiskAssessment[[#This Row],[W]]=1,\"c\",\"d\"),IF(Table_RiskAssessment[[#This Row],[W]]=1,\"d\",\"e\")))),\"?\")","v":"?"},null,null,null,null,"---",null,null,null,null,null,null,null,null,null,{"$f":"IF((Table_RiskAssessment[[#This Row],[S2]]* Table_RiskAssessment[[#This Row],[F2]]* Table_RiskAssessment[[#This Row],[P2]]>0),IF(Table_RiskAssessment[[#This Row],[S2]]=1,IF(Table_RiskAssessment[[#This Row],[F2]]=1,IF(Table_RiskAssessment[[#This Row],[P2]]=1,\"a\",IF(Table_RiskAssessment[[#This Row],[W2]]=1,\"a\",\"b\")),IF(Table_RiskAssessment[[#This Row],[P2]]=1,IF(Table_RiskAssessment[[#This Row],[W2]]=1,\"a\",\"b\"),IF(Table_RiskAssessment[[#This Row],[W2]]=1,\"b\",\"c\"))),IF(Table_RiskAssessment[[#This Row],[F2]]=1,IF(Table_RiskAssessment[[#This Row],[P2]]=1,IF(Table_RiskAssessment[[#This Row],[W2]]=1,\"b\",\"c\"),IF(Table_RiskAssessment[[#This Row],[W2]]=1,\"c\",\"d\")),IF(Table_RiskAssessment[[#This Row],[P2]]=1,IF(Table_RiskAssessment[[#This Row],[W2]]=1,\"c\",\"d\"),IF(Table_RiskAssessment[[#This Row],[W2]]=1,\"d\",\"e\")))),\"?\")","v":"?"},null,null,null,"-"]
[null,null,null,"2006 / 42","1.4.2.1.",{"$f":"Sprache!A$117","v":"Feststehende trennende Schutzeinrichtungen "},"x","","x",null,null,null,null,null,null,null,null,null,null,null,null,null,null,null,null,null,null,null,null,null,null,null,null,{"$f":"IF((Table_RiskAssessment[[#This Row],[S]]* Table_RiskAssessment[[#This Row],[F]]* Table_RiskAssessment[[#This Row],[P]]>0),IF(Table_RiskAssessment[[#This Row],[S]]=1,IF(Table_RiskAssessment[[#This Row],[F]]=1,IF(Table_RiskAssessment[[#This Row],[P]]=1,\"a\",IF(Table_RiskAssessment[[#This Row],[W]]=1,\"a\",\"b\")),IF(Table_RiskAssessment[[#This Row],[P]]=1,IF(Table_RiskAssessment[[#This Row],[W]]=1,\"a\",\"b\"),IF(Table_RiskAssessment[[#This Row],[W]]=1,\"b\",\"c\"))),IF(Table_RiskAssessment[[#This Row],[F]]=1,IF(Table_RiskAssessment[[#This Row],[P]]=1,IF(Table_RiskAssessment[[#This Row],[W]]=1,\"b\",\"c\"),IF(Table_RiskAssessment[[#This Row],[W]]=1,\"c\",\"d\")),IF(Table_RiskAssessment[[#This Row],[P]]=1,IF(Table_RiskAssessment[[#This Row],[W]]=1,\"c\",\"d\"),IF(Table_RiskAssessment[[#This Row],[W]]=1,\"d\",\"e\")))),\"?\")","v":"?"},null,null,null,null,null,null,null,null,null,null,null,null,null,null,{"$f":"IF((Table_RiskAssessment[[#This Row],[S2]]* Table_RiskAssessment[[#This Row],[F2]]* Table_RiskAssessment[[#This Row],[P2]]>0),IF(Table_RiskAssessment[[#This Row],[S2]]=1,IF(Table_RiskAssessment[[#This Row],[F2]]=1,IF(Table_RiskAssessment[[#This Row],[P2]]=1,\"a\",IF(Table_RiskAssessment[[#This Row],[W2]]=1,\"a\",\"b\")),IF(Table_RiskAssessment[[#This Row],[P2]]=1,IF(Table_RiskAssessment[[#This Row],[W2]]=1,\"a\",\"b\"),IF(Table_RiskAssessment[[#This Row],[W2]]=1,\"b\",\"c\"))),IF(Table_RiskAssessment[[#This Row],[F2]]=1,IF(Table_RiskAssessment[[#This Row],[P2]]=1,IF(Table_RiskAssessment[[#This Row],[W2]]=1,\"b\",\"c\"),IF(Table_RiskAssessment[[#This Row],[W2]]=1,\"c\",\"d\")),IF(Table_RiskAssessment[[#This Row],[P2]]=1,IF(Table_RiskAssessment[[#This Row],[W2]]=1,\"c\",\"d\"),IF(Table_RiskAssessment[[#This Row],[W2]]=1,\"d\",\"e\")))),\"?\")","v":"?"},null,null,null,"-"]
[null,null,null,"2006 / 42","1.4.2.2.",{"$f":"Sprache!A$118","v":"Bewegliche trennende Schutzeinrichtungen mit Verriegelung "},"x","","x",null,null,null,"---",null,null,null,null,null,null,null,null,null,null,null,null,null,null,null,null,null,null,null,null,{"$f":"IF((Table_RiskAssessment[[#This Row],[S]]* Table_RiskAssessment[[#This Row],[F]]* Table_RiskAssessment[[#This Row],[P]]>0),IF(Table_RiskAssessment[[#This Row],[S]]=1,IF(Table_RiskAssessment[[#This Row],[F]]=1,IF(Table_RiskAssessment[[#This Row],[P]]=1,\"a\",IF(Table_RiskAssessment[[#This Row],[W]]=1,\"a\",\"b\")),IF(Table_RiskAssessment[[#This Row],[P]]=1,IF(Table_RiskAssessment[[#This Row],[W]]=1,\"a\",\"b\"),IF(Table_RiskAssessment[[#This Row],[W]]=1,\"b\",\"c\"))),IF(Table_RiskAssessment[[#This Row],[F]]=1,IF(Table_RiskAssessment[[#This Row],[P]]=1,IF(Table_RiskAssessment[[#This Row],[W]]=1,\"b\",\"c\"),IF(Table_RiskAssessment[[#This Row],[W]]=1,\"c\",\"d\")),IF(Table_RiskAssessment[[#This Row],[P]]=1,IF(Table_RiskAssessment[[#This Row],[W]]=1,\"c\",\"d\"),IF(Table_RiskAssessment[[#This Row],[W]]=1,\"d\",\"e\")))),\"?\")","v":"?"},null,null,null,null,"---",null,null,null,null,null,null,null,null,null,{"$f":"IF((Table_RiskAssessment[[#This Row],[S2]]* Table_RiskAssessment[[#This Row],[F2]]* Table_RiskAssessment[[#This Row],[P2]]>0),IF(Table_RiskAssessment[[#This Row],[S2]]=1,IF(Table_RiskAssessment[[#This Row],[F2]]=1,IF(Table_RiskAssessment[[#This Row],[P2]]=1,\"a\",IF(Table_RiskAssessment[[#This Row],[W2]]=1,\"a\",\"b\")),IF(Table_RiskAssessment[[#This Row],[P2]]=1,IF(Table_RiskAssessment[[#This Row],[W2]]=1,\"a\",\"b\"),IF(Table_RiskAssessment[[#This Row],[W2]]=1,\"b\",\"c\"))),IF(Table_RiskAssessment[[#This Row],[F2]]=1,IF(Table_RiskAssessment[[#This Row],[P2]]=1,IF(Table_RiskAssessment[[#This Row],[W2]]=1,\"b\",\"c\"),IF(Table_RiskAssessment[[#This Row],[W2]]=1,\"c\",\"d\")),IF(Table_RiskAssessment[[#This Row],[P2]]=1,IF(Table_RiskAssessment[[#This Row],[W2]]=1,\"c\",\"d\"),IF(Table_RiskAssessment[[#This Row],[W2]]=1,\"d\",\"e\")))),\"?\")","v":"?"},null,null,null,"-"]
[null,null,null,"2006 / 42","1.4.2.3.",{"$f":"Sprache!A$119","v":"Zugangsbeschränkende verstellbare Schutzeinrichtungen "},"x","","x",null,null,null,null,null,null,null,null,null,null,null,null,null,null,null,null,null,null,null,null,null,null,null,null,{"$f":"IF((Table_RiskAssessment[[#This Row],[S]]* Table_RiskAssessment[[#This Row],[F]]* Table_RiskAssessment[[#This Row],[P]]>0),IF(Table_RiskAssessment[[#This Row],[S]]=1,IF(Table_RiskAssessment[[#This Row],[F]]=1,IF(Table_RiskAssessment[[#This Row],[P]]=1,\"a\",IF(Table_RiskAssessment[[#This Row],[W]]=1,\"a\",\"b\")),IF(Table_RiskAssessment[[#This Row],[P]]=1,IF(Table_RiskAssessment[[#This Row],[W]]=1,\"a\",\"b\"),IF(Table_RiskAssessment[[#This Row],[W]]=1,\"b\",\"c\"))),IF(Table_RiskAssessment[[#This Row],[F]]=1,IF(Table_RiskAssessment[[#This Row],[P]]=1,IF(Table_RiskAssessment[[#This Row],[W]]=1,\"b\",\"c\"),IF(Table_RiskAssessment[[#This Row],[W]]=1,\"c\",\"d\")),IF(Table_RiskAssessment[[#This Row],[P]]=1,IF(Table_RiskAssessment[[#This Row],[W]]=1,\"c\",\"d\"),IF(Table_RiskAssessment[[#This Row],[W]]=1,\"d\",\"e\")))),\"?\")","v":"?"},null,null,null,null,null,null,null,null,null,null,null,null,null,null,{"$f":"IF((Table_RiskAssessment[[#This Row],[S2]]* Table_RiskAssessment[[#This Row],[F2]]* Table_RiskAssessment[[#This Row],[P2]]>0),IF(Table_RiskAssessment[[#This Row],[S2]]=1,IF(Table_RiskAssessment[[#This Row],[F2]]=1,IF(Table_RiskAssessment[[#This Row],[P2]]=1,\"a\",IF(Table_RiskAssessment[[#This Row],[W2]]=1,\"a\",\"b\")),IF(Table_RiskAssessment[[#This Row],[P2]]=1,IF(Table_RiskAssessment[[#This Row],[W2]]=1,\"a\",\"b\"),IF(Table_RiskAssessment[[#This Row],[W2]]=1,\"b\",\"c\"))),IF(Table_RiskAssessment[[#This Row],[F2]]=1,IF(Table_RiskAssessment[[#This Row],[P2]]=1,IF(Table_RiskAssessment[[#This Row],[W2]]=1,\"b\",\"c\"),IF(Table_RiskAssessment[[#This Row],[W2]]=1,\"c\",\"d\")),IF(Table_RiskAssessment[[#This Row],[P2]]=1,IF(Table_RiskAssessment[[#This Row],[W2]]=1,\"c\",\"d\"),IF(Table_RiskAssessment[[#This Row],[W2]]=1,\"d\",\"e\")))),\"?\")","v":"?"},null,null,null,"-"]
[null,null,null,"2006 / 42","1.4.3.",{"$f":"Sprache!A$120","v":"Besondere Anforderungen an nichttrennende Schutzeinrichtungen "},"x","","x",null,null,null,"---",null,null,null,null,null,null,null,null,null,null,null,null,null,null,null,null,null,null,null,null,{"$f":"IF((Table_RiskAssessment[[#This Row],[S]]* Table_RiskAssessment[[#This Row],[F]]* Table_RiskAssessment[[#This Row],[P]]>0),IF(Table_RiskAssessment[[#This Row],[S]]=1,IF(Table_RiskAssessment[[#This Row],[F]]=1,IF(Table_RiskAssessment[[#This Row],[P]]=1,\"a\",IF(Table_RiskAssessment[[#This Row],[W]]=1,\"a\",\"b\")),IF(Table_RiskAssessment[[#This Row],[P]]=1,IF(Table_RiskAssessment[[#This Row],[W]]=1,\"a\",\"b\"),IF(Table_RiskAssessment[[#This Row],[W]]=1,\"b\",\"c\"))),IF(Table_RiskAssessment[[#This Row],[F]]=1,IF(Table_RiskAssessment[[#This Row],[P]]=1,IF(Table_RiskAssessment[[#This Row],[W]]=1,\"b\",\"c\"),IF(Table_RiskAssessment[[#This Row],[W]]=1,\"c\",\"d\")),IF(Table_RiskAssessment[[#This Row],[P]]=1,IF(Table_RiskAssessment[[#This Row],[W]]=1,\"c\",\"d\"),IF(Table_RiskAssessment[[#This Row],[W]]=1,\"d\",\"e\")))),\"?\")","v":"?"},null,null,null,null,"---",null,null,null,null,null,null,null,null,null,{"$f":"IF((Table_RiskAssessment[[#This Row],[S2]]* Table_RiskAssessment[[#This Row],[F2]]* Table_RiskAssessment[[#This Row],[P2]]>0),IF(Table_RiskAssessment[[#This Row],[S2]]=1,IF(Table_RiskAssessment[[#This Row],[F2]]=1,IF(Table_RiskAssessment[[#This Row],[P2]]=1,\"a\",IF(Table_RiskAssessment[[#This Row],[W2]]=1,\"a\",\"b\")),IF(Table_RiskAssessment[[#This Row],[P2]]=1,IF(Table_RiskAssessment[[#This Row],[W2]]=1,\"a\",\"b\"),IF(Table_RiskAssessment[[#This Row],[W2]]=1,\"b\",\"c\"))),IF(Table_RiskAssessment[[#This Row],[F2]]=1,IF(Table_RiskAssessment[[#This Row],[P2]]=1,IF(Table_RiskAssessment[[#This Row],[W2]]=1,\"b\",\"c\"),IF(Table_RiskAssessment[[#This Row],[W2]]=1,\"c\",\"d\")),IF(Table_RiskAssessment[[#This Row],[P2]]=1,IF(Table_RiskAssessment[[#This Row],[W2]]=1,\"c\",\"d\"),IF(Table_RiskAssessment[[#This Row],[W2]]=1,\"d\",\"e\")))),\"?\")","v":"?"},null,null,null,"-"]
[null,null,null,"2006 / 42","1.5.",{"$f":"Sprache!A$121","v":"Risiken durch sonstige Gefährdungen "},"x","x","x",null,null,null,null,null,null,null,null,null,null,null,null,null,null,null,null,null,null,null,null,null,null,null,null,{"$f":"IF((Table_RiskAssessment[[#This Row],[S]]* Table_RiskAssessment[[#This Row],[F]]* Table_RiskAssessment[[#This Row],[P]]>0),IF(Table_RiskAssessment[[#This Row],[S]]=1,IF(Table_RiskAssessment[[#This Row],[F]]=1,IF(Table_RiskAssessment[[#This Row],[P]]=1,\"a\",IF(Table_RiskAssessment[[#This Row],[W]]=1,\"a\",\"b\")),IF(Table_RiskAssessment[[#This Row],[P]]=1,IF(Table_RiskAssessment[[#This Row],[W]]=1,\"a\",\"b\"),IF(Table_RiskAssessment[[#This Row],[W]]=1,\"b\",\"c\"))),IF(Table_RiskAssessment[[#This Row],[F]]=1,IF(Table_RiskAssessment[[#This Row],[P]]=1,IF(Table_RiskAssessment[[#This Row],[W]]=1,\"b\",\"c\"),IF(Table_RiskAssessment[[#This Row],[W]]=1,\"c\",\"d\")),IF(Table_RiskAssessment[[#This Row],[P]]=1,IF(Table_RiskAssessment[[#This Row],[W]]=1,\"c\",\"d\"),IF(Table_RiskAssessment[[#This Row],[W]]=1,\"d\",\"e\")))),\"?\")","v":"?"},null,null,null,null,null,null,null,null,null,null,null,null,null,null,{"$f":"IF((Table_RiskAssessment[[#This Row],[S2]]* Table_RiskAssessment[[#This Row],[F2]]* Table_RiskAssessment[[#This Row],[P2]]>0),IF(Table_RiskAssessment[[#This Row],[S2]]=1,IF(Table_RiskAssessment[[#This Row],[F2]]=1,IF(Table_RiskAssessment[[#This Row],[P2]]=1,\"a\",IF(Table_RiskAssessment[[#This Row],[W2]]=1,\"a\",\"b\")),IF(Table_RiskAssessment[[#This Row],[P2]]=1,IF(Table_RiskAssessment[[#This Row],[W2]]=1,\"a\",\"b\"),IF(Table_RiskAssessment[[#This Row],[W2]]=1,\"b\",\"c\"))),IF(Table_RiskAssessment[[#This Row],[F2]]=1,IF(Table_RiskAssessment[[#This Row],[P2]]=1,IF(Table_RiskAssessment[[#This Row],[W2]]=1,\"b\",\"c\"),IF(Table_RiskAssessment[[#This Row],[W2]]=1,\"c\",\"d\")),IF(Table_RiskAssessment[[#This Row],[P2]]=1,IF(Table_RiskAssessment[[#This Row],[W2]]=1,\"c\",\"d\"),IF(Table_RiskAssessment[[#This Row],[W2]]=1,\"d\",\"e\")))),\"?\")","v":"?"},null,null,null,"-"]
[null,null,null,"2006 / 42","1.5.01.",{"$f":"Sprache!A$122","v":"Elektrische Energieversorgung "},"x","","x",null,null,null,"---",null,null,null,null,null,null,null,null,null,null,null,null,null,null,null,null,null,null,null,null,{"$f":"IF((Table_RiskAssessment[[#This Row],[S]]* Table_RiskAssessment[[#This Row],[F]]* Table_RiskAssessment[[#This Row],[P]]>0),IF(Table_RiskAssessment[[#This Row],[S]]=1,IF(Table_RiskAssessment[[#This Row],[F]]=1,IF(Table_RiskAssessment[[#This Row],[P]]=1,\"a\",IF(Table_RiskAssessment[[#This Row],[W]]=1,\"a\",\"b\")),IF(Table_RiskAssessment[[#This Row],[P]]=1,IF(Table_RiskAssessment[[#This Row],[W]]=1,\"a\",\"b\"),IF(Table_RiskAssessment[[#This Row],[W]]=1,\"b\",\"c\"))),IF(Table_RiskAssessment[[#This Row],[F]]=1,IF(Table_RiskAssessment[[#This Row],[P]]=1,IF(Table_RiskAssessment[[#This Row],[W]]=1,\"b\",\"c\"),IF(Table_RiskAssessment[[#This Row],[W]]=1,\"c\",\"d\")),IF(Table_RiskAssessment[[#This Row],[P]]=1,IF(Table_RiskAssessment[[#This Row],[W]]=1,\"c\",\"d\"),IF(Table_RiskAssessment[[#This Row],[W]]=1,\"d\",\"e\")))),\"?\")","v":"?"},null,null,null,null,"---",null,null,null,null,null,null,null,null,null,{"$f":"IF((Table_RiskAssessment[[#This Row],[S2]]* Table_RiskAssessment[[#This Row],[F2]]* Table_RiskAssessment[[#This Row],[P2]]>0),IF(Table_RiskAssessment[[#This Row],[S2]]=1,IF(Table_RiskAssessment[[#This Row],[F2]]=1,IF(Table_RiskAssessment[[#This Row],[P2]]=1,\"a\",IF(Table_RiskAssessment[[#This Row],[W2]]=1,\"a\",\"b\")),IF(Table_RiskAssessment[[#This Row],[P2]]=1,IF(Table_RiskAssessment[[#This Row],[W2]]=1,\"a\",\"b\"),IF(Table_RiskAssessment[[#This Row],[W2]]=1,\"b\",\"c\"))),IF(Table_RiskAssessment[[#This Row],[F2]]=1,IF(Table_RiskAssessment[[#This Row],[P2]]=1,IF(Table_RiskAssessment[[#This Row],[W2]]=1,\"b\",\"c\"),IF(Table_RiskAssessment[[#This Row],[W2]]=1,\"c\",\"d\")),IF(Table_RiskAssessment[[#This Row],[P2]]=1,IF(Table_RiskAssessment[[#This Row],[W2]]=1,\"c\",\"d\"),IF(Table_RiskAssessment[[#This Row],[W2]]=1,\"d\",\"e\")))),\"?\")","v":"?"},null,null,null,"-"]
[null,null,null,"2006 / 42","1.5.02.",{"$f":"Sprache!A$123","v":"Statische Elektrizität "},"x","","x",null,null,null,null,null,null,null,null,null,null,null,null,null,null,null,null,null,null,null,null,null,null,null,null,{"$f":"IF((Table_RiskAssessment[[#This Row],[S]]* Table_RiskAssessment[[#This Row],[F]]* Table_RiskAssessment[[#This Row],[P]]>0),IF(Table_RiskAssessment[[#This Row],[S]]=1,IF(Table_RiskAssessment[[#This Row],[F]]=1,IF(Table_RiskAssessment[[#This Row],[P]]=1,\"a\",IF(Table_RiskAssessment[[#This Row],[W]]=1,\"a\",\"b\")),IF(Table_RiskAssessment[[#This Row],[P]]=1,IF(Table_RiskAssessment[[#This Row],[W]]=1,\"a\",\"b\"),IF(Table_RiskAssessment[[#This Row],[W]]=1,\"b\",\"c\"))),IF(Table_RiskAssessment[[#This Row],[F]]=1,IF(Table_RiskAssessment[[#This Row],[P]]=1,IF(Table_RiskAssessment[[#This Row],[W]]=1,\"b\",\"c\"),IF(Table_RiskAssessment[[#This Row],[W]]=1,\"c\",\"d\")),IF(Table_RiskAssessment[[#This Row],[P]]=1,IF(Table_RiskAssessment[[#This Row],[W]]=1,\"c\",\"d\"),IF(Table_RiskAssessment[[#This Row],[W]]=1,\"d\",\"e\")))),\"?\")","v":"?"},null,null,null,null,null,null,null,null,null,null,null,null,null,null,{"$f":"IF((Table_RiskAssessment[[#This Row],[S2]]* Table_RiskAssessment[[#This Row],[F2]]* Table_RiskAssessment[[#This Row],[P2]]>0),IF(Table_RiskAssessment[[#This Row],[S2]]=1,IF(Table_RiskAssessment[[#This Row],[F2]]=1,IF(Table_RiskAssessment[[#This Row],[P2]]=1,\"a\",IF(Table_RiskAssessment[[#This Row],[W2]]=1,\"a\",\"b\")),IF(Table_RiskAssessment[[#This Row],[P2]]=1,IF(Table_RiskAssessment[[#This Row],[W2]]=1,\"a\",\"b\"),IF(Table_RiskAssessment[[#This Row],[W2]]=1,\"b\",\"c\"))),IF(Table_RiskAssessment[[#This Row],[F2]]=1,IF(Table_RiskAssessment[[#This Row],[P2]]=1,IF(Table_RiskAssessment[[#This Row],[W2]]=1,\"b\",\"c\"),IF(Table_RiskAssessment[[#This Row],[W2]]=1,\"c\",\"d\")),IF(Table_RiskAssessment[[#This Row],[P2]]=1,IF(Table_RiskAssessment[[#This Row],[W2]]=1,\"c\",\"d\"),IF(Table_RiskAssessment[[#This Row],[W2]]=1,\"d\",\"e\")))),\"?\")","v":"?"},null,null,null,"-"]
[null,null,null,"2006 / 42","1.5.03.",{"$f":"Sprache!A$124","v":"Nichtelektrische Energieversorgung "},"x","","x",null,null,null,"---",null,null,null,null,null,null,null,null,null,null,null,null,null,null,null,null,null,null,null,null,{"$f":"IF((Table_RiskAssessment[[#This Row],[S]]* Table_RiskAssessment[[#This Row],[F]]* Table_RiskAssessment[[#This Row],[P]]>0),IF(Table_RiskAssessment[[#This Row],[S]]=1,IF(Table_RiskAssessment[[#This Row],[F]]=1,IF(Table_RiskAssessment[[#This Row],[P]]=1,\"a\",IF(Table_RiskAssessment[[#This Row],[W]]=1,\"a\",\"b\")),IF(Table_RiskAssessment[[#This Row],[P]]=1,IF(Table_RiskAssessment[[#This Row],[W]]=1,\"a\",\"b\"),IF(Table_RiskAssessment[[#This Row],[W]]=1,\"b\",\"c\"))),IF(Table_RiskAssessment[[#This Row],[F]]=1,IF(Table_RiskAssessment[[#This Row],[P]]=1,IF(Table_RiskAssessment[[#This Row],[W]]=1,\"b\",\"c\"),IF(Table_RiskAssessment[[#This Row],[W]]=1,\"c\",\"d\")),IF(Table_RiskAssessment[[#This Row],[P]]=1,IF(Table_RiskAssessment[[#This Row],[W]]=1,\"c\",\"d\"),IF(Table_RiskAssessment[[#This Row],[W]]=1,\"d\",\"e\")))),\"?\")","v":"?"},null,null,null,null,"---",null,null,null,null,null,null,null,null,null,{"$f":"IF((Table_RiskAssessment[[#This Row],[S2]]* Table_RiskAssessment[[#This Row],[F2]]* Table_RiskAssessment[[#This Row],[P2]]>0),IF(Table_RiskAssessment[[#This Row],[S2]]=1,IF(Table_RiskAssessment[[#This Row],[F2]]=1,IF(Table_RiskAssessment[[#This Row],[P2]]=1,\"a\",IF(Table_RiskAssessment[[#This Row],[W2]]=1,\"a\",\"b\")),IF(Table_RiskAssessment[[#This Row],[P2]]=1,IF(Table_RiskAssessment[[#This Row],[W2]]=1,\"a\",\"b\"),IF(Table_RiskAssessment[[#This Row],[W2]]=1,\"b\",\"c\"))),IF(Table_RiskAssessment[[#This Row],[F2]]=1,IF(Table_RiskAssessment[[#This Row],[P2]]=1,IF(Table_RiskAssessment[[#This Row],[W2]]=1,\"b\",\"c\"),IF(Table_RiskAssessment[[#This Row],[W2]]=1,\"c\",\"d\")),IF(Table_RiskAssessment[[#This Row],[P2]]=1,IF(Table_RiskAssessment[[#This Row],[W2]]=1,\"c\",\"d\"),IF(Table_RiskAssessment[[#This Row],[W2]]=1,\"d\",\"e\")))),\"?\")","v":"?"},null,null,null,"-"]
[null,null,null,"2006 / 42","1.5.04.",{"$f":"Sprache!A$125","v":"Montagefehler "},"x","","x",null,null,null,null,null,null,null,null,null,null,null,null,null,null,null,null,null,null,null,null,null,null,null,null,{"$f":"IF((Table_RiskAssessment[[#This Row],[S]]* Table_RiskAssessment[[#This Row],[F]]* Table_RiskAssessment[[#This Row],[P]]>0),IF(Table_RiskAssessment[[#This Row],[S]]=1,IF(Table_RiskAssessment[[#This Row],[F]]=1,IF(Table_RiskAssessment[[#This Row],[P]]=1,\"a\",IF(Table_RiskAssessment[[#This Row],[W]]=1,\"a\",\"b\")),IF(Table_RiskAssessment[[#This Row],[P]]=1,IF(Table_RiskAssessment[[#This Row],[W]]=1,\"a\",\"b\"),IF(Table_RiskAssessment[[#This Row],[W]]=1,\"b\",\"c\"))),IF(Table_RiskAssessment[[#This Row],[F]]=1,IF(Table_RiskAssessment[[#This Row],[P]]=1,IF(Table_RiskAssessment[[#This Row],[W]]=1,\"b\",\"c\"),IF(Table_RiskAssessment[[#This Row],[W]]=1,\"c\",\"d\")),IF(Table_RiskAssessment[[#This Row],[P]]=1,IF(Table_RiskAssessment[[#This Row],[W]]=1,\"c\",\"d\"),IF(Table_RiskAssessment[[#This Row],[W]]=1,\"d\",\"e\")))),\"?\")","v":"?"},null,null,null,null,null,null,null,null,null,null,null,null,null,null,{"$f":"IF((Table_RiskAssessment[[#This Row],[S2]]* Table_RiskAssessment[[#This Row],[F2]]* Table_RiskAssessment[[#This Row],[P2]]>0),IF(Table_RiskAssessment[[#This Row],[S2]]=1,IF(Table_RiskAssessment[[#This Row],[F2]]=1,IF(Table_RiskAssessment[[#This Row],[P2]]=1,\"a\",IF(Table_RiskAssessment[[#This Row],[W2]]=1,\"a\",\"b\")),IF(Table_RiskAssessment[[#This Row],[P2]]=1,IF(Table_RiskAssessment[[#This Row],[W2]]=1,\"a\",\"b\"),IF(Table_RiskAssessment[[#This Row],[W2]]=1,\"b\",\"c\"))),IF(Table_RiskAssessment[[#This Row],[F2]]=1,IF(Table_RiskAssessment[[#This Row],[P2]]=1,IF(Table_RiskAssessment[[#This Row],[W2]]=1,\"b\",\"c\"),IF(Table_RiskAssessment[[#This Row],[W2]]=1,\"c\",\"d\")),IF(Table_RiskAssessment[[#This Row],[P2]]=1,IF(Table_RiskAssessment[[#This Row],[W2]]=1,\"c\",\"d\"),IF(Table_RiskAssessment[[#This Row],[W2]]=1,\"d\",\"e\")))),\"?\")","v":"?"},null,null,null,"-"]
[null,null,null,"2006 / 42","1.5.05.",{"$f":"Sprache!A$126","v":"Extreme Temperaturen "},"x","","x",null,null,null,"---",null,null,null,null,null,null,null,null,null,null,null,null,null,null,null,null,null,null,null,null,{"$f":"IF((Table_RiskAssessment[[#This Row],[S]]* Table_RiskAssessment[[#This Row],[F]]* Table_RiskAssessment[[#This Row],[P]]>0),IF(Table_RiskAssessment[[#This Row],[S]]=1,IF(Table_RiskAssessment[[#This Row],[F]]=1,IF(Table_RiskAssessment[[#This Row],[P]]=1,\"a\",IF(Table_RiskAssessment[[#This Row],[W]]=1,\"a\",\"b\")),IF(Table_RiskAssessment[[#This Row],[P]]=1,IF(Table_RiskAssessment[[#This Row],[W]]=1,\"a\",\"b\"),IF(Table_RiskAssessment[[#This Row],[W]]=1,\"b\",\"c\"))),IF(Table_RiskAssessment[[#This Row],[F]]=1,IF(Table_RiskAssessment[[#This Row],[P]]=1,IF(Table_RiskAssessment[[#This Row],[W]]=1,\"b\",\"c\"),IF(Table_RiskAssessment[[#This Row],[W]]=1,\"c\",\"d\")),IF(Table_RiskAssessment[[#This Row],[P]]=1,IF(Table_RiskAssessment[[#This Row],[W]]=1,\"c\",\"d\"),IF(Table_RiskAssessment[[#This Row],[W]]=1,\"d\",\"e\")))),\"?\")","v":"?"},null,null,null,null,"---",null,null,null,null,null,null,null,null,null,{"$f":"IF((Table_RiskAssessment[[#This Row],[S2]]* Table_RiskAssessment[[#This Row],[F2]]* Table_RiskAssessment[[#This Row],[P2]]>0),IF(Table_RiskAssessment[[#This Row],[S2]]=1,IF(Table_RiskAssessment[[#This Row],[F2]]=1,IF(Table_RiskAssessment[[#This Row],[P2]]=1,\"a\",IF(Table_RiskAssessment[[#This Row],[W2]]=1,\"a\",\"b\")),IF(Table_RiskAssessment[[#This Row],[P2]]=1,IF(Table_RiskAssessment[[#This Row],[W2]]=1,\"a\",\"b\"),IF(Table_RiskAssessment[[#This Row],[W2]]=1,\"b\",\"c\"))),IF(Table_RiskAssessment[[#This Row],[F2]]=1,IF(Table_RiskAssessment[[#This Row],[P2]]=1,IF(Table_RiskAssessment[[#This Row],[W2]]=1,\"b\",\"c\"),IF(Table_RiskAssessment[[#This Row],[W2]]=1,\"c\",\"d\")),IF(Table_RiskAssessment[[#This Row],[P2]]=1,IF(Table_RiskAssessment[[#This Row],[W2]]=1,\"c\",\"d\"),IF(Table_RiskAssessment[[#This Row],[W2]]=1,\"d\",\"e\")))),\"?\")","v":"?"},null,null,null,"-"]
[null,null,null,"2006 / 42","1.5.06.",{"$f":"Sprache!A$127","v":"Brand "},"x","","x",null,null,null,"---",null,null,null,null,null,null,null,null,null,null,null,null,null,null,null,null,null,null,null,null,{"$f":"IF((Table_RiskAssessment[[#This Row],[S]]* Table_RiskAssessment[[#This Row],[F]]* Table_RiskAssessment[[#This Row],[P]]>0),IF(Table_RiskAssessment[[#This Row],[S]]=1,IF(Table_RiskAssessment[[#This Row],[F]]=1,IF(Table_RiskAssessment[[#This Row],[P]]=1,\"a\",IF(Table_RiskAssessment[[#This Row],[W]]=1,\"a\",\"b\")),IF(Table_RiskAssessment[[#This Row],[P]]=1,IF(Table_RiskAssessment[[#This Row],[W]]=1,\"a\",\"b\"),IF(Table_RiskAssessment[[#This Row],[W]]=1,\"b\",\"c\"))),IF(Table_RiskAssessment[[#This Row],[F]]=1,IF(Table_RiskAssessment[[#This Row],[P]]=1,IF(Table_RiskAssessment[[#This Row],[W]]=1,\"b\",\"c\"),IF(Table_RiskAssessment[[#This Row],[W]]=1,\"c\",\"d\")),IF(Table_RiskAssessment[[#This Row],[P]]=1,IF(Table_RiskAssessment[[#This Row],[W]]=1,\"c\",\"d\"),IF(Table_RiskAssessment[[#This Row],[W]]=1,\"d\",\"e\")))),\"?\")","v":"?"},null,null,null,null,"---",null,null,null,null,null,null,null,null,null,{"$f":"IF((Table_RiskAssessment[[#This Row],[S2]]* Table_RiskAssessment[[#This Row],[F2]]* Table_RiskAssessment[[#This Row],[P2]]>0),IF(Table_RiskAssessment[[#This Row],[S2]]=1,IF(Table_RiskAssessment[[#This Row],[F2]]=1,IF(Table_RiskAssessment[[#This Row],[P2]]=1,\"a\",IF(Table_RiskAssessment[[#This Row],[W2]]=1,\"a\",\"b\")),IF(Table_RiskAssessment[[#This Row],[P2]]=1,IF(Table_RiskAssessment[[#This Row],[W2]]=1,\"a\",\"b\"),IF(Table_RiskAssessment[[#This Row],[W2]]=1,\"b\",\"c\"))),IF(Table_RiskAssessment[[#This Row],[F2]]=1,IF(Table_RiskAssessment[[#This Row],[P2]]=1,IF(Table_RiskAssessment[[#This Row],[W2]]=1,\"b\",\"c\"),IF(Table_RiskAssessment[[#This Row],[W2]]=1,\"c\",\"d\")),IF(Table_RiskAssessment[[#This Row],[P2]]=1,IF(Table_RiskAssessment[[#This Row],[W2]]=1,\"c\",\"d\"),IF(Table_RiskAssessment[[#This Row],[W2]]=1,\"d\",\"e\")))),\"?\")","v":"?"},null,null,null,"-"]
[null,null,null,"2006 / 42","1.5.07.",{"$f":"Sprache!A$128","v":"Explosion "},"x","","x",null,null,null,"---",null,null,null,null,null,null,null,null,null,null,null,null,null,null,null,null,null,null,null,null,{"$f":"IF((Table_RiskAssessment[[#This Row],[S]]* Table_RiskAssessment[[#This Row],[F]]* Table_RiskAssessment[[#This Row],[P]]>0),IF(Table_RiskAssessment[[#This Row],[S]]=1,IF(Table_RiskAssessment[[#This Row],[F]]=1,IF(Table_RiskAssessment[[#This Row],[P]]=1,\"a\",IF(Table_RiskAssessment[[#This Row],[W]]=1,\"a\",\"b\")),IF(Table_RiskAssessment[[#This Row],[P]]=1,IF(Table_RiskAssessment[[#This Row],[W]]=1,\"a\",\"b\"),IF(Table_RiskAssessment[[#This Row],[W]]=1,\"b\",\"c\"))),IF(Table_RiskAssessment[[#This Row],[F]]=1,IF(Table_RiskAssessment[[#This Row],[P]]=1,IF(Table_RiskAssessment[[#This Row],[W]]=1,\"b\",\"c\"),IF(Table_RiskAssessment[[#This Row],[W]]=1,\"c\",\"d\")),IF(Table_RiskAssessment[[#This Row],[P]]=1,IF(Table_RiskAssessment[[#This Row],[W]]=1,\"c\",\"d\"),IF(Table_RiskAssessment[[#This Row],[W]]=1,\"d\",\"e\")))),\"?\")","v":"?"},null,null,null,null,"---",null,null,null,null,null,null,null,null,null,{"$f":"IF((Table_RiskAssessment[[#This Row],[S2]]* Table_RiskAssessment[[#This Row],[F2]]* Table_RiskAssessment[[#This Row],[P2]]>0),IF(Table_RiskAssessment[[#This Row],[S2]]=1,IF(Table_RiskAssessment[[#This Row],[F2]]=1,IF(Table_RiskAssessment[[#This Row],[P2]]=1,\"a\",IF(Table_RiskAssessment[[#This Row],[W2]]=1,\"a\",\"b\")),IF(Table_RiskAssessment[[#This Row],[P2]]=1,IF(Table_RiskAssessment[[#This Row],[W2]]=1,\"a\",\"b\"),IF(Table_RiskAssessment[[#This Row],[W2]]=1,\"b\",\"c\"))),IF(Table_RiskAssessment[[#This Row],[F2]]=1,IF(Table_RiskAssessment[[#This Row],[P2]]=1,IF(Table_RiskAssessment[[#This Row],[W2]]=1,\"b\",\"c\"),IF(Table_RiskAssessment[[#This Row],[W2]]=1,\"c\",\"d\")),IF(Table_RiskAssessment[[#This Row],[P2]]=1,IF(Table_RiskAssessment[[#This Row],[W2]]=1,\"c\",\"d\"),IF(Table_RiskAssessment[[#This Row],[W2]]=1,\"d\",\"e\")))),\"?\")","v":"?"},null,null,null,"-"]
[null,null,null,"2006 / 42","1.5.08.",{"$f":"Sprache!A$129","v":"Lärm "},"x","","x",null,null,null,"---",null,null,null,null,null,null,null,null,null,null,null,null,null,null,null,null,null,null,null,null,{"$f":"IF((Table_RiskAssessment[[#This Row],[S]]* Table_RiskAssessment[[#This Row],[F]]* Table_RiskAssessment[[#This Row],[P]]>0),IF(Table_RiskAssessment[[#This Row],[S]]=1,IF(Table_RiskAssessment[[#This Row],[F]]=1,IF(Table_RiskAssessment[[#This Row],[P]]=1,\"a\",IF(Table_RiskAssessment[[#This Row],[W]]=1,\"a\",\"b\")),IF(Table_RiskAssessment[[#This Row],[P]]=1,IF(Table_RiskAssessment[[#This Row],[W]]=1,\"a\",\"b\"),IF(Table_RiskAssessment[[#This Row],[W]]=1,\"b\",\"c\"))),IF(Table_RiskAssessment[[#This Row],[F]]=1,IF(Table_RiskAssessment[[#This Row],[P]]=1,IF(Table_RiskAssessment[[#This Row],[W]]=1,\"b\",\"c\"),IF(Table_RiskAssessment[[#This Row],[W]]=1,\"c\",\"d\")),IF(Table_RiskAssessment[[#This Row],[P]]=1,IF(Table_RiskAssessment[[#This Row],[W]]=1,\"c\",\"d\"),IF(Table_RiskAssessment[[#This Row],[W]]=1,\"d\",\"e\")))),\"?\")","v":"?"},null,null,null,null,"---",null,null,null,null,null,null,null,null,null,{"$f":"IF((Table_RiskAssessment[[#This Row],[S2]]* Table_RiskAssessment[[#This Row],[F2]]* Table_RiskAssessment[[#This Row],[P2]]>0),IF(Table_RiskAssessment[[#This Row],[S2]]=1,IF(Table_RiskAssessment[[#This Row],[F2]]=1,IF(Table_RiskAssessment[[#This Row],[P2]]=1,\"a\",IF(Table_RiskAssessment[[#This Row],[W2]]=1,\"a\",\"b\")),IF(Table_RiskAssessment[[#This Row],[P2]]=1,IF(Table_RiskAssessment[[#This Row],[W2]]=1,\"a\",\"b\"),IF(Table_RiskAssessment[[#This Row],[W2]]=1,\"b\",\"c\"))),IF(Table_RiskAssessment[[#This Row],[F2]]=1,IF(Table_RiskAssessment[[#This Row],[P2]]=1,IF(Table_RiskAssessment[[#This Row],[W2]]=1,\"b\",\"c\"),IF(Table_RiskAssessment[[#This Row],[W2]]=1,\"c\",\"d\")),IF(Table_RiskAssessment[[#This Row],[P2]]=1,IF(Table_RiskAssessment[[#This Row],[W2]]=1,\"c\",\"d\"),IF(Table_RiskAssessment[[#This Row],[W2]]=1,\"d\",\"e\")))),\"?\")","v":"?"},null,null,null,"-"]
[null,null,null,"2006 / 42","1.5.09.",{"$f":"Sprache!A$130","v":"Vibrationen "},"x","","x",null,null,null,"---",null,null,null,null,null,null,null,null,null,null,null,null,null,null,null,null,null,null,null,null,{"$f":"IF((Table_RiskAssessment[[#This Row],[S]]* Table_RiskAssessment[[#This Row],[F]]* Table_RiskAssessment[[#This Row],[P]]>0),IF(Table_RiskAssessment[[#This Row],[S]]=1,IF(Table_RiskAssessment[[#This Row],[F]]=1,IF(Table_RiskAssessment[[#This Row],[P]]=1,\"a\",IF(Table_RiskAssessment[[#This Row],[W]]=1,\"a\",\"b\")),IF(Table_RiskAssessment[[#This Row],[P]]=1,IF(Table_RiskAssessment[[#This Row],[W]]=1,\"a\",\"b\"),IF(Table_RiskAssessment[[#This Row],[W]]=1,\"b\",\"c\"))),IF(Table_RiskAssessment[[#This Row],[F]]=1,IF(Table_RiskAssessment[[#This Row],[P]]=1,IF(Table_RiskAssessment[[#This Row],[W]]=1,\"b\",\"c\"),IF(Table_RiskAssessment[[#This Row],[W]]=1,\"c\",\"d\")),IF(Table_RiskAssessment[[#This Row],[P]]=1,IF(Table_RiskAssessment[[#This Row],[W]]=1,\"c\",\"d\"),IF(Table_RiskAssessment[[#This Row],[W]]=1,\"d\",\"e\")))),\"?\")","v":"?"},null,null,null,null,"---",null,null,null,null,null,null,null,null,null,{"$f":"IF((Table_RiskAssessment[[#This Row],[S2]]* Table_RiskAssessment[[#This Row],[F2]]* Table_RiskAssessment[[#This Row],[P2]]>0),IF(Table_RiskAssessment[[#This Row],[S2]]=1,IF(Table_RiskAssessment[[#This Row],[F2]]=1,IF(Table_RiskAssessment[[#This Row],[P2]]=1,\"a\",IF(Table_RiskAssessment[[#This Row],[W2]]=1,\"a\",\"b\")),IF(Table_RiskAssessment[[#This Row],[P2]]=1,IF(Table_RiskAssessment[[#This Row],[W2]]=1,\"a\",\"b\"),IF(Table_RiskAssessment[[#This Row],[W2]]=1,\"b\",\"c\"))),IF(Table_RiskAssessment[[#This Row],[F2]]=1,IF(Table_RiskAssessment[[#This Row],[P2]]=1,IF(Table_RiskAssessment[[#This Row],[W2]]=1,\"b\",\"c\"),IF(Table_RiskAssessment[[#This Row],[W2]]=1,\"c\",\"d\")),IF(Table_RiskAssessment[[#This Row],[P2]]=1,IF(Table_RiskAssessment[[#This Row],[W2]]=1,\"c\",\"d\"),IF(Table_RiskAssessment[[#This Row],[W2]]=1,\"d\",\"e\")))),\"?\")","v":"?"},null,null,null,"-"]
[null,null,null,"2006 / 42","1.5.10.",{"$f":"Sprache!A$131","v":"Strahlung "},"x","","x",null,null,null,"---",null,null,null,null,null,null,null,null,null,null,null,null,null,null,null,null,null,null,null,null,{"$f":"IF((Table_RiskAssessment[[#This Row],[S]]* Table_RiskAssessment[[#This Row],[F]]* Table_RiskAssessment[[#This Row],[P]]>0),IF(Table_RiskAssessment[[#This Row],[S]]=1,IF(Table_RiskAssessment[[#This Row],[F]]=1,IF(Table_RiskAssessment[[#This Row],[P]]=1,\"a\",IF(Table_RiskAssessment[[#This Row],[W]]=1,\"a\",\"b\")),IF(Table_RiskAssessment[[#This Row],[P]]=1,IF(Table_RiskAssessment[[#This Row],[W]]=1,\"a\",\"b\"),IF(Table_RiskAssessment[[#This Row],[W]]=1,\"b\",\"c\"))),IF(Table_RiskAssessment[[#This Row],[F]]=1,IF(Table_RiskAssessment[[#This Row],[P]]=1,IF(Table_RiskAssessment[[#This Row],[W]]=1,\"b\",\"c\"),IF(Table_RiskAssessment[[#This Row],[W]]=1,\"c\",\"d\")),IF(Table_RiskAssessment[[#This Row],[P]]=1,IF(Table_RiskAssessment[[#This Row],[W]]=1,\"c\",\"d\"),IF(Table_RiskAssessment[[#This Row],[W]]=1,\"d\",\"e\")))),\"?\")","v":"?"},null,null,null,null,"---",null,null,null,null,null,null,null,null,null,{"$f":"IF((Table_RiskAssessment[[#This Row],[S2]]* Table_RiskAssessment[[#This Row],[F2]]* Table_RiskAssessment[[#This Row],[P2]]>0),IF(Table_RiskAssessment[[#This Row],[S2]]=1,IF(Table_RiskAssessment[[#This Row],[F2]]=1,IF(Table_RiskAssessment[[#This Row],[P2]]=1,\"a\",IF(Table_RiskAssessment[[#This Row],[W2]]=1,\"a\",\"b\")),IF(Table_RiskAssessment[[#This Row],[P2]]=1,IF(Table_RiskAssessment[[#This Row],[W2]]=1,\"a\",\"b\"),IF(Table_RiskAssessment[[#This Row],[W2]]=1,\"b\",\"c\"))),IF(Table_RiskAssessment[[#This Row],[F2]]=1,IF(Table_RiskAssessment[[#This Row],[P2]]=1,IF(Table_RiskAssessment[[#This Row],[W2]]=1,\"b\",\"c\"),IF(Table_RiskAssessment[[#This Row],[W2]]=1,\"c\",\"d\")),IF(Table_RiskAssessment[[#This Row],[P2]]=1,IF(Table_RiskAssessment[[#This Row],[W2]]=1,\"c\",\"d\"),IF(Table_RiskAssessment[[#This Row],[W2]]=1,\"d\",\"e\")))),\"?\")","v":"?"},null,null,null,"-"]
[null,null,null,"2006 / 42","1.5.11.",{"$f":"Sprache!A$132","v":"Strahlung von außen "},"x","","x",null,null,null,null,null,null,null,null,null,null,null,null,null,null,null,null,null,null,null,null,null,null,null,null,{"$f":"IF((Table_RiskAssessment[[#This Row],[S]]* Table_RiskAssessment[[#This Row],[F]]* Table_RiskAssessment[[#This Row],[P]]>0),IF(Table_RiskAssessment[[#This Row],[S]]=1,IF(Table_RiskAssessment[[#This Row],[F]]=1,IF(Table_RiskAssessment[[#This Row],[P]]=1,\"a\",IF(Table_RiskAssessment[[#This Row],[W]]=1,\"a\",\"b\")),IF(Table_RiskAssessment[[#This Row],[P]]=1,IF(Table_RiskAssessment[[#This Row],[W]]=1,\"a\",\"b\"),IF(Table_RiskAssessment[[#This Row],[W]]=1,\"b\",\"c\"))),IF(Table_RiskAssessment[[#This Row],[F]]=1,IF(Table_RiskAssessment[[#This Row],[P]]=1,IF(Table_RiskAssessment[[#This Row],[W]]=1,\"b\",\"c\"),IF(Table_RiskAssessment[[#This Row],[W]]=1,\"c\",\"d\")),IF(Table_RiskAssessment[[#This Row],[P]]=1,IF(Table_RiskAssessment[[#This Row],[W]]=1,\"c\",\"d\"),IF(Table_RiskAssessment[[#This Row],[W]]=1,\"d\",\"e\")))),\"?\")","v":"?"},null,null,null,null,null,null,null,null,null,null,null,null,null,null,{"$f":"IF((Table_RiskAssessment[[#This Row],[S2]]* Table_RiskAssessment[[#This Row],[F2]]* Table_RiskAssessment[[#This Row],[P2]]>0),IF(Table_RiskAssessment[[#This Row],[S2]]=1,IF(Table_RiskAssessment[[#This Row],[F2]]=1,IF(Table_RiskAssessment[[#This Row],[P2]]=1,\"a\",IF(Table_RiskAssessment[[#This Row],[W2]]=1,\"a\",\"b\")),IF(Table_RiskAssessment[[#This Row],[P2]]=1,IF(Table_RiskAssessment[[#This Row],[W2]]=1,\"a\",\"b\"),IF(Table_RiskAssessment[[#This Row],[W2]]=1,\"b\",\"c\"))),IF(Table_RiskAssessment[[#This Row],[F2]]=1,IF(Table_RiskAssessment[[#This Row],[P2]]=1,IF(Table_RiskAssessment[[#This Row],[W2]]=1,\"b\",\"c\"),IF(Table_RiskAssessment[[#This Row],[W2]]=1,\"c\",\"d\")),IF(Table_RiskAssessment[[#This Row],[P2]]=1,IF(Table_RiskAssessment[[#This Row],[W2]]=1,\"c\",\"d\"),IF(Table_RiskAssessment[[#This Row],[W2]]=1,\"d\",\"e\")))),\"?\")","v":"?"},null,null,null,"-"]
[null,null,null,"2006 / 42","1.5.12.",{"$f":"Sprache!A$133","v":"Laserstrahlung "},"x","","x",null,null,null,"---",null,null,null,null,null,null,null,null,null,null,null,null,null,null,null,null,null,null,null,null,{"$f":"IF((Table_RiskAssessment[[#This Row],[S]]* Table_RiskAssessment[[#This Row],[F]]* Table_RiskAssessment[[#This Row],[P]]>0),IF(Table_RiskAssessment[[#This Row],[S]]=1,IF(Table_RiskAssessment[[#This Row],[F]]=1,IF(Table_RiskAssessment[[#This Row],[P]]=1,\"a\",IF(Table_RiskAssessment[[#This Row],[W]]=1,\"a\",\"b\")),IF(Table_RiskAssessment[[#This Row],[P]]=1,IF(Table_RiskAssessment[[#This Row],[W]]=1,\"a\",\"b\"),IF(Table_RiskAssessment[[#This Row],[W]]=1,\"b\",\"c\"))),IF(Table_RiskAssessment[[#This Row],[F]]=1,IF(Table_RiskAssessment[[#This Row],[P]]=1,IF(Table_RiskAssessment[[#This Row],[W]]=1,\"b\",\"c\"),IF(Table_RiskAssessment[[#This Row],[W]]=1,\"c\",\"d\")),IF(Table_RiskAssessment[[#This Row],[P]]=1,IF(Table_RiskAssessment[[#This Row],[W]]=1,\"c\",\"d\"),IF(Table_RiskAssessment[[#This Row],[W]]=1,\"d\",\"e\")))),\"?\")","v":"?"},null,null,null,null,"---",null,null,null,null,null,null,null,null,null,{"$f":"IF((Table_RiskAssessment[[#This Row],[S2]]* Table_RiskAssessment[[#This Row],[F2]]* Table_RiskAssessment[[#This Row],[P2]]>0),IF(Table_RiskAssessment[[#This Row],[S2]]=1,IF(Table_RiskAssessment[[#This Row],[F2]]=1,IF(Table_RiskAssessment[[#This Row],[P2]]=1,\"a\",IF(Table_RiskAssessment[[#This Row],[W2]]=1,\"a\",\"b\")),IF(Table_RiskAssessment[[#This Row],[P2]]=1,IF(Table_RiskAssessment[[#This Row],[W2]]=1,\"a\",\"b\"),IF(Table_RiskAssessment[[#This Row],[W2]]=1,\"b\",\"c\"))),IF(Table_RiskAssessment[[#This Row],[F2]]=1,IF(Table_RiskAssessment[[#This Row],[P2]]=1,IF(Table_RiskAssessment[[#This Row],[W2]]=1,\"b\",\"c\"),IF(Table_RiskAssessment[[#This Row],[W2]]=1,\"c\",\"d\")),IF(Table_RiskAssessment[[#This Row],[P2]]=1,IF(Table_RiskAssessment[[#This Row],[W2]]=1,\"c\",\"d\"),IF(Table_RiskAssessment[[#This Row],[W2]]=1,\"d\",\"e\")))),\"?\")","v":"?"},null,null,null,"-"]
[null,null,null,"2006 / 42","1.5.13.",{"$f":"Sprache!A$134","v":"Emission gefährlicher Werkstoffe und Substanzen "},"x","","x",null,null,null,"---",null,null,null,null,null,null,null,null,null,null,null,null,null,null,null,null,null,null,null,null,{"$f":"IF((Table_RiskAssessment[[#This Row],[S]]* Table_RiskAssessment[[#This Row],[F]]* Table_RiskAssessment[[#This Row],[P]]>0),IF(Table_RiskAssessment[[#This Row],[S]]=1,IF(Table_RiskAssessment[[#This Row],[F]]=1,IF(Table_RiskAssessment[[#This Row],[P]]=1,\"a\",IF(Table_RiskAssessment[[#This Row],[W]]=1,\"a\",\"b\")),IF(Table_RiskAssessment[[#This Row],[P]]=1,IF(Table_RiskAssessment[[#This Row],[W]]=1,\"a\",\"b\"),IF(Table_RiskAssessment[[#This Row],[W]]=1,\"b\",\"c\"))),IF(Table_RiskAssessment[[#This Row],[F]]=1,IF(Table_RiskAssessment[[#This Row],[P]]=1,IF(Table_RiskAssessment[[#This Row],[W]]=1,\"b\",\"c\"),IF(Table_RiskAssessment[[#This Row],[W]]=1,\"c\",\"d\")),IF(Table_RiskAssessment[[#This Row],[P]]=1,IF(Table_RiskAssessment[[#This Row],[W]]=1,\"c\",\"d\"),IF(Table_RiskAssessment[[#This Row],[W]]=1,\"d\",\"e\")))),\"?\")","v":"?"},null,null,null,null,"---",null,null,null,null,null,null,null,null,null,{"$f":"IF((Table_RiskAssessment[[#This Row],[S2]]* Table_RiskAssessment[[#This Row],[F2]]* Table_RiskAssessment[[#This Row],[P2]]>0),IF(Table_RiskAssessment[[#This Row],[S2]]=1,IF(Table_RiskAssessment[[#This Row],[F2]]=1,IF(Table_RiskAssessment[[#This Row],[P2]]=1,\"a\",IF(Table_RiskAssessment[[#This Row],[W2]]=1,\"a\",\"b\")),IF(Table_RiskAssessment[[#This Row],[P2]]=1,IF(Table_RiskAssessment[[#This Row],[W2]]=1,\"a\",\"b\"),IF(Table_RiskAssessment[[#This Row],[W2]]=1,\"b\",\"c\"))),IF(Table_RiskAssessment[[#This Row],[F2]]=1,IF(Table_RiskAssessment[[#This Row],[P2]]=1,IF(Table_RiskAssessment[[#This Row],[W2]]=1,\"b\",\"c\"),IF(Table_RiskAssessment[[#This Row],[W2]]=1,\"c\",\"d\")),IF(Table_RiskAssessment[[#This Row],[P2]]=1,IF(Table_RiskAssessment[[#This Row],[W2]]=1,\"c\",\"d\"),IF(Table_RiskAssessment[[#This Row],[W2]]=1,\"d\",\"e\")))),\"?\")","v":"?"},null,null,null,"-"]
[null,null,null,"2006 / 42","1.5.14.",{"$f":"Sprache!A$135","v":"Risiko, in einer Maschine eingeschlossen zu werden"},"x","","x",null,null,null,null,null,null,null,null,null,null,null,null,null,null,null,null,null,null,null,null,null,null,null,null,{"$f":"IF((Table_RiskAssessment[[#This Row],[S]]* Table_RiskAssessment[[#This Row],[F]]* Table_RiskAssessment[[#This Row],[P]]>0),IF(Table_RiskAssessment[[#This Row],[S]]=1,IF(Table_RiskAssessment[[#This Row],[F]]=1,IF(Table_RiskAssessment[[#This Row],[P]]=1,\"a\",IF(Table_RiskAssessment[[#This Row],[W]]=1,\"a\",\"b\")),IF(Table_RiskAssessment[[#This Row],[P]]=1,IF(Table_RiskAssessment[[#This Row],[W]]=1,\"a\",\"b\"),IF(Table_RiskAssessment[[#This Row],[W]]=1,\"b\",\"c\"))),IF(Table_RiskAssessment[[#This Row],[F]]=1,IF(Table_RiskAssessment[[#This Row],[P]]=1,IF(Table_RiskAssessment[[#This Row],[W]]=1,\"b\",\"c\"),IF(Table_RiskAssessment[[#This Row],[W]]=1,\"c\",\"d\")),IF(Table_RiskAssessment[[#This Row],[P]]=1,IF(Table_RiskAssessment[[#This Row],[W]]=1,\"c\",\"d\"),IF(Table_RiskAssessment[[#This Row],[W]]=1,\"d\",\"e\")))),\"?\")","v":"?"},null,null,null,null,null,null,null,null,null,null,null,null,null,null,{"$f":"IF((Table_RiskAssessment[[#This Row],[S2]]* Table_RiskAssessment[[#This Row],[F2]]* Table_RiskAssessment[[#This Row],[P2]]>0),IF(Table_RiskAssessment[[#This Row],[S2]]=1,IF(Table_RiskAssessment[[#This Row],[F2]]=1,IF(Table_RiskAssessment[[#This Row],[P2]]=1,\"a\",IF(Table_RiskAssessment[[#This Row],[W2]]=1,\"a\",\"b\")),IF(Table_RiskAssessment[[#This Row],[P2]]=1,IF(Table_RiskAssessment[[#This Row],[W2]]=1,\"a\",\"b\"),IF(Table_RiskAssessment[[#This Row],[W2]]=1,\"b\",\"c\"))),IF(Table_RiskAssessment[[#This Row],[F2]]=1,IF(Table_RiskAssessment[[#This Row],[P2]]=1,IF(Table_RiskAssessment[[#This Row],[W2]]=1,\"b\",\"c\"),IF(Table_RiskAssessment[[#This Row],[W2]]=1,\"c\",\"d\")),IF(Table_RiskAssessment[[#This Row],[P2]]=1,IF(Table_RiskAssessment[[#This Row],[W2]]=1,\"c\",\"d\"),IF(Table_RiskAssessment[[#This Row],[W2]]=1,\"d\",\"e\")))),\"?\")","v":"?"},null,null,null,"-"]
[null,null,null,"2006 / 42","1.5.15.",{"$f":"Sprache!A$136","v":"Ausrutsch-, Stolper- und Sturzrisiko "},"x","","x",null,null,null,null,null,null,null,null,null,null,null,null,null,null,null,null,null,null,null,null,null,null,null,null,{"$f":"IF((Table_RiskAssessment[[#This Row],[S]]* Table_RiskAssessment[[#This Row],[F]]* Table_RiskAssessment[[#This Row],[P]]>0),IF(Table_RiskAssessment[[#This Row],[S]]=1,IF(Table_RiskAssessment[[#This Row],[F]]=1,IF(Table_RiskAssessment[[#This Row],[P]]=1,\"a\",IF(Table_RiskAssessment[[#This Row],[W]]=1,\"a\",\"b\")),IF(Table_RiskAssessment[[#This Row],[P]]=1,IF(Table_RiskAssessment[[#This Row],[W]]=1,\"a\",\"b\"),IF(Table_RiskAssessment[[#This Row],[W]]=1,\"b\",\"c\"))),IF(Table_RiskAssessment[[#This Row],[F]]=1,IF(Table_RiskAssessment[[#This Row],[P]]=1,IF(Table_RiskAssessment[[#This Row],[W]]=1,\"b\",\"c\"),IF(Table_RiskAssessment[[#This Row],[W]]=1,\"c\",\"d\")),IF(Table_RiskAssessment[[#This Row],[P]]=1,IF(Table_RiskAssessment[[#This Row],[W]]=1,\"c\",\"d\"),IF(Table_RiskAssessment[[#This Row],[W]]=1,\"d\",\"e\")))),\"?\")","v":"?"},null,null,null,null,null,null,null,null,null,null,null,null,null,null,{"$f":"IF((Table_RiskAssessment[[#This Row],[S2]]* Table_RiskAssessment[[#This Row],[F2]]* Table_RiskAssessment[[#This Row],[P2]]>0),IF(Table_RiskAssessment[[#This Row],[S2]]=1,IF(Table_RiskAssessment[[#This Row],[F2]]=1,IF(Table_RiskAssessment[[#This Row],[P2]]=1,\"a\",IF(Table_RiskAssessment[[#This Row],[W2]]=1,\"a\",\"b\")),IF(Table_RiskAssessment[[#This Row],[P2]]=1,IF(Table_RiskAssessment[[#This Row],[W2]]=1,\"a\",\"b\"),IF(Table_RiskAssessment[[#This Row],[W2]]=1,\"b\",\"c\"))),IF(Table_RiskAssessment[[#This Row],[F2]]=1,IF(Table_RiskAssessment[[#This Row],[P2]]=1,IF(Table_RiskAssessment[[#This Row],[W2]]=1,\"b\",\"c\"),IF(Table_RiskAssessment[[#This Row],[W2]]=1,\"c\",\"d\")),IF(Table_RiskAssessment[[#This Row],[P2]]=1,IF(Table_RiskAssessment[[#This Row],[W2]]=1,\"c\",\"d\"),IF(Table_RiskAssessment[[#This Row],[W2]]=1,\"d\",\"e\")))),\"?\")","v":"?"},null,null,null,"-"]
[null,null,null,"2006 / 42","1.5.16.",{"$f":"Sprache!A$137","v":"Blitzschlag "},"x","","x",null,null,null,null,null,null,null,null,null,null,null,null,null,null,null,null,null,null,null,null,null,null,null,null,{"$f":"IF((Table_RiskAssessment[[#This Row],[S]]* Table_RiskAssessment[[#This Row],[F]]* Table_RiskAssessment[[#This Row],[P]]>0),IF(Table_RiskAssessment[[#This Row],[S]]=1,IF(Table_RiskAssessment[[#This Row],[F]]=1,IF(Table_RiskAssessment[[#This Row],[P]]=1,\"a\",IF(Table_RiskAssessment[[#This Row],[W]]=1,\"a\",\"b\")),IF(Table_RiskAssessment[[#This Row],[P]]=1,IF(Table_RiskAssessment[[#This Row],[W]]=1,\"a\",\"b\"),IF(Table_RiskAssessment[[#This Row],[W]]=1,\"b\",\"c\"))),IF(Table_RiskAssessment[[#This Row],[F]]=1,IF(Table_RiskAssessment[[#This Row],[P]]=1,IF(Table_RiskAssessment[[#This Row],[W]]=1,\"b\",\"c\"),IF(Table_RiskAssessment[[#This Row],[W]]=1,\"c\",\"d\")),IF(Table_RiskAssessment[[#This Row],[P]]=1,IF(Table_RiskAssessment[[#This Row],[W]]=1,\"c\",\"d\"),IF(Table_RiskAssessment[[#This Row],[W]]=1,\"d\",\"e\")))),\"?\")","v":"?"},null,null,null,null,null,null,null,null,null,null,null,null,null,null,{"$f":"IF((Table_RiskAssessment[[#This Row],[S2]]* Table_RiskAssessment[[#This Row],[F2]]* Table_RiskAssessment[[#This Row],[P2]]>0),IF(Table_RiskAssessment[[#This Row],[S2]]=1,IF(Table_RiskAssessment[[#This Row],[F2]]=1,IF(Table_RiskAssessment[[#This Row],[P2]]=1,\"a\",IF(Table_RiskAssessment[[#This Row],[W2]]=1,\"a\",\"b\")),IF(Table_RiskAssessment[[#This Row],[P2]]=1,IF(Table_RiskAssessment[[#This Row],[W2]]=1,\"a\",\"b\"),IF(Table_RiskAssessment[[#This Row],[W2]]=1,\"b\",\"c\"))),IF(Table_RiskAssessment[[#This Row],[F2]]=1,IF(Table_RiskAssessment[[#This Row],[P2]]=1,IF(Table_RiskAssessment[[#This Row],[W2]]=1,\"b\",\"c\"),IF(Table_RiskAssessment[[#This Row],[W2]]=1,\"c\",\"d\")),IF(Table_RiskAssessment[[#This Row],[P2]]=1,IF(Table_RiskAssessment[[#This Row],[W2]]=1,\"c\",\"d\"),IF(Table_RiskAssessment[[#This Row],[W2]]=1,\"d\",\"e\")))),\"?\")","v":"?"},null,null,null,"-"]
[null,null,null,"2006 / 42","1.6.",{"$f":"Sprache!A$138","v":"Instandhaltung "},"x","x","x",null,null,null,null,null,null,null,null,null,null,null,null,null,null,null,null,null,null,null,null,null,null,null,null,{"$f":"IF((Table_RiskAssessment[[#This Row],[S]]* Table_RiskAssessment[[#This Row],[F]]* Table_RiskAssessment[[#This Row],[P]]>0),IF(Table_RiskAssessment[[#This Row],[S]]=1,IF(Table_RiskAssessment[[#This Row],[F]]=1,IF(Table_RiskAssessment[[#This Row],[P]]=1,\"a\",IF(Table_RiskAssessment[[#This Row],[W]]=1,\"a\",\"b\")),IF(Table_RiskAssessment[[#This Row],[P]]=1,IF(Table_RiskAssessment[[#This Row],[W]]=1,\"a\",\"b\"),IF(Table_RiskAssessment[[#This Row],[W]]=1,\"b\",\"c\"))),IF(Table_RiskAssessment[[#This Row],[F]]=1,IF(Table_RiskAssessment[[#This Row],[P]]=1,IF(Table_RiskAssessment[[#This Row],[W]]=1,\"b\",\"c\"),IF(Table_RiskAssessment[[#This Row],[W]]=1,\"c\",\"d\")),IF(Table_RiskAssessment[[#This Row],[P]]=1,IF(Table_RiskAssessment[[#This Row],[W]]=1,\"c\",\"d\"),IF(Table_RiskAssessment[[#This Row],[W]]=1,\"d\",\"e\")))),\"?\")","v":"?"},null,null,null,null,null,null,null,null,null,null,null,null,null,null,{"$f":"IF((Table_RiskAssessment[[#This Row],[S2]]* Table_RiskAssessment[[#This Row],[F2]]* Table_RiskAssessment[[#This Row],[P2]]>0),IF(Table_RiskAssessment[[#This Row],[S2]]=1,IF(Table_RiskAssessment[[#This Row],[F2]]=1,IF(Table_RiskAssessment[[#This Row],[P2]]=1,\"a\",IF(Table_RiskAssessment[[#This Row],[W2]]=1,\"a\",\"b\")),IF(Table_RiskAssessment[[#This Row],[P2]]=1,IF(Table_RiskAssessment[[#This Row],[W2]]=1,\"a\",\"b\"),IF(Table_RiskAssessment[[#This Row],[W2]]=1,\"b\",\"c\"))),IF(Table_RiskAssessment[[#This Row],[F2]]=1,IF(Table_RiskAssessment[[#This Row],[P2]]=1,IF(Table_RiskAssessment[[#This Row],[W2]]=1,\"b\",\"c\"),IF(Table_RiskAssessment[[#This Row],[W2]]=1,\"c\",\"d\")),IF(Table_RiskAssessment[[#This Row],[P2]]=1,IF(Table_RiskAssessment[[#This Row],[W2]]=1,\"c\",\"d\"),IF(Table_RiskAssessment[[#This Row],[W2]]=1,\"d\",\"e\")))),\"?\")","v":"?"},null,null,null,"-"]
[null,null,null,"2006 / 42","1.6.1.",{"$f":"Sprache!A$139","v":"Wartung der Maschine "},"x","","x",null,null,null,null,null,null,null,null,null,null,null,null,null,null,null,null,null,null,null,null,null,null,null,null,{"$f":"IF((Table_RiskAssessment[[#This Row],[S]]* Table_RiskAssessment[[#This Row],[F]]* Table_RiskAssessment[[#This Row],[P]]>0),IF(Table_RiskAssessment[[#This Row],[S]]=1,IF(Table_RiskAssessment[[#This Row],[F]]=1,IF(Table_RiskAssessment[[#This Row],[P]]=1,\"a\",IF(Table_RiskAssessment[[#This Row],[W]]=1,\"a\",\"b\")),IF(Table_RiskAssessment[[#This Row],[P]]=1,IF(Table_RiskAssessment[[#This Row],[W]]=1,\"a\",\"b\"),IF(Table_RiskAssessment[[#This Row],[W]]=1,\"b\",\"c\"))),IF(Table_RiskAssessment[[#This Row],[F]]=1,IF(Table_RiskAssessment[[#This Row],[P]]=1,IF(Table_RiskAssessment[[#This Row],[W]]=1,\"b\",\"c\"),IF(Table_RiskAssessment[[#This Row],[W]]=1,\"c\",\"d\")),IF(Table_RiskAssessment[[#This Row],[P]]=1,IF(Table_RiskAssessment[[#This Row],[W]]=1,\"c\",\"d\"),IF(Table_RiskAssessment[[#This Row],[W]]=1,\"d\",\"e\")))),\"?\")","v":"?"},null,null,null,null,null,null,null,null,null,null,null,null,null,null,{"$f":"IF((Table_RiskAssessment[[#This Row],[S2]]* Table_RiskAssessment[[#This Row],[F2]]* Table_RiskAssessment[[#This Row],[P2]]>0),IF(Table_RiskAssessment[[#This Row],[S2]]=1,IF(Table_RiskAssessment[[#This Row],[F2]]=1,IF(Table_RiskAssessment[[#This Row],[P2]]=1,\"a\",IF(Table_RiskAssessment[[#This Row],[W2]]=1,\"a\",\"b\")),IF(Table_RiskAssessment[[#This Row],[P2]]=1,IF(Table_RiskAssessment[[#This Row],[W2]]=1,\"a\",\"b\"),IF(Table_RiskAssessment[[#This Row],[W2]]=1,\"b\",\"c\"))),IF(Table_RiskAssessment[[#This Row],[F2]]=1,IF(Table_RiskAssessment[[#This Row],[P2]]=1,IF(Table_RiskAssessment[[#This Row],[W2]]=1,\"b\",\"c\"),IF(Table_RiskAssessment[[#This Row],[W2]]=1,\"c\",\"d\")),IF(Table_RiskAssessment[[#This Row],[P2]]=1,IF(Table_RiskAssessment[[#This Row],[W2]]=1,\"c\",\"d\"),IF(Table_RiskAssessment[[#This Row],[W2]]=1,\"d\",\"e\")))),\"?\")","v":"?"},null,null,null,"-"]
[null,null,null,"2006 / 42","1.6.2.",{"$f":"Sprache!A$140","v":"Zugang zu den Bedienungsständen und den Eingriffspunkten für die Instandhaltung "},"x","","x",null,null,null,"---",null,null,null,null,null,null,null,null,null,null,null,null,null,null,null,null,null,null,null,null,{"$f":"IF((Table_RiskAssessment[[#This Row],[S]]* Table_RiskAssessment[[#This Row],[F]]* Table_RiskAssessment[[#This Row],[P]]>0),IF(Table_RiskAssessment[[#This Row],[S]]=1,IF(Table_RiskAssessment[[#This Row],[F]]=1,IF(Table_RiskAssessment[[#This Row],[P]]=1,\"a\",IF(Table_RiskAssessment[[#This Row],[W]]=1,\"a\",\"b\")),IF(Table_RiskAssessment[[#This Row],[P]]=1,IF(Table_RiskAssessment[[#This Row],[W]]=1,\"a\",\"b\"),IF(Table_RiskAssessment[[#This Row],[W]]=1,\"b\",\"c\"))),IF(Table_RiskAssessment[[#This Row],[F]]=1,IF(Table_RiskAssessment[[#This Row],[P]]=1,IF(Table_RiskAssessment[[#This Row],[W]]=1,\"b\",\"c\"),IF(Table_RiskAssessment[[#This Row],[W]]=1,\"c\",\"d\")),IF(Table_RiskAssessment[[#This Row],[P]]=1,IF(Table_RiskAssessment[[#This Row],[W]]=1,\"c\",\"d\"),IF(Table_RiskAssessment[[#This Row],[W]]=1,\"d\",\"e\")))),\"?\")","v":"?"},null,null,null,null,"---",null,null,null,null,null,null,null,null,null,{"$f":"IF((Table_RiskAssessment[[#This Row],[S2]]* Table_RiskAssessment[[#This Row],[F2]]* Table_RiskAssessment[[#This Row],[P2]]>0),IF(Table_RiskAssessment[[#This Row],[S2]]=1,IF(Table_RiskAssessment[[#This Row],[F2]]=1,IF(Table_RiskAssessment[[#This Row],[P2]]=1,\"a\",IF(Table_RiskAssessment[[#This Row],[W2]]=1,\"a\",\"b\")),IF(Table_RiskAssessment[[#This Row],[P2]]=1,IF(Table_RiskAssessment[[#This Row],[W2]]=1,\"a\",\"b\"),IF(Table_RiskAssessment[[#This Row],[W2]]=1,\"b\",\"c\"))),IF(Table_RiskAssessment[[#This Row],[F2]]=1,IF(Table_RiskAssessment[[#This Row],[P2]]=1,IF(Table_RiskAssessment[[#This Row],[W2]]=1,\"b\",\"c\"),IF(Table_RiskAssessment[[#This Row],[W2]]=1,\"c\",\"d\")),IF(Table_RiskAssessment[[#This Row],[P2]]=1,IF(Table_RiskAssessment[[#This Row],[W2]]=1,\"c\",\"d\"),IF(Table_RiskAssessment[[#This Row],[W2]]=1,\"d\",\"e\")))),\"?\")","v":"?"},null,null,null,"-"]
[null,null,null,"2006 / 42","1.6.3.",{"$f":"Sprache!A$141","v":"Trennung von den Energiequellen "},"x","","x",null,null,null,null,null,null,null,null,null,null,null,null,null,null,null,null,null,null,null,null,null,null,null,null,{"$f":"IF((Table_RiskAssessment[[#This Row],[S]]* Table_RiskAssessment[[#This Row],[F]]* Table_RiskAssessment[[#This Row],[P]]>0),IF(Table_RiskAssessment[[#This Row],[S]]=1,IF(Table_RiskAssessment[[#This Row],[F]]=1,IF(Table_RiskAssessment[[#This Row],[P]]=1,\"a\",IF(Table_RiskAssessment[[#This Row],[W]]=1,\"a\",\"b\")),IF(Table_RiskAssessment[[#This Row],[P]]=1,IF(Table_RiskAssessment[[#This Row],[W]]=1,\"a\",\"b\"),IF(Table_RiskAssessment[[#This Row],[W]]=1,\"b\",\"c\"))),IF(Table_RiskAssessment[[#This Row],[F]]=1,IF(Table_RiskAssessment[[#This Row],[P]]=1,IF(Table_RiskAssessment[[#This Row],[W]]=1,\"b\",\"c\"),IF(Table_RiskAssessment[[#This Row],[W]]=1,\"c\",\"d\")),IF(Table_RiskAssessment[[#This Row],[P]]=1,IF(Table_RiskAssessment[[#This Row],[W]]=1,\"c\",\"d\"),IF(Table_RiskAssessment[[#This Row],[W]]=1,\"d\",\"e\")))),\"?\")","v":"?"},null,null,null,null,null,null,null,null,null,null,null,null,null,null,{"$f":"IF((Table_RiskAssessment[[#This Row],[S2]]* Table_RiskAssessment[[#This Row],[F2]]* Table_RiskAssessment[[#This Row],[P2]]>0),IF(Table_RiskAssessment[[#This Row],[S2]]=1,IF(Table_RiskAssessment[[#This Row],[F2]]=1,IF(Table_RiskAssessment[[#This Row],[P2]]=1,\"a\",IF(Table_RiskAssessment[[#This Row],[W2]]=1,\"a\",\"b\")),IF(Table_RiskAssessment[[#This Row],[P2]]=1,IF(Table_RiskAssessment[[#This Row],[W2]]=1,\"a\",\"b\"),IF(Table_RiskAssessment[[#This Row],[W2]]=1,\"b\",\"c\"))),IF(Table_RiskAssessment[[#This Row],[F2]]=1,IF(Table_RiskAssessment[[#This Row],[P2]]=1,IF(Table_RiskAssessment[[#This Row],[W2]]=1,\"b\",\"c\"),IF(Table_RiskAssessment[[#This Row],[W2]]=1,\"c\",\"d\")),IF(Table_RiskAssessment[[#This Row],[P2]]=1,IF(Table_RiskAssessment[[#This Row],[W2]]=1,\"c\",\"d\"),IF(Table_RiskAssessment[[#This Row],[W2]]=1,\"d\",\"e\")))),\"?\")","v":"?"},null,null,null,"-"]
[null,null,null,"2006 / 42","1.6.4.",{"$f":"Sprache!A$142","v":"Eingriffe des Bedienungspersonals "},"x","","x",null,null,null,null,null,null,null,null,null,null,null,null,null,null,null,null,null,null,null,null,null,null,null,null,{"$f":"IF((Table_RiskAssessment[[#This Row],[S]]* Table_RiskAssessment[[#This Row],[F]]* Table_RiskAssessment[[#This Row],[P]]>0),IF(Table_RiskAssessment[[#This Row],[S]]=1,IF(Table_RiskAssessment[[#This Row],[F]]=1,IF(Table_RiskAssessment[[#This Row],[P]]=1,\"a\",IF(Table_RiskAssessment[[#This Row],[W]]=1,\"a\",\"b\")),IF(Table_RiskAssessment[[#This Row],[P]]=1,IF(Table_RiskAssessment[[#This Row],[W]]=1,\"a\",\"b\"),IF(Table_RiskAssessment[[#This Row],[W]]=1,\"b\",\"c\"))),IF(Table_RiskAssessment[[#This Row],[F]]=1,IF(Table_RiskAssessment[[#This Row],[P]]=1,IF(Table_RiskAssessment[[#This Row],[W]]=1,\"b\",\"c\"),IF(Table_RiskAssessment[[#This Row],[W]]=1,\"c\",\"d\")),IF(Table_RiskAssessment[[#This Row],[P]]=1,IF(Table_RiskAssessment[[#This Row],[W]]=1,\"c\",\"d\"),IF(Table_RiskAssessment[[#This Row],[W]]=1,\"d\",\"e\")))),\"?\")","v":"?"},null,null,null,null,null,null,null,null,null,null,null,null,null,null,{"$f":"IF((Table_RiskAssessment[[#This Row],[S2]]* Table_RiskAssessment[[#This Row],[F2]]* Table_RiskAssessment[[#This Row],[P2]]>0),IF(Table_RiskAssessment[[#This Row],[S2]]=1,IF(Table_RiskAssessment[[#This Row],[F2]]=1,IF(Table_RiskAssessment[[#This Row],[P2]]=1,\"a\",IF(Table_RiskAssessment[[#This Row],[W2]]=1,\"a\",\"b\")),IF(Table_RiskAssessment[[#This Row],[P2]]=1,IF(Table_RiskAssessment[[#This Row],[W2]]=1,\"a\",\"b\"),IF(Table_RiskAssessment[[#This Row],[W2]]=1,\"b\",\"c\"))),IF(Table_RiskAssessment[[#This Row],[F2]]=1,IF(Table_RiskAssessment[[#This Row],[P2]]=1,IF(Table_RiskAssessment[[#This Row],[W2]]=1,\"b\",\"c\"),IF(Table_RiskAssessment[[#This Row],[W2]]=1,\"c\",\"d\")),IF(Table_RiskAssessment[[#This Row],[P2]]=1,IF(Table_RiskAssessment[[#This Row],[W2]]=1,\"c\",\"d\"),IF(Table_RiskAssessment[[#This Row],[W2]]=1,\"d\",\"e\")))),\"?\")","v":"?"},null,null,null,"-"]
[null,null,null,"2006 / 42","1.6.5.",{"$f":"Sprache!A$143","v":"Reinigung innen liegender Maschinenteile "},"x","","x",null,null,null,null,null,null,null,null,null,null,null,null,null,null,null,null,null,null,null,null,null,null,null,null,{"$f":"IF((Table_RiskAssessment[[#This Row],[S]]* Table_RiskAssessment[[#This Row],[F]]* Table_RiskAssessment[[#This Row],[P]]>0),IF(Table_RiskAssessment[[#This Row],[S]]=1,IF(Table_RiskAssessment[[#This Row],[F]]=1,IF(Table_RiskAssessment[[#This Row],[P]]=1,\"a\",IF(Table_RiskAssessment[[#This Row],[W]]=1,\"a\",\"b\")),IF(Table_RiskAssessment[[#This Row],[P]]=1,IF(Table_RiskAssessment[[#This Row],[W]]=1,\"a\",\"b\"),IF(Table_RiskAssessment[[#This Row],[W]]=1,\"b\",\"c\"))),IF(Table_RiskAssessment[[#This Row],[F]]=1,IF(Table_RiskAssessment[[#This Row],[P]]=1,IF(Table_RiskAssessment[[#This Row],[W]]=1,\"b\",\"c\"),IF(Table_RiskAssessment[[#This Row],[W]]=1,\"c\",\"d\")),IF(Table_RiskAssessment[[#This Row],[P]]=1,IF(Table_RiskAssessment[[#This Row],[W]]=1,\"c\",\"d\"),IF(Table_RiskAssessment[[#This Row],[W]]=1,\"d\",\"e\")))),\"?\")","v":"?"},null,null,null,null,null,null,null,null,null,null,null,null,null,null,{"$f":"IF((Table_RiskAssessment[[#This Row],[S2]]* Table_RiskAssessment[[#This Row],[F2]]* Table_RiskAssessment[[#This Row],[P2]]>0),IF(Table_RiskAssessment[[#This Row],[S2]]=1,IF(Table_RiskAssessment[[#This Row],[F2]]=1,IF(Table_RiskAssessment[[#This Row],[P2]]=1,\"a\",IF(Table_RiskAssessment[[#This Row],[W2]]=1,\"a\",\"b\")),IF(Table_RiskAssessment[[#This Row],[P2]]=1,IF(Table_RiskAssessment[[#This Row],[W2]]=1,\"a\",\"b\"),IF(Table_RiskAssessment[[#This Row],[W2]]=1,\"b\",\"c\"))),IF(Table_RiskAssessment[[#This Row],[F2]]=1,IF(Table_RiskAssessment[[#This Row],[P2]]=1,IF(Table_RiskAssessment[[#This Row],[W2]]=1,\"b\",\"c\"),IF(Table_RiskAssessment[[#This Row],[W2]]=1,\"c\",\"d\")),IF(Table_RiskAssessment[[#This Row],[P2]]=1,IF(Table_RiskAssessment[[#This Row],[W2]]=1,\"c\",\"d\"),IF(Table_RiskAssessment[[#This Row],[W2]]=1,\"d\",\"e\")))),\"?\")","v":"?"},null,null,null,"-"]
[null,null,null,"2006 / 42","1.7.",{"$f":"Sprache!A$144","v":"Informationen "},"x","x","x",null,null,null,null,null,null,null,null,null,null,null,null,null,null,null,null,null,null,null,null,null,null,null,null,{"$f":"IF((Table_RiskAssessment[[#This Row],[S]]* Table_RiskAssessment[[#This Row],[F]]* Table_RiskAssessment[[#This Row],[P]]>0),IF(Table_RiskAssessment[[#This Row],[S]]=1,IF(Table_RiskAssessment[[#This Row],[F]]=1,IF(Table_RiskAssessment[[#This Row],[P]]=1,\"a\",IF(Table_RiskAssessment[[#This Row],[W]]=1,\"a\",\"b\")),IF(Table_RiskAssessment[[#This Row],[P]]=1,IF(Table_RiskAssessment[[#This Row],[W]]=1,\"a\",\"b\"),IF(Table_RiskAssessment[[#This Row],[W]]=1,\"b\",\"c\"))),IF(Table_RiskAssessment[[#This Row],[F]]=1,IF(Table_RiskAssessment[[#This Row],[P]]=1,IF(Table_RiskAssessment[[#This Row],[W]]=1,\"b\",\"c\"),IF(Table_RiskAssessment[[#This Row],[W]]=1,\"c\",\"d\")),IF(Table_RiskAssessment[[#This Row],[P]]=1,IF(Table_RiskAssessment[[#This Row],[W]]=1,\"c\",\"d\"),IF(Table_RiskAssessment[[#This Row],[W]]=1,\"d\",\"e\")))),\"?\")","v":"?"},null,null,null,null,null,null,null,null,null,null,null,null,null,null,{"$f":"IF((Table_RiskAssessment[[#This Row],[S2]]* Table_RiskAssessment[[#This Row],[F2]]* Table_RiskAssessment[[#This Row],[P2]]>0),IF(Table_RiskAssessment[[#This Row],[S2]]=1,IF(Table_RiskAssessment[[#This Row],[F2]]=1,IF(Table_RiskAssessment[[#This Row],[P2]]=1,\"a\",IF(Table_RiskAssessment[[#This Row],[W2]]=1,\"a\",\"b\")),IF(Table_RiskAssessment[[#This Row],[P2]]=1,IF(Table_RiskAssessment[[#This Row],[W2]]=1,\"a\",\"b\"),IF(Table_RiskAssessment[[#This Row],[W2]]=1,\"b\",\"c\"))),IF(Table_RiskAssessment[[#This Row],[F2]]=1,IF(Table_RiskAssessment[[#This Row],[P2]]=1,IF(Table_RiskAssessment[[#This Row],[W2]]=1,\"b\",\"c\"),IF(Table_RiskAssessment[[#This Row],[W2]]=1,\"c\",\"d\")),IF(Table_RiskAssessment[[#This Row],[P2]]=1,IF(Table_RiskAssessment[[#This Row],[W2]]=1,\"c\",\"d\"),IF(Table_RiskAssessment[[#This Row],[W2]]=1,\"d\",\"e\")))),\"?\")","v":"?"},null,null,null,"-"]
[null,null,null,"2006 / 42","1.7.1.",{"$f":"Sprache!A$145","v":"Informationen und Warnhinweise an der Maschine "},"x","","x",null,null,null,null,null,null,null,null,null,null,null,null,null,null,null,null,null,null,null,null,null,null,null,null,{"$f":"IF((Table_RiskAssessment[[#This Row],[S]]* Table_RiskAssessment[[#This Row],[F]]* Table_RiskAssessment[[#This Row],[P]]>0),IF(Table_RiskAssessment[[#This Row],[S]]=1,IF(Table_RiskAssessment[[#This Row],[F]]=1,IF(Table_RiskAssessment[[#This Row],[P]]=1,\"a\",IF(Table_RiskAssessment[[#This Row],[W]]=1,\"a\",\"b\")),IF(Table_RiskAssessment[[#This Row],[P]]=1,IF(Table_RiskAssessment[[#This Row],[W]]=1,\"a\",\"b\"),IF(Table_RiskAssessment[[#This Row],[W]]=1,\"b\",\"c\"))),IF(Table_RiskAssessment[[#This Row],[F]]=1,IF(Table_RiskAssessment[[#This Row],[P]]=1,IF(Table_RiskAssessment[[#This Row],[W]]=1,\"b\",\"c\"),IF(Table_RiskAssessment[[#This Row],[W]]=1,\"c\",\"d\")),IF(Table_RiskAssessment[[#This Row],[P]]=1,IF(Table_RiskAssessment[[#This Row],[W]]=1,\"c\",\"d\"),IF(Table_RiskAssessment[[#This Row],[W]]=1,\"d\",\"e\")))),\"?\")","v":"?"},null,null,null,null,null,null,null,null,null,null,null,null,null,null,{"$f":"IF((Table_RiskAssessment[[#This Row],[S2]]* Table_RiskAssessment[[#This Row],[F2]]* Table_RiskAssessment[[#This Row],[P2]]>0),IF(Table_RiskAssessment[[#This Row],[S2]]=1,IF(Table_RiskAssessment[[#This Row],[F2]]=1,IF(Table_RiskAssessment[[#This Row],[P2]]=1,\"a\",IF(Table_RiskAssessment[[#This Row],[W2]]=1,\"a\",\"b\")),IF(Table_RiskAssessment[[#This Row],[P2]]=1,IF(Table_RiskAssessment[[#This Row],[W2]]=1,\"a\",\"b\"),IF(Table_RiskAssessment[[#This Row],[W2]]=1,\"b\",\"c\"))),IF(Table_RiskAssessment[[#This Row],[F2]]=1,IF(Table_RiskAssessment[[#This Row],[P2]]=1,IF(Table_RiskAssessment[[#This Row],[W2]]=1,\"b\",\"c\"),IF(Table_RiskAssessment[[#This Row],[W2]]=1,\"c\",\"d\")),IF(Table_RiskAssessment[[#This Row],[P2]]=1,IF(Table_RiskAssessment[[#This Row],[W2]]=1,\"c\",\"d\"),IF(Table_RiskAssessment[[#This Row],[W2]]=1,\"d\",\"e\")))),\"?\")","v":"?"},null,null,null,"-"]
[null,null,null,"2006 / 42","1.7.1.1.",{"$f":"Sprache!A$146","v":"Informationen und Informationseinrichtungen "},"x","","x",null,null,null,null,null,null,null,null,null,null,null,null,null,null,null,null,null,null,null,null,null,null,null,null,{"$f":"IF((Table_RiskAssessment[[#This Row],[S]]* Table_RiskAssessment[[#This Row],[F]]* Table_RiskAssessment[[#This Row],[P]]>0),IF(Table_RiskAssessment[[#This Row],[S]]=1,IF(Table_RiskAssessment[[#This Row],[F]]=1,IF(Table_RiskAssessment[[#This Row],[P]]=1,\"a\",IF(Table_RiskAssessment[[#This Row],[W]]=1,\"a\",\"b\")),IF(Table_RiskAssessment[[#This Row],[P]]=1,IF(Table_RiskAssessment[[#This Row],[W]]=1,\"a\",\"b\"),IF(Table_RiskAssessment[[#This Row],[W]]=1,\"b\",\"c\"))),IF(Table_RiskAssessment[[#This Row],[F]]=1,IF(Table_RiskAssessment[[#This Row],[P]]=1,IF(Table_RiskAssessment[[#This Row],[W]]=1,\"b\",\"c\"),IF(Table_RiskAssessment[[#This Row],[W]]=1,\"c\",\"d\")),IF(Table_RiskAssessment[[#This Row],[P]]=1,IF(Table_RiskAssessment[[#This Row],[W]]=1,\"c\",\"d\"),IF(Table_RiskAssessment[[#This Row],[W]]=1,\"d\",\"e\")))),\"?\")","v":"?"},null,null,null,null,null,null,null,null,null,null,null,null,null,null,{"$f":"IF((Table_RiskAssessment[[#This Row],[S2]]* Table_RiskAssessment[[#This Row],[F2]]* Table_RiskAssessment[[#This Row],[P2]]>0),IF(Table_RiskAssessment[[#This Row],[S2]]=1,IF(Table_RiskAssessment[[#This Row],[F2]]=1,IF(Table_RiskAssessment[[#This Row],[P2]]=1,\"a\",IF(Table_RiskAssessment[[#This Row],[W2]]=1,\"a\",\"b\")),IF(Table_RiskAssessment[[#This Row],[P2]]=1,IF(Table_RiskAssessment[[#This Row],[W2]]=1,\"a\",\"b\"),IF(Table_RiskAssessment[[#This Row],[W2]]=1,\"b\",\"c\"))),IF(Table_RiskAssessment[[#This Row],[F2]]=1,IF(Table_RiskAssessment[[#This Row],[P2]]=1,IF(Table_RiskAssessment[[#This Row],[W2]]=1,\"b\",\"c\"),IF(Table_RiskAssessment[[#This Row],[W2]]=1,\"c\",\"d\")),IF(Table_RiskAssessment[[#This Row],[P2]]=1,IF(Table_RiskAssessment[[#This Row],[W2]]=1,\"c\",\"d\"),IF(Table_RiskAssessment[[#This Row],[W2]]=1,\"d\",\"e\")))),\"?\")","v":"?"},null,null,null,"-"]
[null,null,null,"2006 / 42","1.7.1.2.",{"$f":"Sprache!A$147","v":"Warneinrichtungen "},"x","","x",null,null,null,null,null,null,null,null,null,null,null,null,null,null,null,null,null,null,null,null,null,null,null,null,{"$f":"IF((Table_RiskAssessment[[#This Row],[S]]* Table_RiskAssessment[[#This Row],[F]]* Table_RiskAssessment[[#This Row],[P]]>0),IF(Table_RiskAssessment[[#This Row],[S]]=1,IF(Table_RiskAssessment[[#This Row],[F]]=1,IF(Table_RiskAssessment[[#This Row],[P]]=1,\"a\",IF(Table_RiskAssessment[[#This Row],[W]]=1,\"a\",\"b\")),IF(Table_RiskAssessment[[#This Row],[P]]=1,IF(Table_RiskAssessment[[#This Row],[W]]=1,\"a\",\"b\"),IF(Table_RiskAssessment[[#This Row],[W]]=1,\"b\",\"c\"))),IF(Table_RiskAssessment[[#This Row],[F]]=1,IF(Table_RiskAssessment[[#This Row],[P]]=1,IF(Table_RiskAssessment[[#This Row],[W]]=1,\"b\",\"c\"),IF(Table_RiskAssessment[[#This Row],[W]]=1,\"c\",\"d\")),IF(Table_RiskAssessment[[#This Row],[P]]=1,IF(Table_RiskAssessment[[#This Row],[W]]=1,\"c\",\"d\"),IF(Table_RiskAssessment[[#This Row],[W]]=1,\"d\",\"e\")))),\"?\")","v":"?"},null,null,null,null,null,null,null,null,null,null,null,null,null,null,{"$f":"IF((Table_RiskAssessment[[#This Row],[S2]]* Table_RiskAssessment[[#This Row],[F2]]* Table_RiskAssessment[[#This Row],[P2]]>0),IF(Table_RiskAssessment[[#This Row],[S2]]=1,IF(Table_RiskAssessment[[#This Row],[F2]]=1,IF(Table_RiskAssessment[[#This Row],[P2]]=1,\"a\",IF(Table_RiskAssessment[[#This Row],[W2]]=1,\"a\",\"b\")),IF(Table_RiskAssessment[[#This Row],[P2]]=1,IF(Table_RiskAssessment[[#This Row],[W2]]=1,\"a\",\"b\"),IF(Table_RiskAssessment[[#This Row],[W2]]=1,\"b\",\"c\"))),IF(Table_RiskAssessment[[#This Row],[F2]]=1,IF(Table_RiskAssessment[[#This Row],[P2]]=1,IF(Table_RiskAssessment[[#This Row],[W2]]=1,\"b\",\"c\"),IF(Table_RiskAssessment[[#This Row],[W2]]=1,\"c\",\"d\")),IF(Table_RiskAssessment[[#This Row],[P2]]=1,IF(Table_RiskAssessment[[#This Row],[W2]]=1,\"c\",\"d\"),IF(Table_RiskAssessment[[#This Row],[W2]]=1,\"d\",\"e\")))),\"?\")","v":"?"},null,null,null,"-"]
[null,null,null,"2006 / 42","1.7.2.",{"$f":"Sprache!A$148","v":"Warnung vor Restrisiken "},"x","","x",null,null,null,"---",null,null,null,null,null,null,null,null,null,null,null,null,null,null,null,null,null,null,null,null,{"$f":"IF((Table_RiskAssessment[[#This Row],[S]]* Table_RiskAssessment[[#This Row],[F]]* Table_RiskAssessment[[#This Row],[P]]>0),IF(Table_RiskAssessment[[#This Row],[S]]=1,IF(Table_RiskAssessment[[#This Row],[F]]=1,IF(Table_RiskAssessment[[#This Row],[P]]=1,\"a\",IF(Table_RiskAssessment[[#This Row],[W]]=1,\"a\",\"b\")),IF(Table_RiskAssessment[[#This Row],[P]]=1,IF(Table_RiskAssessment[[#This Row],[W]]=1,\"a\",\"b\"),IF(Table_RiskAssessment[[#This Row],[W]]=1,\"b\",\"c\"))),IF(Table_RiskAssessment[[#This Row],[F]]=1,IF(Table_RiskAssessment[[#This Row],[P]]=1,IF(Table_RiskAssessment[[#This Row],[W]]=1,\"b\",\"c\"),IF(Table_RiskAssessment[[#This Row],[W]]=1,\"c\",\"d\")),IF(Table_RiskAssessment[[#This Row],[P]]=1,IF(Table_RiskAssessment[[#This Row],[W]]=1,\"c\",\"d\"),IF(Table_RiskAssessment[[#This Row],[W]]=1,\"d\",\"e\")))),\"?\")","v":"?"},null,null,null,null,"---",null,null,null,null,null,null,null,null,null,{"$f":"IF((Table_RiskAssessment[[#This Row],[S2]]* Table_RiskAssessment[[#This Row],[F2]]* Table_RiskAssessment[[#This Row],[P2]]>0),IF(Table_RiskAssessment[[#This Row],[S2]]=1,IF(Table_RiskAssessment[[#This Row],[F2]]=1,IF(Table_RiskAssessment[[#This Row],[P2]]=1,\"a\",IF(Table_RiskAssessment[[#This Row],[W2]]=1,\"a\",\"b\")),IF(Table_RiskAssessment[[#This Row],[P2]]=1,IF(Table_RiskAssessment[[#This Row],[W2]]=1,\"a\",\"b\"),IF(Table_RiskAssessment[[#This Row],[W2]]=1,\"b\",\"c\"))),IF(Table_RiskAssessment[[#This Row],[F2]]=1,IF(Table_RiskAssessment[[#This Row],[P2]]=1,IF(Table_RiskAssessment[[#This Row],[W2]]=1,\"b\",\"c\"),IF(Table_RiskAssessment[[#This Row],[W2]]=1,\"c\",\"d\")),IF(Table_RiskAssessment[[#This Row],[P2]]=1,IF(Table_RiskAssessment[[#This Row],[W2]]=1,\"c\",\"d\"),IF(Table_RiskAssessment[[#This Row],[W2]]=1,\"d\",\"e\")))),\"?\")","v":"?"},null,null,null,"-"]
[null,null,null,"2006 / 42","1.7.3.",{"$f":"Sprache!A$149","v":"Kennzeichnung der Maschinen "},"x","","x",null,null,null,null,null,null,null,null,null,null,null,null,null,null,null,null,null,null,null,null,null,null,null,null,{"$f":"IF((Table_RiskAssessment[[#This Row],[S]]* Table_RiskAssessment[[#This Row],[F]]* Table_RiskAssessment[[#This Row],[P]]>0),IF(Table_RiskAssessment[[#This Row],[S]]=1,IF(Table_RiskAssessment[[#This Row],[F]]=1,IF(Table_RiskAssessment[[#This Row],[P]]=1,\"a\",IF(Table_RiskAssessment[[#This Row],[W]]=1,\"a\",\"b\")),IF(Table_RiskAssessment[[#This Row],[P]]=1,IF(Table_RiskAssessment[[#This Row],[W]]=1,\"a\",\"b\"),IF(Table_RiskAssessment[[#This Row],[W]]=1,\"b\",\"c\"))),IF(Table_RiskAssessment[[#This Row],[F]]=1,IF(Table_RiskAssessment[[#This Row],[P]]=1,IF(Table_RiskAssessment[[#This Row],[W]]=1,\"b\",\"c\"),IF(Table_RiskAssessment[[#This Row],[W]]=1,\"c\",\"d\")),IF(Table_RiskAssessment[[#This Row],[P]]=1,IF(Table_RiskAssessment[[#This Row],[W]]=1,\"c\",\"d\"),IF(Table_RiskAssessment[[#This Row],[W]]=1,\"d\",\"e\")))),\"?\")","v":"?"},null,null,null,null,null,null,null,null,null,null,null,null,null,null,{"$f":"IF((Table_RiskAssessment[[#This Row],[S2]]* Table_RiskAssessment[[#This Row],[F2]]* Table_RiskAssessment[[#This Row],[P2]]>0),IF(Table_RiskAssessment[[#This Row],[S2]]=1,IF(Table_RiskAssessment[[#This Row],[F2]]=1,IF(Table_RiskAssessment[[#This Row],[P2]]=1,\"a\",IF(Table_RiskAssessment[[#This Row],[W2]]=1,\"a\",\"b\")),IF(Table_RiskAssessment[[#This Row],[P2]]=1,IF(Table_RiskAssessment[[#This Row],[W2]]=1,\"a\",\"b\"),IF(Table_RiskAssessment[[#This Row],[W2]]=1,\"b\",\"c\"))),IF(Table_RiskAssessment[[#This Row],[F2]]=1,IF(Table_RiskAssessment[[#This Row],[P2]]=1,IF(Table_RiskAssessment[[#This Row],[W2]]=1,\"b\",\"c\"),IF(Table_RiskAssessment[[#This Row],[W2]]=1,\"c\",\"d\")),IF(Table_RiskAssessment[[#This Row],[P2]]=1,IF(Table_RiskAssessment[[#This Row],[W2]]=1,\"c\",\"d\"),IF(Table_RiskAssessment[[#This Row],[W2]]=1,\"d\",\"e\")))),\"?\")","v":"?"},null,null,null,"-"]
[null,null,null,"2006 / 42","1.7.4.",{"$f":"Sprache!A$150","v":"Betriebsanleitung "},"x","","x",null,null,null,null,null,null,null,null,null,null,null,null,null,null,null,null,null,null,null,null,null,null,null,null,{"$f":"IF((Table_RiskAssessment[[#This Row],[S]]* Table_RiskAssessment[[#This Row],[F]]* Table_RiskAssessment[[#This Row],[P]]>0),IF(Table_RiskAssessment[[#This Row],[S]]=1,IF(Table_RiskAssessment[[#This Row],[F]]=1,IF(Table_RiskAssessment[[#This Row],[P]]=1,\"a\",IF(Table_RiskAssessment[[#This Row],[W]]=1,\"a\",\"b\")),IF(Table_RiskAssessment[[#This Row],[P]]=1,IF(Table_RiskAssessment[[#This Row],[W]]=1,\"a\",\"b\"),IF(Table_RiskAssessment[[#This Row],[W]]=1,\"b\",\"c\"))),IF(Table_RiskAssessment[[#This Row],[F]]=1,IF(Table_RiskAssessment[[#This Row],[P]]=1,IF(Table_RiskAssessment[[#This Row],[W]]=1,\"b\",\"c\"),IF(Table_RiskAssessment[[#This Row],[W]]=1,\"c\",\"d\")),IF(Table_RiskAssessment[[#This Row],[P]]=1,IF(Table_RiskAssessment[[#This Row],[W]]=1,\"c\",\"d\"),IF(Table_RiskAssessment[[#This Row],[W]]=1,\"d\",\"e\")))),\"?\")","v":"?"},null,null,null,null,null,null,null,null,null,null,null,null,null,null,{"$f":"IF((Table_RiskAssessment[[#This Row],[S2]]* Table_RiskAssessment[[#This Row],[F2]]* Table_RiskAssessment[[#This Row],[P2]]>0),IF(Table_RiskAssessment[[#This Row],[S2]]=1,IF(Table_RiskAssessment[[#This Row],[F2]]=1,IF(Table_RiskAssessment[[#This Row],[P2]]=1,\"a\",IF(Table_RiskAssessment[[#This Row],[W2]]=1,\"a\",\"b\")),IF(Table_RiskAssessment[[#This Row],[P2]]=1,IF(Table_RiskAssessment[[#This Row],[W2]]=1,\"a\",\"b\"),IF(Table_RiskAssessment[[#This Row],[W2]]=1,\"b\",\"c\"))),IF(Table_RiskAssessment[[#This Row],[F2]]=1,IF(Table_RiskAssessment[[#This Row],[P2]]=1,IF(Table_RiskAssessment[[#This Row],[W2]]=1,\"b\",\"c\"),IF(Table_RiskAssessment[[#This Row],[W2]]=1,\"c\",\"d\")),IF(Table_RiskAssessment[[#This Row],[P2]]=1,IF(Table_RiskAssessment[[#This Row],[W2]]=1,\"c\",\"d\"),IF(Table_RiskAssessment[[#This Row],[W2]]=1,\"d\",\"e\")))),\"?\")","v":"?"},null,null,null,"-"]
[null,null,null,"2006 / 42","1.7.4.1.",{"$f":"Sprache!A$151","v":"Allgemeine Grundsätze für die Abfassung der Betriebsanleitung "},"x","","x",null,null,null,null,null,null,null,null,null,null,null,null,null,null,null,null,null,null,null,null,null,null,null,null,{"$f":"IF((Table_RiskAssessment[[#This Row],[S]]* Table_RiskAssessment[[#This Row],[F]]* Table_RiskAssessment[[#This Row],[P]]>0),IF(Table_RiskAssessment[[#This Row],[S]]=1,IF(Table_RiskAssessment[[#This Row],[F]]=1,IF(Table_RiskAssessment[[#This Row],[P]]=1,\"a\",IF(Table_RiskAssessment[[#This Row],[W]]=1,\"a\",\"b\")),IF(Table_RiskAssessment[[#This Row],[P]]=1,IF(Table_RiskAssessment[[#This Row],[W]]=1,\"a\",\"b\"),IF(Table_RiskAssessment[[#This Row],[W]]=1,\"b\",\"c\"))),IF(Table_RiskAssessment[[#This Row],[F]]=1,IF(Table_RiskAssessment[[#This Row],[P]]=1,IF(Table_RiskAssessment[[#This Row],[W]]=1,\"b\",\"c\"),IF(Table_RiskAssessment[[#This Row],[W]]=1,\"c\",\"d\")),IF(Table_RiskAssessment[[#This Row],[P]]=1,IF(Table_RiskAssessment[[#This Row],[W]]=1,\"c\",\"d\"),IF(Table_RiskAssessment[[#This Row],[W]]=1,\"d\",\"e\")))),\"?\")","v":"?"},null,null,null,null,null,null,null,null,null,null,null,null,null,null,{"$f":"IF((Table_RiskAssessment[[#This Row],[S2]]* Table_RiskAssessment[[#This Row],[F2]]* Table_RiskAssessment[[#This Row],[P2]]>0),IF(Table_RiskAssessment[[#This Row],[S2]]=1,IF(Table_RiskAssessment[[#This Row],[F2]]=1,IF(Table_RiskAssessment[[#This Row],[P2]]=1,\"a\",IF(Table_RiskAssessment[[#This Row],[W2]]=1,\"a\",\"b\")),IF(Table_RiskAssessment[[#This Row],[P2]]=1,IF(Table_RiskAssessment[[#This Row],[W2]]=1,\"a\",\"b\"),IF(Table_RiskAssessment[[#This Row],[W2]]=1,\"b\",\"c\"))),IF(Table_RiskAssessment[[#This Row],[F2]]=1,IF(Table_RiskAssessment[[#This Row],[P2]]=1,IF(Table_RiskAssessment[[#This Row],[W2]]=1,\"b\",\"c\"),IF(Table_RiskAssessment[[#This Row],[W2]]=1,\"c\",\"d\")),IF(Table_RiskAssessment[[#This Row],[P2]]=1,IF(Table_RiskAssessment[[#This Row],[W2]]=1,\"c\",\"d\"),IF(Table_RiskAssessment[[#This Row],[W2]]=1,\"d\",\"e\")))),\"?\")","v":"?"},null,null,null,"-"]
[null,null,null,"2006 / 42","1.7.4.2.",{"$f":"Sprache!A$152","v":"Inhalt der Betriebsanleitung "},"x","","x",null,null,null,null,null,null,null,null,null,null,null,null,null,null,null,null,null,null,null,null,null,null,null,null,{"$f":"IF((Table_RiskAssessment[[#This Row],[S]]* Table_RiskAssessment[[#This Row],[F]]* Table_RiskAssessment[[#This Row],[P]]>0),IF(Table_RiskAssessment[[#This Row],[S]]=1,IF(Table_RiskAssessment[[#This Row],[F]]=1,IF(Table_RiskAssessment[[#This Row],[P]]=1,\"a\",IF(Table_RiskAssessment[[#This Row],[W]]=1,\"a\",\"b\")),IF(Table_RiskAssessment[[#This Row],[P]]=1,IF(Table_RiskAssessment[[#This Row],[W]]=1,\"a\",\"b\"),IF(Table_RiskAssessment[[#This Row],[W]]=1,\"b\",\"c\"))),IF(Table_RiskAssessment[[#This Row],[F]]=1,IF(Table_RiskAssessment[[#This Row],[P]]=1,IF(Table_RiskAssessment[[#This Row],[W]]=1,\"b\",\"c\"),IF(Table_RiskAssessment[[#This Row],[W]]=1,\"c\",\"d\")),IF(Table_RiskAssessment[[#This Row],[P]]=1,IF(Table_RiskAssessment[[#This Row],[W]]=1,\"c\",\"d\"),IF(Table_RiskAssessment[[#This Row],[W]]=1,\"d\",\"e\")))),\"?\")","v":"?"},null,null,null,null,null,null,null,null,null,null,null,null,null,null,{"$f":"IF((Table_RiskAssessment[[#This Row],[S2]]* Table_RiskAssessment[[#This Row],[F2]]* Table_RiskAssessment[[#This Row],[P2]]>0),IF(Table_RiskAssessment[[#This Row],[S2]]=1,IF(Table_RiskAssessment[[#This Row],[F2]]=1,IF(Table_RiskAssessment[[#This Row],[P2]]=1,\"a\",IF(Table_RiskAssessment[[#This Row],[W2]]=1,\"a\",\"b\")),IF(Table_RiskAssessment[[#This Row],[P2]]=1,IF(Table_RiskAssessment[[#This Row],[W2]]=1,\"a\",\"b\"),IF(Table_RiskAssessment[[#This Row],[W2]]=1,\"b\",\"c\"))),IF(Table_RiskAssessment[[#This Row],[F2]]=1,IF(Table_RiskAssessment[[#This Row],[P2]]=1,IF(Table_RiskAssessment[[#This Row],[W2]]=1,\"b\",\"c\"),IF(Table_RiskAssessment[[#This Row],[W2]]=1,\"c\",\"d\")),IF(Table_RiskAssessment[[#This Row],[P2]]=1,IF(Table_RiskAssessment[[#This Row],[W2]]=1,\"c\",\"d\"),IF(Table_RiskAssessment[[#This Row],[W2]]=1,\"d\",\"e\")))),\"?\")","v":"?"},null,null,null,"-"]
[null,null,null,"2006 / 42","1.7.4.3.",{"$f":"Sprache!A$153","v":"Verkaufsprospekte"},"x","","x",null,null,null,null,null,null,null,null,null,null,null,null,null,null,null,null,null,null,null,null,null,null,null,null,{"$f":"IF((Table_RiskAssessment[[#This Row],[S]]* Table_RiskAssessment[[#This Row],[F]]* Table_RiskAssessment[[#This Row],[P]]>0),IF(Table_RiskAssessment[[#This Row],[S]]=1,IF(Table_RiskAssessment[[#This Row],[F]]=1,IF(Table_RiskAssessment[[#This Row],[P]]=1,\"a\",IF(Table_RiskAssessment[[#This Row],[W]]=1,\"a\",\"b\")),IF(Table_RiskAssessment[[#This Row],[P]]=1,IF(Table_RiskAssessment[[#This Row],[W]]=1,\"a\",\"b\"),IF(Table_RiskAssessment[[#This Row],[W]]=1,\"b\",\"c\"))),IF(Table_RiskAssessment[[#This Row],[F]]=1,IF(Table_RiskAssessment[[#This Row],[P]]=1,IF(Table_RiskAssessment[[#This Row],[W]]=1,\"b\",\"c\"),IF(Table_RiskAssessment[[#This Row],[W]]=1,\"c\",\"d\")),IF(Table_RiskAssessment[[#This Row],[P]]=1,IF(Table_RiskAssessment[[#This Row],[W]]=1,\"c\",\"d\"),IF(Table_RiskAssessment[[#This Row],[W]]=1,\"d\",\"e\")))),\"?\")","v":"?"},null,null,null,null,null,null,null,null,null,null,null,null,null,null,{"$f":"IF((Table_RiskAssessment[[#This Row],[S2]]* Table_RiskAssessment[[#This Row],[F2]]* Table_RiskAssessment[[#This Row],[P2]]>0),IF(Table_RiskAssessment[[#This Row],[S2]]=1,IF(Table_RiskAssessment[[#This Row],[F2]]=1,IF(Table_RiskAssessment[[#This Row],[P2]]=1,\"a\",IF(Table_RiskAssessment[[#This Row],[W2]]=1,\"a\",\"b\")),IF(Table_RiskAssessment[[#This Row],[P2]]=1,IF(Table_RiskAssessment[[#This Row],[W2]]=1,\"a\",\"b\"),IF(Table_RiskAssessment[[#This Row],[W2]]=1,\"b\",\"c\"))),IF(Table_RiskAssessment[[#This Row],[F2]]=1,IF(Table_RiskAssessment[[#This Row],[P2]]=1,IF(Table_RiskAssessment[[#This Row],[W2]]=1,\"b\",\"c\"),IF(Table_RiskAssessment[[#This Row],[W2]]=1,\"c\",\"d\")),IF(Table_RiskAssessment[[#This Row],[P2]]=1,IF(Table_RiskAssessment[[#This Row],[W2]]=1,\"c\",\"d\"),IF(Table_RiskAssessment[[#This Row],[W2]]=1,\"d\",\"e\")))),\"?\")","v":"?"},null,null,null,"-"]
[null,null,null,"2006 / 42","2.",{"$f":"Sprache!A$154","v":"Bestimmte Maschinengattungen"},"x","x","x",null,null,null,null,null,null,null,null,null,null,null,null,null,null,null,null,null,null,null,null,null,null,null,null,{"$f":"IF((Table_RiskAssessment[[#This Row],[S]]* Table_RiskAssessment[[#This Row],[F]]* Table_RiskAssessment[[#This Row],[P]]>0),IF(Table_RiskAssessment[[#This Row],[S]]=1,IF(Table_RiskAssessment[[#This Row],[F]]=1,IF(Table_RiskAssessment[[#This Row],[P]]=1,\"a\",IF(Table_RiskAssessment[[#This Row],[W]]=1,\"a\",\"b\")),IF(Table_RiskAssessment[[#This Row],[P]]=1,IF(Table_RiskAssessment[[#This Row],[W]]=1,\"a\",\"b\"),IF(Table_RiskAssessment[[#This Row],[W]]=1,\"b\",\"c\"))),IF(Table_RiskAssessment[[#This Row],[F]]=1,IF(Table_RiskAssessment[[#This Row],[P]]=1,IF(Table_RiskAssessment[[#This Row],[W]]=1,\"b\",\"c\"),IF(Table_RiskAssessment[[#This Row],[W]]=1,\"c\",\"d\")),IF(Table_RiskAssessment[[#This Row],[P]]=1,IF(Table_RiskAssessment[[#This Row],[W]]=1,\"c\",\"d\"),IF(Table_RiskAssessment[[#This Row],[W]]=1,\"d\",\"e\")))),\"?\")","v":"?"},null,null,null,null,null,null,null,null,null,null,null,null,null,null,{"$f":"IF((Table_RiskAssessment[[#This Row],[S2]]* Table_RiskAssessment[[#This Row],[F2]]* Table_RiskAssessment[[#This Row],[P2]]>0),IF(Table_RiskAssessment[[#This Row],[S2]]=1,IF(Table_RiskAssessment[[#This Row],[F2]]=1,IF(Table_RiskAssessment[[#This Row],[P2]]=1,\"a\",IF(Table_RiskAssessment[[#This Row],[W2]]=1,\"a\",\"b\")),IF(Table_RiskAssessment[[#This Row],[P2]]=1,IF(Table_RiskAssessment[[#This Row],[W2]]=1,\"a\",\"b\"),IF(Table_RiskAssessment[[#This Row],[W2]]=1,\"b\",\"c\"))),IF(Table_RiskAssessment[[#This Row],[F2]]=1,IF(Table_RiskAssessment[[#This Row],[P2]]=1,IF(Table_RiskAssessment[[#This Row],[W2]]=1,\"b\",\"c\"),IF(Table_RiskAssessment[[#This Row],[W2]]=1,\"c\",\"d\")),IF(Table_RiskAssessment[[#This Row],[P2]]=1,IF(Table_RiskAssessment[[#This Row],[W2]]=1,\"c\",\"d\"),IF(Table_RiskAssessment[[#This Row],[W2]]=1,\"d\",\"e\")))),\"?\")","v":"?"},null,null,null,"-"]
[null,null,null,"2006 / 42","2.1.",{"$f":"Sprache!A$155","v":"Nahrungsmittelmaschinen und Maschinen für kosmetische oder pharmazeutische Erzeugnisse"},"x","x","x",null,null,null,"---",null,null,null,null,null,null,null,null,null,null,null,null,null,null,null,null,null,null,null,null,{"$f":"IF((Table_RiskAssessment[[#This Row],[S]]* Table_RiskAssessment[[#This Row],[F]]* Table_RiskAssessment[[#This Row],[P]]>0),IF(Table_RiskAssessment[[#This Row],[S]]=1,IF(Table_RiskAssessment[[#This Row],[F]]=1,IF(Table_RiskAssessment[[#This Row],[P]]=1,\"a\",IF(Table_RiskAssessment[[#This Row],[W]]=1,\"a\",\"b\")),IF(Table_RiskAssessment[[#This Row],[P]]=1,IF(Table_RiskAssessment[[#This Row],[W]]=1,\"a\",\"b\"),IF(Table_RiskAssessment[[#This Row],[W]]=1,\"b\",\"c\"))),IF(Table_RiskAssessment[[#This Row],[F]]=1,IF(Table_RiskAssessment[[#This Row],[P]]=1,IF(Table_RiskAssessment[[#This Row],[W]]=1,\"b\",\"c\"),IF(Table_RiskAssessment[[#This Row],[W]]=1,\"c\",\"d\")),IF(Table_RiskAssessment[[#This Row],[P]]=1,IF(Table_RiskAssessment[[#This Row],[W]]=1,\"c\",\"d\"),IF(Table_RiskAssessment[[#This Row],[W]]=1,\"d\",\"e\")))),\"?\")","v":"?"},null,null,null,null,"---",null,null,null,null,null,null,null,null,null,{"$f":"IF((Table_RiskAssessment[[#This Row],[S2]]* Table_RiskAssessment[[#This Row],[F2]]* Table_RiskAssessment[[#This Row],[P2]]>0),IF(Table_RiskAssessment[[#This Row],[S2]]=1,IF(Table_RiskAssessment[[#This Row],[F2]]=1,IF(Table_RiskAssessment[[#This Row],[P2]]=1,\"a\",IF(Table_RiskAssessment[[#This Row],[W2]]=1,\"a\",\"b\")),IF(Table_RiskAssessment[[#This Row],[P2]]=1,IF(Table_RiskAssessment[[#This Row],[W2]]=1,\"a\",\"b\"),IF(Table_RiskAssessment[[#This Row],[W2]]=1,\"b\",\"c\"))),IF(Table_RiskAssessment[[#This Row],[F2]]=1,IF(Table_RiskAssessment[[#This Row],[P2]]=1,IF(Table_RiskAssessment[[#This Row],[W2]]=1,\"b\",\"c\"),IF(Table_RiskAssessment[[#This Row],[W2]]=1,\"c\",\"d\")),IF(Table_RiskAssessment[[#This Row],[P2]]=1,IF(Table_RiskAssessment[[#This Row],[W2]]=1,\"c\",\"d\"),IF(Table_RiskAssessment[[#This Row],[W2]]=1,\"d\",\"e\")))),\"?\")","v":"?"},null,null,null,"-"]
[null,null,null,"2006 / 42","2.1.1.",{"$f":"Sprache!A$156","v":"Allgemeines"},"x","","x",null,null,null,null,null,null,null,null,null,null,null,null,null,null,null,null,null,null,null,null,null,null,null,null,{"$f":"IF((Table_RiskAssessment[[#This Row],[S]]* Table_RiskAssessment[[#This Row],[F]]* Table_RiskAssessment[[#This Row],[P]]>0),IF(Table_RiskAssessment[[#This Row],[S]]=1,IF(Table_RiskAssessment[[#This Row],[F]]=1,IF(Table_RiskAssessment[[#This Row],[P]]=1,\"a\",IF(Table_RiskAssessment[[#This Row],[W]]=1,\"a\",\"b\")),IF(Table_RiskAssessment[[#This Row],[P]]=1,IF(Table_RiskAssessment[[#This Row],[W]]=1,\"a\",\"b\"),IF(Table_RiskAssessment[[#This Row],[W]]=1,\"b\",\"c\"))),IF(Table_RiskAssessment[[#This Row],[F]]=1,IF(Table_RiskAssessment[[#This Row],[P]]=1,IF(Table_RiskAssessment[[#This Row],[W]]=1,\"b\",\"c\"),IF(Table_RiskAssessment[[#This Row],[W]]=1,\"c\",\"d\")),IF(Table_RiskAssessment[[#This Row],[P]]=1,IF(Table_RiskAssessment[[#This Row],[W]]=1,\"c\",\"d\"),IF(Table_RiskAssessment[[#This Row],[W]]=1,\"d\",\"e\")))),\"?\")","v":"?"},null,null,null,null,null,null,null,null,null,null,null,null,null,null,{"$f":"IF((Table_RiskAssessment[[#This Row],[S2]]* Table_RiskAssessment[[#This Row],[F2]]* Table_RiskAssessment[[#This Row],[P2]]>0),IF(Table_RiskAssessment[[#This Row],[S2]]=1,IF(Table_RiskAssessment[[#This Row],[F2]]=1,IF(Table_RiskAssessment[[#This Row],[P2]]=1,\"a\",IF(Table_RiskAssessment[[#This Row],[W2]]=1,\"a\",\"b\")),IF(Table_RiskAssessment[[#This Row],[P2]]=1,IF(Table_RiskAssessment[[#This Row],[W2]]=1,\"a\",\"b\"),IF(Table_RiskAssessment[[#This Row],[W2]]=1,\"b\",\"c\"))),IF(Table_RiskAssessment[[#This Row],[F2]]=1,IF(Table_RiskAssessment[[#This Row],[P2]]=1,IF(Table_RiskAssessment[[#This Row],[W2]]=1,\"b\",\"c\"),IF(Table_RiskAssessment[[#This Row],[W2]]=1,\"c\",\"d\")),IF(Table_RiskAssessment[[#This Row],[P2]]=1,IF(Table_RiskAssessment[[#This Row],[W2]]=1,\"c\",\"d\"),IF(Table_RiskAssessment[[#This Row],[W2]]=1,\"d\",\"e\")))),\"?\")","v":"?"},null,null,null,"-"]
[null,null,null,"2006 / 42","2.1.2.",{"$f":"Sprache!A$157","v":"Betriebsanleitung"},"x","","x",null,null,null,null,null,null,null,null,null,null,null,null,null,null,null,null,null,null,null,null,null,null,null,null,{"$f":"IF((Table_RiskAssessment[[#This Row],[S]]* Table_RiskAssessment[[#This Row],[F]]* Table_RiskAssessment[[#This Row],[P]]>0),IF(Table_RiskAssessment[[#This Row],[S]]=1,IF(Table_RiskAssessment[[#This Row],[F]]=1,IF(Table_RiskAssessment[[#This Row],[P]]=1,\"a\",IF(Table_RiskAssessment[[#This Row],[W]]=1,\"a\",\"b\")),IF(Table_RiskAssessment[[#This Row],[P]]=1,IF(Table_RiskAssessment[[#This Row],[W]]=1,\"a\",\"b\"),IF(Table_RiskAssessment[[#This Row],[W]]=1,\"b\",\"c\"))),IF(Table_RiskAssessment[[#This Row],[F]]=1,IF(Table_RiskAssessment[[#This Row],[P]]=1,IF(Table_RiskAssessment[[#This Row],[W]]=1,\"b\",\"c\"),IF(Table_RiskAssessment[[#This Row],[W]]=1,\"c\",\"d\")),IF(Table_RiskAssessment[[#This Row],[P]]=1,IF(Table_RiskAssessment[[#This Row],[W]]=1,\"c\",\"d\"),IF(Table_RiskAssessment[[#This Row],[W]]=1,\"d\",\"e\")))),\"?\")","v":"?"},null,null,null,null,null,null,null,null,null,null,null,null,null,null,{"$f":"IF((Table_RiskAssessment[[#This Row],[S2]]* Table_RiskAssessment[[#This Row],[F2]]* Table_RiskAssessment[[#This Row],[P2]]>0),IF(Table_RiskAssessment[[#This Row],[S2]]=1,IF(Table_RiskAssessment[[#This Row],[F2]]=1,IF(Table_RiskAssessment[[#This Row],[P2]]=1,\"a\",IF(Table_RiskAssessment[[#This Row],[W2]]=1,\"a\",\"b\")),IF(Table_RiskAssessment[[#This Row],[P2]]=1,IF(Table_RiskAssessment[[#This Row],[W2]]=1,\"a\",\"b\"),IF(Table_RiskAssessment[[#This Row],[W2]]=1,\"b\",\"c\"))),IF(Table_RiskAssessment[[#This Row],[F2]]=1,IF(Table_RiskAssessment[[#This Row],[P2]]=1,IF(Table_RiskAssessment[[#This Row],[W2]]=1,\"b\",\"c\"),IF(Table_RiskAssessment[[#This Row],[W2]]=1,\"c\",\"d\")),IF(Table_RiskAssessment[[#This Row],[P2]]=1,IF(Table_RiskAssessment[[#This Row],[W2]]=1,\"c\",\"d\"),IF(Table_RiskAssessment[[#This Row],[W2]]=1,\"d\",\"e\")))),\"?\")","v":"?"},null,null,null,"-"]
[null,null,null,"2006 / 42","2.2.",{"$f":"Sprache!A$158","v":"handgehaltene und/oder handgeführte tragbare Maschinen"},"x","x","x",null,null,null,null,null,null,null,null,null,null,null,null,null,null,null,null,null,null,null,null,null,null,null,null,{"$f":"IF((Table_RiskAssessment[[#This Row],[S]]* Table_RiskAssessment[[#This Row],[F]]* Table_RiskAssessment[[#This Row],[P]]>0),IF(Table_RiskAssessment[[#This Row],[S]]=1,IF(Table_RiskAssessment[[#This Row],[F]]=1,IF(Table_RiskAssessment[[#This Row],[P]]=1,\"a\",IF(Table_RiskAssessment[[#This Row],[W]]=1,\"a\",\"b\")),IF(Table_RiskAssessment[[#This Row],[P]]=1,IF(Table_RiskAssessment[[#This Row],[W]]=1,\"a\",\"b\"),IF(Table_RiskAssessment[[#This Row],[W]]=1,\"b\",\"c\"))),IF(Table_RiskAssessment[[#This Row],[F]]=1,IF(Table_RiskAssessment[[#This Row],[P]]=1,IF(Table_RiskAssessment[[#This Row],[W]]=1,\"b\",\"c\"),IF(Table_RiskAssessment[[#This Row],[W]]=1,\"c\",\"d\")),IF(Table_RiskAssessment[[#This Row],[P]]=1,IF(Table_RiskAssessment[[#This Row],[W]]=1,\"c\",\"d\"),IF(Table_RiskAssessment[[#This Row],[W]]=1,\"d\",\"e\")))),\"?\")","v":"?"},null,null,null,null,null,null,null,null,null,null,null,null,null,null,{"$f":"IF((Table_RiskAssessment[[#This Row],[S2]]* Table_RiskAssessment[[#This Row],[F2]]* Table_RiskAssessment[[#This Row],[P2]]>0),IF(Table_RiskAssessment[[#This Row],[S2]]=1,IF(Table_RiskAssessment[[#This Row],[F2]]=1,IF(Table_RiskAssessment[[#This Row],[P2]]=1,\"a\",IF(Table_RiskAssessment[[#This Row],[W2]]=1,\"a\",\"b\")),IF(Table_RiskAssessment[[#This Row],[P2]]=1,IF(Table_RiskAssessment[[#This Row],[W2]]=1,\"a\",\"b\"),IF(Table_RiskAssessment[[#This Row],[W2]]=1,\"b\",\"c\"))),IF(Table_RiskAssessment[[#This Row],[F2]]=1,IF(Table_RiskAssessment[[#This Row],[P2]]=1,IF(Table_RiskAssessment[[#This Row],[W2]]=1,\"b\",\"c\"),IF(Table_RiskAssessment[[#This Row],[W2]]=1,\"c\",\"d\")),IF(Table_RiskAssessment[[#This Row],[P2]]=1,IF(Table_RiskAssessment[[#This Row],[W2]]=1,\"c\",\"d\"),IF(Table_RiskAssessment[[#This Row],[W2]]=1,\"d\",\"e\")))),\"?\")","v":"?"},null,null,null,"-"]
[null,null,null,"2006 / 42","2.2.1.",{"$f":"Sprache!A$159","v":"Allgemeines"},"x","","x",null,null,null,null,null,null,null,null,null,null,null,null,null,null,null,null,null,null,null,null,null,null,null,null,{"$f":"IF((Table_RiskAssessment[[#This Row],[S]]* Table_RiskAssessment[[#This Row],[F]]* Table_RiskAssessment[[#This Row],[P]]>0),IF(Table_RiskAssessment[[#This Row],[S]]=1,IF(Table_RiskAssessment[[#This Row],[F]]=1,IF(Table_RiskAssessment[[#This Row],[P]]=1,\"a\",IF(Table_RiskAssessment[[#This Row],[W]]=1,\"a\",\"b\")),IF(Table_RiskAssessment[[#This Row],[P]]=1,IF(Table_RiskAssessment[[#This Row],[W]]=1,\"a\",\"b\"),IF(Table_RiskAssessment[[#This Row],[W]]=1,\"b\",\"c\"))),IF(Table_RiskAssessment[[#This Row],[F]]=1,IF(Table_RiskAssessment[[#This Row],[P]]=1,IF(Table_RiskAssessment[[#This Row],[W]]=1,\"b\",\"c\"),IF(Table_RiskAssessment[[#This Row],[W]]=1,\"c\",\"d\")),IF(Table_RiskAssessment[[#This Row],[P]]=1,IF(Table_RiskAssessment[[#This Row],[W]]=1,\"c\",\"d\"),IF(Table_RiskAssessment[[#This Row],[W]]=1,\"d\",\"e\")))),\"?\")","v":"?"},null,null,null,null,null,null,null,null,null,null,null,null,null,null,{"$f":"IF((Table_RiskAssessment[[#This Row],[S2]]* Table_RiskAssessment[[#This Row],[F2]]* Table_RiskAssessment[[#This Row],[P2]]>0),IF(Table_RiskAssessment[[#This Row],[S2]]=1,IF(Table_RiskAssessment[[#This Row],[F2]]=1,IF(Table_RiskAssessment[[#This Row],[P2]]=1,\"a\",IF(Table_RiskAssessment[[#This Row],[W2]]=1,\"a\",\"b\")),IF(Table_RiskAssessment[[#This Row],[P2]]=1,IF(Table_RiskAssessment[[#This Row],[W2]]=1,\"a\",\"b\"),IF(Table_RiskAssessment[[#This Row],[W2]]=1,\"b\",\"c\"))),IF(Table_RiskAssessment[[#This Row],[F2]]=1,IF(Table_RiskAssessment[[#This Row],[P2]]=1,IF(Table_RiskAssessment[[#This Row],[W2]]=1,\"b\",\"c\"),IF(Table_RiskAssessment[[#This Row],[W2]]=1,\"c\",\"d\")),IF(Table_RiskAssessment[[#This Row],[P2]]=1,IF(Table_RiskAssessment[[#This Row],[W2]]=1,\"c\",\"d\"),IF(Table_RiskAssessment[[#This Row],[W2]]=1,\"d\",\"e\")))),\"?\")","v":"?"},null,null,null,"-"]
[null,null,null,"2006 / 42","2.2.1.1.",{"$f":"Sprache!A$160","v":"Betriebsanleitung"},"x","","x",null,null,null,null,null,null,null,null,null,null,null,null,null,null,null,null,null,null,null,null,null,null,null,null,{"$f":"IF((Table_RiskAssessment[[#This Row],[S]]* Table_RiskAssessment[[#This Row],[F]]* Table_RiskAssessment[[#This Row],[P]]>0),IF(Table_RiskAssessment[[#This Row],[S]]=1,IF(Table_RiskAssessment[[#This Row],[F]]=1,IF(Table_RiskAssessment[[#This Row],[P]]=1,\"a\",IF(Table_RiskAssessment[[#This Row],[W]]=1,\"a\",\"b\")),IF(Table_RiskAssessment[[#This Row],[P]]=1,IF(Table_RiskAssessment[[#This Row],[W]]=1,\"a\",\"b\"),IF(Table_RiskAssessment[[#This Row],[W]]=1,\"b\",\"c\"))),IF(Table_RiskAssessment[[#This Row],[F]]=1,IF(Table_RiskAssessment[[#This Row],[P]]=1,IF(Table_RiskAssessment[[#This Row],[W]]=1,\"b\",\"c\"),IF(Table_RiskAssessment[[#This Row],[W]]=1,\"c\",\"d\")),IF(Table_RiskAssessment[[#This Row],[P]]=1,IF(Table_RiskAssessment[[#This Row],[W]]=1,\"c\",\"d\"),IF(Table_RiskAssessment[[#This Row],[W]]=1,\"d\",\"e\")))),\"?\")","v":"?"},null,null,null,null,null,null,null,null,null,null,null,null,null,null,{"$f":"IF((Table_RiskAssessment[[#This Row],[S2]]* Table_RiskAssessment[[#This Row],[F2]]* Table_RiskAssessment[[#This Row],[P2]]>0),IF(Table_RiskAssessment[[#This Row],[S2]]=1,IF(Table_RiskAssessment[[#This Row],[F2]]=1,IF(Table_RiskAssessment[[#This Row],[P2]]=1,\"a\",IF(Table_RiskAssessment[[#This Row],[W2]]=1,\"a\",\"b\")),IF(Table_RiskAssessment[[#This Row],[P2]]=1,IF(Table_RiskAssessment[[#This Row],[W2]]=1,\"a\",\"b\"),IF(Table_RiskAssessment[[#This Row],[W2]]=1,\"b\",\"c\"))),IF(Table_RiskAssessment[[#This Row],[F2]]=1,IF(Table_RiskAssessment[[#This Row],[P2]]=1,IF(Table_RiskAssessment[[#This Row],[W2]]=1,\"b\",\"c\"),IF(Table_RiskAssessment[[#This Row],[W2]]=1,\"c\",\"d\")),IF(Table_RiskAssessment[[#This Row],[P2]]=1,IF(Table_RiskAssessment[[#This Row],[W2]]=1,\"c\",\"d\"),IF(Table_RiskAssessment[[#This Row],[W2]]=1,\"d\",\"e\")))),\"?\")","v":"?"},null,null,null,"-"]
[null,null,null,"2006 / 42","2.2.2.",{"$f":"Sprache!A$161","v":"Tragbare Befestigungsgeräte und andere Schussgeräte"},"x","x","x",null,null,null,null,null,null,null,null,null,null,null,null,null,null,null,null,null,null,null,null,null,null,null,null,{"$f":"IF((Table_RiskAssessment[[#This Row],[S]]* Table_RiskAssessment[[#This Row],[F]]* Table_RiskAssessment[[#This Row],[P]]>0),IF(Table_RiskAssessment[[#This Row],[S]]=1,IF(Table_RiskAssessment[[#This Row],[F]]=1,IF(Table_RiskAssessment[[#This Row],[P]]=1,\"a\",IF(Table_RiskAssessment[[#This Row],[W]]=1,\"a\",\"b\")),IF(Table_RiskAssessment[[#This Row],[P]]=1,IF(Table_RiskAssessment[[#This Row],[W]]=1,\"a\",\"b\"),IF(Table_RiskAssessment[[#This Row],[W]]=1,\"b\",\"c\"))),IF(Table_RiskAssessment[[#This Row],[F]]=1,IF(Table_RiskAssessment[[#This Row],[P]]=1,IF(Table_RiskAssessment[[#This Row],[W]]=1,\"b\",\"c\"),IF(Table_RiskAssessment[[#This Row],[W]]=1,\"c\",\"d\")),IF(Table_RiskAssessment[[#This Row],[P]]=1,IF(Table_RiskAssessment[[#This Row],[W]]=1,\"c\",\"d\"),IF(Table_RiskAssessment[[#This Row],[W]]=1,\"d\",\"e\")))),\"?\")","v":"?"},null,null,null,null,null,null,null,null,null,null,null,null,null,null,{"$f":"IF((Table_RiskAssessment[[#This Row],[S2]]* Table_RiskAssessment[[#This Row],[F2]]* Table_RiskAssessment[[#This Row],[P2]]>0),IF(Table_RiskAssessment[[#This Row],[S2]]=1,IF(Table_RiskAssessment[[#This Row],[F2]]=1,IF(Table_RiskAssessment[[#This Row],[P2]]=1,\"a\",IF(Table_RiskAssessment[[#This Row],[W2]]=1,\"a\",\"b\")),IF(Table_RiskAssessment[[#This Row],[P2]]=1,IF(Table_RiskAssessment[[#This Row],[W2]]=1,\"a\",\"b\"),IF(Table_RiskAssessment[[#This Row],[W2]]=1,\"b\",\"c\"))),IF(Table_RiskAssessment[[#This Row],[F2]]=1,IF(Table_RiskAssessment[[#This Row],[P2]]=1,IF(Table_RiskAssessment[[#This Row],[W2]]=1,\"b\",\"c\"),IF(Table_RiskAssessment[[#This Row],[W2]]=1,\"c\",\"d\")),IF(Table_RiskAssessment[[#This Row],[P2]]=1,IF(Table_RiskAssessment[[#This Row],[W2]]=1,\"c\",\"d\"),IF(Table_RiskAssessment[[#This Row],[W2]]=1,\"d\",\"e\")))),\"?\")","v":"?"},null,null,null,"-"]
[null,null,null,"2006 / 42","2.2.2.1.",{"$f":"Sprache!A$162","v":"Allgemeines"},"x","","x",null,null,null,null,null,null,null,null,null,null,null,null,null,null,null,null,null,null,null,null,null,null,null,null,{"$f":"IF((Table_RiskAssessment[[#This Row],[S]]* Table_RiskAssessment[[#This Row],[F]]* Table_RiskAssessment[[#This Row],[P]]>0),IF(Table_RiskAssessment[[#This Row],[S]]=1,IF(Table_RiskAssessment[[#This Row],[F]]=1,IF(Table_RiskAssessment[[#This Row],[P]]=1,\"a\",IF(Table_RiskAssessment[[#This Row],[W]]=1,\"a\",\"b\")),IF(Table_RiskAssessment[[#This Row],[P]]=1,IF(Table_RiskAssessment[[#This Row],[W]]=1,\"a\",\"b\"),IF(Table_RiskAssessment[[#This Row],[W]]=1,\"b\",\"c\"))),IF(Table_RiskAssessment[[#This Row],[F]]=1,IF(Table_RiskAssessment[[#This Row],[P]]=1,IF(Table_RiskAssessment[[#This Row],[W]]=1,\"b\",\"c\"),IF(Table_RiskAssessment[[#This Row],[W]]=1,\"c\",\"d\")),IF(Table_RiskAssessment[[#This Row],[P]]=1,IF(Table_RiskAssessment[[#This Row],[W]]=1,\"c\",\"d\"),IF(Table_RiskAssessment[[#This Row],[W]]=1,\"d\",\"e\")))),\"?\")","v":"?"},null,null,null,null,null,null,null,null,null,null,null,null,null,null,{"$f":"IF((Table_RiskAssessment[[#This Row],[S2]]* Table_RiskAssessment[[#This Row],[F2]]* Table_RiskAssessment[[#This Row],[P2]]>0),IF(Table_RiskAssessment[[#This Row],[S2]]=1,IF(Table_RiskAssessment[[#This Row],[F2]]=1,IF(Table_RiskAssessment[[#This Row],[P2]]=1,\"a\",IF(Table_RiskAssessment[[#This Row],[W2]]=1,\"a\",\"b\")),IF(Table_RiskAssessment[[#This Row],[P2]]=1,IF(Table_RiskAssessment[[#This Row],[W2]]=1,\"a\",\"b\"),IF(Table_RiskAssessment[[#This Row],[W2]]=1,\"b\",\"c\"))),IF(Table_RiskAssessment[[#This Row],[F2]]=1,IF(Table_RiskAssessment[[#This Row],[P2]]=1,IF(Table_RiskAssessment[[#This Row],[W2]]=1,\"b\",\"c\"),IF(Table_RiskAssessment[[#This Row],[W2]]=1,\"c\",\"d\")),IF(Table_RiskAssessment[[#This Row],[P2]]=1,IF(Table_RiskAssessment[[#This Row],[W2]]=1,\"c\",\"d\"),IF(Table_RiskAssessment[[#This Row],[W2]]=1,\"d\",\"e\")))),\"?\")","v":"?"},null,null,null,"-"]
[null,null,null,"2006 / 42","2.2.2.2.",{"$f":"Sprache!A$163","v":"Betriebsanleitung"},"x","","x",null,null,null,null,null,null,null,null,null,null,null,null,null,null,null,null,null,null,null,null,null,null,null,null,{"$f":"IF((Table_RiskAssessment[[#This Row],[S]]* Table_RiskAssessment[[#This Row],[F]]* Table_RiskAssessment[[#This Row],[P]]>0),IF(Table_RiskAssessment[[#This Row],[S]]=1,IF(Table_RiskAssessment[[#This Row],[F]]=1,IF(Table_RiskAssessment[[#This Row],[P]]=1,\"a\",IF(Table_RiskAssessment[[#This Row],[W]]=1,\"a\",\"b\")),IF(Table_RiskAssessment[[#This Row],[P]]=1,IF(Table_RiskAssessment[[#This Row],[W]]=1,\"a\",\"b\"),IF(Table_RiskAssessment[[#This Row],[W]]=1,\"b\",\"c\"))),IF(Table_RiskAssessment[[#This Row],[F]]=1,IF(Table_RiskAssessment[[#This Row],[P]]=1,IF(Table_RiskAssessment[[#This Row],[W]]=1,\"b\",\"c\"),IF(Table_RiskAssessment[[#This Row],[W]]=1,\"c\",\"d\")),IF(Table_RiskAssessment[[#This Row],[P]]=1,IF(Table_RiskAssessment[[#This Row],[W]]=1,\"c\",\"d\"),IF(Table_RiskAssessment[[#This Row],[W]]=1,\"d\",\"e\")))),\"?\")","v":"?"},null,null,null,null,null,null,null,null,null,null,null,null,null,null,{"$f":"IF((Table_RiskAssessment[[#This Row],[S2]]* Table_RiskAssessment[[#This Row],[F2]]* Table_RiskAssessment[[#This Row],[P2]]>0),IF(Table_RiskAssessment[[#This Row],[S2]]=1,IF(Table_RiskAssessment[[#This Row],[F2]]=1,IF(Table_RiskAssessment[[#This Row],[P2]]=1,\"a\",IF(Table_RiskAssessment[[#This Row],[W2]]=1,\"a\",\"b\")),IF(Table_RiskAssessment[[#This Row],[P2]]=1,IF(Table_RiskAssessment[[#This Row],[W2]]=1,\"a\",\"b\"),IF(Table_RiskAssessment[[#This Row],[W2]]=1,\"b\",\"c\"))),IF(Table_RiskAssessment[[#This Row],[F2]]=1,IF(Table_RiskAssessment[[#This Row],[P2]]=1,IF(Table_RiskAssessment[[#This Row],[W2]]=1,\"b\",\"c\"),IF(Table_RiskAssessment[[#This Row],[W2]]=1,\"c\",\"d\")),IF(Table_RiskAssessment[[#This Row],[P2]]=1,IF(Table_RiskAssessment[[#This Row],[W2]]=1,\"c\",\"d\"),IF(Table_RiskAssessment[[#This Row],[W2]]=1,\"d\",\"e\")))),\"?\")","v":"?"},null,null,null,"-"]
[null,null,null,"2006 / 42","2.3.",{"$f":"Sprache!A$164","v":"Maschinen zur Bearbeitung von Holz und von Werkstoffen mit ähnlichen physikalischen Eigenschaften"},"x","","x",null,null,null,null,null,null,null,null,null,null,null,null,null,null,null,null,null,null,null,null,null,null,null,null,{"$f":"IF((Table_RiskAssessment[[#This Row],[S]]* Table_RiskAssessment[[#This Row],[F]]* Table_RiskAssessment[[#This Row],[P]]>0),IF(Table_RiskAssessment[[#This Row],[S]]=1,IF(Table_RiskAssessment[[#This Row],[F]]=1,IF(Table_RiskAssessment[[#This Row],[P]]=1,\"a\",IF(Table_RiskAssessment[[#This Row],[W]]=1,\"a\",\"b\")),IF(Table_RiskAssessment[[#This Row],[P]]=1,IF(Table_RiskAssessment[[#This Row],[W]]=1,\"a\",\"b\"),IF(Table_RiskAssessment[[#This Row],[W]]=1,\"b\",\"c\"))),IF(Table_RiskAssessment[[#This Row],[F]]=1,IF(Table_RiskAssessment[[#This Row],[P]]=1,IF(Table_RiskAssessment[[#This Row],[W]]=1,\"b\",\"c\"),IF(Table_RiskAssessment[[#This Row],[W]]=1,\"c\",\"d\")),IF(Table_RiskAssessment[[#This Row],[P]]=1,IF(Table_RiskAssessment[[#This Row],[W]]=1,\"c\",\"d\"),IF(Table_RiskAssessment[[#This Row],[W]]=1,\"d\",\"e\")))),\"?\")","v":"?"},null,null,null,null,null,null,null,null,null,null,null,null,null,null,{"$f":"IF((Table_RiskAssessment[[#This Row],[S2]]* Table_RiskAssessment[[#This Row],[F2]]* Table_RiskAssessment[[#This Row],[P2]]>0),IF(Table_RiskAssessment[[#This Row],[S2]]=1,IF(Table_RiskAssessment[[#This Row],[F2]]=1,IF(Table_RiskAssessment[[#This Row],[P2]]=1,\"a\",IF(Table_RiskAssessment[[#This Row],[W2]]=1,\"a\",\"b\")),IF(Table_RiskAssessment[[#This Row],[P2]]=1,IF(Table_RiskAssessment[[#This Row],[W2]]=1,\"a\",\"b\"),IF(Table_RiskAssessment[[#This Row],[W2]]=1,\"b\",\"c\"))),IF(Table_RiskAssessment[[#This Row],[F2]]=1,IF(Table_RiskAssessment[[#This Row],[P2]]=1,IF(Table_RiskAssessment[[#This Row],[W2]]=1,\"b\",\"c\"),IF(Table_RiskAssessment[[#This Row],[W2]]=1,\"c\",\"d\")),IF(Table_RiskAssessment[[#This Row],[P2]]=1,IF(Table_RiskAssessment[[#This Row],[W2]]=1,\"c\",\"d\"),IF(Table_RiskAssessment[[#This Row],[W2]]=1,\"d\",\"e\")))),\"?\")","v":"?"},null,null,null,"-"]
[null,null,null,"2006 / 42","2.4.",{"$f":"Sprache!A$165","v":"Maschinen zur Ausbringung von Pestiziden"},"x","x","x",null,null,null,null,null,null,null,null,null,null,null,null,null,null,null,null,null,null,null,null,null,null,null,null,{"$f":"IF((Table_RiskAssessment[[#This Row],[S]]* Table_RiskAssessment[[#This Row],[F]]* Table_RiskAssessment[[#This Row],[P]]>0),IF(Table_RiskAssessment[[#This Row],[S]]=1,IF(Table_RiskAssessment[[#This Row],[F]]=1,IF(Table_RiskAssessment[[#This Row],[P]]=1,\"a\",IF(Table_RiskAssessment[[#This Row],[W]]=1,\"a\",\"b\")),IF(Table_RiskAssessment[[#This Row],[P]]=1,IF(Table_RiskAssessment[[#This Row],[W]]=1,\"a\",\"b\"),IF(Table_RiskAssessment[[#This Row],[W]]=1,\"b\",\"c\"))),IF(Table_RiskAssessment[[#This Row],[F]]=1,IF(Table_RiskAssessment[[#This Row],[P]]=1,IF(Table_RiskAssessment[[#This Row],[W]]=1,\"b\",\"c\"),IF(Table_RiskAssessment[[#This Row],[W]]=1,\"c\",\"d\")),IF(Table_RiskAssessment[[#This Row],[P]]=1,IF(Table_RiskAssessment[[#This Row],[W]]=1,\"c\",\"d\"),IF(Table_RiskAssessment[[#This Row],[W]]=1,\"d\",\"e\")))),\"?\")","v":"?"},null,null,null,null,null,null,null,null,null,null,null,null,null,null,{"$f":"IF((Table_RiskAssessment[[#This Row],[S2]]* Table_RiskAssessment[[#This Row],[F2]]* Table_RiskAssessment[[#This Row],[P2]]>0),IF(Table_RiskAssessment[[#This Row],[S2]]=1,IF(Table_RiskAssessment[[#This Row],[F2]]=1,IF(Table_RiskAssessment[[#This Row],[P2]]=1,\"a\",IF(Table_RiskAssessment[[#This Row],[W2]]=1,\"a\",\"b\")),IF(Table_RiskAssessment[[#This Row],[P2]]=1,IF(Table_RiskAssessment[[#This Row],[W2]]=1,\"a\",\"b\"),IF(Table_RiskAssessment[[#This Row],[W2]]=1,\"b\",\"c\"))),IF(Table_RiskAssessment[[#This Row],[F2]]=1,IF(Table_RiskAssessment[[#This Row],[P2]]=1,IF(Table_RiskAssessment[[#This Row],[W2]]=1,\"b\",\"c\"),IF(Table_RiskAssessment[[#This Row],[W2]]=1,\"c\",\"d\")),IF(Table_RiskAssessment[[#This Row],[P2]]=1,IF(Table_RiskAssessment[[#This Row],[W2]]=1,\"c\",\"d\"),IF(Table_RiskAssessment[[#This Row],[W2]]=1,\"d\",\"e\")))),\"?\")","v":"?"},null,null,null,"-"]
[null,null,null,"2006 / 42","2.4.01.",{"$f":"Sprache!A$166","v":"Begriffsbestimmung"},"x","","x",null,null,null,null,null,null,null,null,null,null,null,null,null,null,null,null,null,null,null,null,null,null,null,null,{"$f":"IF((Table_RiskAssessment[[#This Row],[S]]* Table_RiskAssessment[[#This Row],[F]]* Table_RiskAssessment[[#This Row],[P]]>0),IF(Table_RiskAssessment[[#This Row],[S]]=1,IF(Table_RiskAssessment[[#This Row],[F]]=1,IF(Table_RiskAssessment[[#This Row],[P]]=1,\"a\",IF(Table_RiskAssessment[[#This Row],[W]]=1,\"a\",\"b\")),IF(Table_RiskAssessment[[#This Row],[P]]=1,IF(Table_RiskAssessment[[#This Row],[W]]=1,\"a\",\"b\"),IF(Table_RiskAssessment[[#This Row],[W]]=1,\"b\",\"c\"))),IF(Table_RiskAssessment[[#This Row],[F]]=1,IF(Table_RiskAssessment[[#This Row],[P]]=1,IF(Table_RiskAssessment[[#This Row],[W]]=1,\"b\",\"c\"),IF(Table_RiskAssessment[[#This Row],[W]]=1,\"c\",\"d\")),IF(Table_RiskAssessment[[#This Row],[P]]=1,IF(Table_RiskAssessment[[#This Row],[W]]=1,\"c\",\"d\"),IF(Table_RiskAssessment[[#This Row],[W]]=1,\"d\",\"e\")))),\"?\")","v":"?"},null,null,null,null,null,null,null,null,null,null,null,null,null,null,{"$f":"IF((Table_RiskAssessment[[#This Row],[S2]]* Table_RiskAssessment[[#This Row],[F2]]* Table_RiskAssessment[[#This Row],[P2]]>0),IF(Table_RiskAssessment[[#This Row],[S2]]=1,IF(Table_RiskAssessment[[#This Row],[F2]]=1,IF(Table_RiskAssessment[[#This Row],[P2]]=1,\"a\",IF(Table_RiskAssessment[[#This Row],[W2]]=1,\"a\",\"b\")),IF(Table_RiskAssessment[[#This Row],[P2]]=1,IF(Table_RiskAssessment[[#This Row],[W2]]=1,\"a\",\"b\"),IF(Table_RiskAssessment[[#This Row],[W2]]=1,\"b\",\"c\"))),IF(Table_RiskAssessment[[#This Row],[F2]]=1,IF(Table_RiskAssessment[[#This Row],[P2]]=1,IF(Table_RiskAssessment[[#This Row],[W2]]=1,\"b\",\"c\"),IF(Table_RiskAssessment[[#This Row],[W2]]=1,\"c\",\"d\")),IF(Table_RiskAssessment[[#This Row],[P2]]=1,IF(Table_RiskAssessment[[#This Row],[W2]]=1,\"c\",\"d\"),IF(Table_RiskAssessment[[#This Row],[W2]]=1,\"d\",\"e\")))),\"?\")","v":"?"},null,null,null,"-"]
[null,null,null,"2006 / 42","2.4.02.",{"$f":"Sprache!A$167","v":"Allgemeines"},"x","","x",null,null,null,null,null,null,null,null,null,null,null,null,null,null,null,null,null,null,null,null,null,null,null,null,{"$f":"IF((Table_RiskAssessment[[#This Row],[S]]* Table_RiskAssessment[[#This Row],[F]]* Table_RiskAssessment[[#This Row],[P]]>0),IF(Table_RiskAssessment[[#This Row],[S]]=1,IF(Table_RiskAssessment[[#This Row],[F]]=1,IF(Table_RiskAssessment[[#This Row],[P]]=1,\"a\",IF(Table_RiskAssessment[[#This Row],[W]]=1,\"a\",\"b\")),IF(Table_RiskAssessment[[#This Row],[P]]=1,IF(Table_RiskAssessment[[#This Row],[W]]=1,\"a\",\"b\"),IF(Table_RiskAssessment[[#This Row],[W]]=1,\"b\",\"c\"))),IF(Table_RiskAssessment[[#This Row],[F]]=1,IF(Table_RiskAssessment[[#This Row],[P]]=1,IF(Table_RiskAssessment[[#This Row],[W]]=1,\"b\",\"c\"),IF(Table_RiskAssessment[[#This Row],[W]]=1,\"c\",\"d\")),IF(Table_RiskAssessment[[#This Row],[P]]=1,IF(Table_RiskAssessment[[#This Row],[W]]=1,\"c\",\"d\"),IF(Table_RiskAssessment[[#This Row],[W]]=1,\"d\",\"e\")))),\"?\")","v":"?"},null,null,null,null,null,null,null,null,null,null,null,null,null,null,{"$f":"IF((Table_RiskAssessment[[#This Row],[S2]]* Table_RiskAssessment[[#This Row],[F2]]* Table_RiskAssessment[[#This Row],[P2]]>0),IF(Table_RiskAssessment[[#This Row],[S2]]=1,IF(Table_RiskAssessment[[#This Row],[F2]]=1,IF(Table_RiskAssessment[[#This Row],[P2]]=1,\"a\",IF(Table_RiskAssessment[[#This Row],[W2]]=1,\"a\",\"b\")),IF(Table_RiskAssessment[[#This Row],[P2]]=1,IF(Table_RiskAssessment[[#This Row],[W2]]=1,\"a\",\"b\"),IF(Table_RiskAssessment[[#This Row],[W2]]=1,\"b\",\"c\"))),IF(Table_RiskAssessment[[#This Row],[F2]]=1,IF(Table_RiskAssessment[[#This Row],[P2]]=1,IF(Table_RiskAssessment[[#This Row],[W2]]=1,\"b\",\"c\"),IF(Table_RiskAssessment[[#This Row],[W2]]=1,\"c\",\"d\")),IF(Table_RiskAssessment[[#This Row],[P2]]=1,IF(Table_RiskAssessment[[#This Row],[W2]]=1,\"c\",\"d\"),IF(Table_RiskAssessment[[#This Row],[W2]]=1,\"d\",\"e\")))),\"?\")","v":"?"},null,null,null,"-"]
[null,null,null,"2006 / 42","2.4.03.",{"$f":"Sprache!A$168","v":"Bedienung und Überwachung"},"x","","x",null,null,null,null,null,null,null,null,null,null,null,null,null,null,null,null,null,null,null,null,null,null,null,null,{"$f":"IF((Table_RiskAssessment[[#This Row],[S]]* Table_RiskAssessment[[#This Row],[F]]* Table_RiskAssessment[[#This Row],[P]]>0),IF(Table_RiskAssessment[[#This Row],[S]]=1,IF(Table_RiskAssessment[[#This Row],[F]]=1,IF(Table_RiskAssessment[[#This Row],[P]]=1,\"a\",IF(Table_RiskAssessment[[#This Row],[W]]=1,\"a\",\"b\")),IF(Table_RiskAssessment[[#This Row],[P]]=1,IF(Table_RiskAssessment[[#This Row],[W]]=1,\"a\",\"b\"),IF(Table_RiskAssessment[[#This Row],[W]]=1,\"b\",\"c\"))),IF(Table_RiskAssessment[[#This Row],[F]]=1,IF(Table_RiskAssessment[[#This Row],[P]]=1,IF(Table_RiskAssessment[[#This Row],[W]]=1,\"b\",\"c\"),IF(Table_RiskAssessment[[#This Row],[W]]=1,\"c\",\"d\")),IF(Table_RiskAssessment[[#This Row],[P]]=1,IF(Table_RiskAssessment[[#This Row],[W]]=1,\"c\",\"d\"),IF(Table_RiskAssessment[[#This Row],[W]]=1,\"d\",\"e\")))),\"?\")","v":"?"},null,null,null,null,null,null,null,null,null,null,null,null,null,null,{"$f":"IF((Table_RiskAssessment[[#This Row],[S2]]* Table_RiskAssessment[[#This Row],[F2]]* Table_RiskAssessment[[#This Row],[P2]]>0),IF(Table_RiskAssessment[[#This Row],[S2]]=1,IF(Table_RiskAssessment[[#This Row],[F2]]=1,IF(Table_RiskAssessment[[#This Row],[P2]]=1,\"a\",IF(Table_RiskAssessment[[#This Row],[W2]]=1,\"a\",\"b\")),IF(Table_RiskAssessment[[#This Row],[P2]]=1,IF(Table_RiskAssessment[[#This Row],[W2]]=1,\"a\",\"b\"),IF(Table_RiskAssessment[[#This Row],[W2]]=1,\"b\",\"c\"))),IF(Table_RiskAssessment[[#This Row],[F2]]=1,IF(Table_RiskAssessment[[#This Row],[P2]]=1,IF(Table_RiskAssessment[[#This Row],[W2]]=1,\"b\",\"c\"),IF(Table_RiskAssessment[[#This Row],[W2]]=1,\"c\",\"d\")),IF(Table_RiskAssessment[[#This Row],[P2]]=1,IF(Table_RiskAssessment[[#This Row],[W2]]=1,\"c\",\"d\"),IF(Table_RiskAssessment[[#This Row],[W2]]=1,\"d\",\"e\")))),\"?\")","v":"?"},null,null,null,"-"]
[null,null,null,"2006 / 42","2.4.04.",{"$f":"Sprache!A$169","v":"Füllung und Entleerung"},"x","","x",null,null,null,null,null,null,null,null,null,null,null,null,null,null,null,null,null,null,null,null,null,null,null,null,{"$f":"IF((Table_RiskAssessment[[#This Row],[S]]* Table_RiskAssessment[[#This Row],[F]]* Table_RiskAssessment[[#This Row],[P]]>0),IF(Table_RiskAssessment[[#This Row],[S]]=1,IF(Table_RiskAssessment[[#This Row],[F]]=1,IF(Table_RiskAssessment[[#This Row],[P]]=1,\"a\",IF(Table_RiskAssessment[[#This Row],[W]]=1,\"a\",\"b\")),IF(Table_RiskAssessment[[#This Row],[P]]=1,IF(Table_RiskAssessment[[#This Row],[W]]=1,\"a\",\"b\"),IF(Table_RiskAssessment[[#This Row],[W]]=1,\"b\",\"c\"))),IF(Table_RiskAssessment[[#This Row],[F]]=1,IF(Table_RiskAssessment[[#This Row],[P]]=1,IF(Table_RiskAssessment[[#This Row],[W]]=1,\"b\",\"c\"),IF(Table_RiskAssessment[[#This Row],[W]]=1,\"c\",\"d\")),IF(Table_RiskAssessment[[#This Row],[P]]=1,IF(Table_RiskAssessment[[#This Row],[W]]=1,\"c\",\"d\"),IF(Table_RiskAssessment[[#This Row],[W]]=1,\"d\",\"e\")))),\"?\")","v":"?"},null,null,null,null,null,null,null,null,null,null,null,null,null,null,{"$f":"IF((Table_RiskAssessment[[#This Row],[S2]]* Table_RiskAssessment[[#This Row],[F2]]* Table_RiskAssessment[[#This Row],[P2]]>0),IF(Table_RiskAssessment[[#This Row],[S2]]=1,IF(Table_RiskAssessment[[#This Row],[F2]]=1,IF(Table_RiskAssessment[[#This Row],[P2]]=1,\"a\",IF(Table_RiskAssessment[[#This Row],[W2]]=1,\"a\",\"b\")),IF(Table_RiskAssessment[[#This Row],[P2]]=1,IF(Table_RiskAssessment[[#This Row],[W2]]=1,\"a\",\"b\"),IF(Table_RiskAssessment[[#This Row],[W2]]=1,\"b\",\"c\"))),IF(Table_RiskAssessment[[#This Row],[F2]]=1,IF(Table_RiskAssessment[[#This Row],[P2]]=1,IF(Table_RiskAssessment[[#This Row],[W2]]=1,\"b\",\"c\"),IF(Table_RiskAssessment[[#This Row],[W2]]=1,\"c\",\"d\")),IF(Table_RiskAssessment[[#This Row],[P2]]=1,IF(Table_RiskAssessment[[#This Row],[W2]]=1,\"c\",\"d\"),IF(Table_RiskAssessment[[#This Row],[W2]]=1,\"d\",\"e\")))),\"?\")","v":"?"},null,null,null,"-"]
[null,null,null,"2006 / 42","2.4.05.",{"$f":"Sprache!A$170","v":"Ausbringung von Pestiziden"},"x","x","x",null,null,null,null,null,null,null,null,null,null,null,null,null,null,null,null,null,null,null,null,null,null,null,null,{"$f":"IF((Table_RiskAssessment[[#This Row],[S]]* Table_RiskAssessment[[#This Row],[F]]* Table_RiskAssessment[[#This Row],[P]]>0),IF(Table_RiskAssessment[[#This Row],[S]]=1,IF(Table_RiskAssessment[[#This Row],[F]]=1,IF(Table_RiskAssessment[[#This Row],[P]]=1,\"a\",IF(Table_RiskAssessment[[#This Row],[W]]=1,\"a\",\"b\")),IF(Table_RiskAssessment[[#This Row],[P]]=1,IF(Table_RiskAssessment[[#This Row],[W]]=1,\"a\",\"b\"),IF(Table_RiskAssessment[[#This Row],[W]]=1,\"b\",\"c\"))),IF(Table_RiskAssessment[[#This Row],[F]]=1,IF(Table_RiskAssessment[[#This Row],[P]]=1,IF(Table_RiskAssessment[[#This Row],[W]]=1,\"b\",\"c\"),IF(Table_RiskAssessment[[#This Row],[W]]=1,\"c\",\"d\")),IF(Table_RiskAssessment[[#This Row],[P]]=1,IF(Table_RiskAssessment[[#This Row],[W]]=1,\"c\",\"d\"),IF(Table_RiskAssessment[[#This Row],[W]]=1,\"d\",\"e\")))),\"?\")","v":"?"},null,null,null,null,null,null,null,null,null,null,null,null,null,null,{"$f":"IF((Table_RiskAssessment[[#This Row],[S2]]* Table_RiskAssessment[[#This Row],[F2]]* Table_RiskAssessment[[#This Row],[P2]]>0),IF(Table_RiskAssessment[[#This Row],[S2]]=1,IF(Table_RiskAssessment[[#This Row],[F2]]=1,IF(Table_RiskAssessment[[#This Row],[P2]]=1,\"a\",IF(Table_RiskAssessment[[#This Row],[W2]]=1,\"a\",\"b\")),IF(Table_RiskAssessment[[#This Row],[P2]]=1,IF(Table_RiskAssessment[[#This Row],[W2]]=1,\"a\",\"b\"),IF(Table_RiskAssessment[[#This Row],[W2]]=1,\"b\",\"c\"))),IF(Table_RiskAssessment[[#This Row],[F2]]=1,IF(Table_RiskAssessment[[#This Row],[P2]]=1,IF(Table_RiskAssessment[[#This Row],[W2]]=1,\"b\",\"c\"),IF(Table_RiskAssessment[[#This Row],[W2]]=1,\"c\",\"d\")),IF(Table_RiskAssessment[[#This Row],[P2]]=1,IF(Table_RiskAssessment[[#This Row],[W2]]=1,\"c\",\"d\"),IF(Table_RiskAssessment[[#This Row],[W2]]=1,\"d\",\"e\")))),\"?\")","v":"?"},null,null,null,"-"]
[null,null,null,"2006 / 42","2.4.05.1.",{"$f":"Sprache!A$171","v":"Ausbringungsrate"},"x","","x",null,null,null,null,null,null,null,null,null,null,null,null,null,null,null,null,null,null,null,null,null,null,null,null,{"$f":"IF((Table_RiskAssessment[[#This Row],[S]]* Table_RiskAssessment[[#This Row],[F]]* Table_RiskAssessment[[#This Row],[P]]>0),IF(Table_RiskAssessment[[#This Row],[S]]=1,IF(Table_RiskAssessment[[#This Row],[F]]=1,IF(Table_RiskAssessment[[#This Row],[P]]=1,\"a\",IF(Table_RiskAssessment[[#This Row],[W]]=1,\"a\",\"b\")),IF(Table_RiskAssessment[[#This Row],[P]]=1,IF(Table_RiskAssessment[[#This Row],[W]]=1,\"a\",\"b\"),IF(Table_RiskAssessment[[#This Row],[W]]=1,\"b\",\"c\"))),IF(Table_RiskAssessment[[#This Row],[F]]=1,IF(Table_RiskAssessment[[#This Row],[P]]=1,IF(Table_RiskAssessment[[#This Row],[W]]=1,\"b\",\"c\"),IF(Table_RiskAssessment[[#This Row],[W]]=1,\"c\",\"d\")),IF(Table_RiskAssessment[[#This Row],[P]]=1,IF(Table_RiskAssessment[[#This Row],[W]]=1,\"c\",\"d\"),IF(Table_RiskAssessment[[#This Row],[W]]=1,\"d\",\"e\")))),\"?\")","v":"?"},null,null,null,null,null,null,null,null,null,null,null,null,null,null,{"$f":"IF((Table_RiskAssessment[[#This Row],[S2]]* Table_RiskAssessment[[#This Row],[F2]]* Table_RiskAssessment[[#This Row],[P2]]>0),IF(Table_RiskAssessment[[#This Row],[S2]]=1,IF(Table_RiskAssessment[[#This Row],[F2]]=1,IF(Table_RiskAssessment[[#This Row],[P2]]=1,\"a\",IF(Table_RiskAssessment[[#This Row],[W2]]=1,\"a\",\"b\")),IF(Table_RiskAssessment[[#This Row],[P2]]=1,IF(Table_RiskAssessment[[#This Row],[W2]]=1,\"a\",\"b\"),IF(Table_RiskAssessment[[#This Row],[W2]]=1,\"b\",\"c\"))),IF(Table_RiskAssessment[[#This Row],[F2]]=1,IF(Table_RiskAssessment[[#This Row],[P2]]=1,IF(Table_RiskAssessment[[#This Row],[W2]]=1,\"b\",\"c\"),IF(Table_RiskAssessment[[#This Row],[W2]]=1,\"c\",\"d\")),IF(Table_RiskAssessment[[#This Row],[P2]]=1,IF(Table_RiskAssessment[[#This Row],[W2]]=1,\"c\",\"d\"),IF(Table_RiskAssessment[[#This Row],[W2]]=1,\"d\",\"e\")))),\"?\")","v":"?"},null,null,null,"-"]
[null,null,null,"2006 / 42","2.4.05.2.",{"$f":"Sprache!A$172","v":"Verteilung, Anlagerung und Abdrift von Pestiziden"},"x","","x",null,null,null,null,null,null,null,null,null,null,null,null,null,null,null,null,null,null,null,null,null,null,null,null,{"$f":"IF((Table_RiskAssessment[[#This Row],[S]]* Table_RiskAssessment[[#This Row],[F]]* Table_RiskAssessment[[#This Row],[P]]>0),IF(Table_RiskAssessment[[#This Row],[S]]=1,IF(Table_RiskAssessment[[#This Row],[F]]=1,IF(Table_RiskAssessment[[#This Row],[P]]=1,\"a\",IF(Table_RiskAssessment[[#This Row],[W]]=1,\"a\",\"b\")),IF(Table_RiskAssessment[[#This Row],[P]]=1,IF(Table_RiskAssessment[[#This Row],[W]]=1,\"a\",\"b\"),IF(Table_RiskAssessment[[#This Row],[W]]=1,\"b\",\"c\"))),IF(Table_RiskAssessment[[#This Row],[F]]=1,IF(Table_RiskAssessment[[#This Row],[P]]=1,IF(Table_RiskAssessment[[#This Row],[W]]=1,\"b\",\"c\"),IF(Table_RiskAssessment[[#This Row],[W]]=1,\"c\",\"d\")),IF(Table_RiskAssessment[[#This Row],[P]]=1,IF(Table_RiskAssessment[[#This Row],[W]]=1,\"c\",\"d\"),IF(Table_RiskAssessment[[#This Row],[W]]=1,\"d\",\"e\")))),\"?\")","v":"?"},null,null,null,null,null,null,null,null,null,null,null,null,null,null,{"$f":"IF((Table_RiskAssessment[[#This Row],[S2]]* Table_RiskAssessment[[#This Row],[F2]]* Table_RiskAssessment[[#This Row],[P2]]>0),IF(Table_RiskAssessment[[#This Row],[S2]]=1,IF(Table_RiskAssessment[[#This Row],[F2]]=1,IF(Table_RiskAssessment[[#This Row],[P2]]=1,\"a\",IF(Table_RiskAssessment[[#This Row],[W2]]=1,\"a\",\"b\")),IF(Table_RiskAssessment[[#This Row],[P2]]=1,IF(Table_RiskAssessment[[#This Row],[W2]]=1,\"a\",\"b\"),IF(Table_RiskAssessment[[#This Row],[W2]]=1,\"b\",\"c\"))),IF(Table_RiskAssessment[[#This Row],[F2]]=1,IF(Table_RiskAssessment[[#This Row],[P2]]=1,IF(Table_RiskAssessment[[#This Row],[W2]]=1,\"b\",\"c\"),IF(Table_RiskAssessment[[#This Row],[W2]]=1,\"c\",\"d\")),IF(Table_RiskAssessment[[#This Row],[P2]]=1,IF(Table_RiskAssessment[[#This Row],[W2]]=1,\"c\",\"d\"),IF(Table_RiskAssessment[[#This Row],[W2]]=1,\"d\",\"e\")))),\"?\")","v":"?"},null,null,null,"-"]
[null,null,null,"2006 / 42","2.4.05.3.",{"$f":"Sprache!A$173","v":"Prüfungen"},"x","","x",null,null,null,null,null,null,null,null,null,null,null,null,null,null,null,null,null,null,null,null,null,null,null,null,{"$f":"IF((Table_RiskAssessment[[#This Row],[S]]* Table_RiskAssessment[[#This Row],[F]]* Table_RiskAssessment[[#This Row],[P]]>0),IF(Table_RiskAssessment[[#This Row],[S]]=1,IF(Table_RiskAssessment[[#This Row],[F]]=1,IF(Table_RiskAssessment[[#This Row],[P]]=1,\"a\",IF(Table_RiskAssessment[[#This Row],[W]]=1,\"a\",\"b\")),IF(Table_RiskAssessment[[#This Row],[P]]=1,IF(Table_RiskAssessment[[#This Row],[W]]=1,\"a\",\"b\"),IF(Table_RiskAssessment[[#This Row],[W]]=1,\"b\",\"c\"))),IF(Table_RiskAssessment[[#This Row],[F]]=1,IF(Table_RiskAssessment[[#This Row],[P]]=1,IF(Table_RiskAssessment[[#This Row],[W]]=1,\"b\",\"c\"),IF(Table_RiskAssessment[[#This Row],[W]]=1,\"c\",\"d\")),IF(Table_RiskAssessment[[#This Row],[P]]=1,IF(Table_RiskAssessment[[#This Row],[W]]=1,\"c\",\"d\"),IF(Table_RiskAssessment[[#This Row],[W]]=1,\"d\",\"e\")))),\"?\")","v":"?"},null,null,null,null,null,null,null,null,null,null,null,null,null,null,{"$f":"IF((Table_RiskAssessment[[#This Row],[S2]]* Table_RiskAssessment[[#This Row],[F2]]* Table_RiskAssessment[[#This Row],[P2]]>0),IF(Table_RiskAssessment[[#This Row],[S2]]=1,IF(Table_RiskAssessment[[#This Row],[F2]]=1,IF(Table_RiskAssessment[[#This Row],[P2]]=1,\"a\",IF(Table_RiskAssessment[[#This Row],[W2]]=1,\"a\",\"b\")),IF(Table_RiskAssessment[[#This Row],[P2]]=1,IF(Table_RiskAssessment[[#This Row],[W2]]=1,\"a\",\"b\"),IF(Table_RiskAssessment[[#This Row],[W2]]=1,\"b\",\"c\"))),IF(Table_RiskAssessment[[#This Row],[F2]]=1,IF(Table_RiskAssessment[[#This Row],[P2]]=1,IF(Table_RiskAssessment[[#This Row],[W2]]=1,\"b\",\"c\"),IF(Table_RiskAssessment[[#This Row],[W2]]=1,\"c\",\"d\")),IF(Table_RiskAssessment[[#This Row],[P2]]=1,IF(Table_RiskAssessment[[#This Row],[W2]]=1,\"c\",\"d\"),IF(Table_RiskAssessment[[#This Row],[W2]]=1,\"d\",\"e\")))),\"?\")","v":"?"},null,null,null,"-"]
[null,null,null,"2006 / 42","2.4.05.4.",{"$f":"Sprache!A$174","v":"Unbeabsichtigte Freisetzungen während und nach der Abschaltung"},"x","","x",null,null,null,null,null,null,null,null,null,null,null,null,null,null,null,null,null,null,null,null,null,null,null,null,{"$f":"IF((Table_RiskAssessment[[#This Row],[S]]* Table_RiskAssessment[[#This Row],[F]]* Table_RiskAssessment[[#This Row],[P]]>0),IF(Table_RiskAssessment[[#This Row],[S]]=1,IF(Table_RiskAssessment[[#This Row],[F]]=1,IF(Table_RiskAssessment[[#This Row],[P]]=1,\"a\",IF(Table_RiskAssessment[[#This Row],[W]]=1,\"a\",\"b\")),IF(Table_RiskAssessment[[#This Row],[P]]=1,IF(Table_RiskAssessment[[#This Row],[W]]=1,\"a\",\"b\"),IF(Table_RiskAssessment[[#This Row],[W]]=1,\"b\",\"c\"))),IF(Table_RiskAssessment[[#This Row],[F]]=1,IF(Table_RiskAssessment[[#This Row],[P]]=1,IF(Table_RiskAssessment[[#This Row],[W]]=1,\"b\",\"c\"),IF(Table_RiskAssessment[[#This Row],[W]]=1,\"c\",\"d\")),IF(Table_RiskAssessment[[#This Row],[P]]=1,IF(Table_RiskAssessment[[#This Row],[W]]=1,\"c\",\"d\"),IF(Table_RiskAssessment[[#This Row],[W]]=1,\"d\",\"e\")))),\"?\")","v":"?"},null,null,null,null,null,null,null,null,null,null,null,null,null,null,{"$f":"IF((Table_RiskAssessment[[#This Row],[S2]]* Table_RiskAssessment[[#This Row],[F2]]* Table_RiskAssessment[[#This Row],[P2]]>0),IF(Table_RiskAssessment[[#This Row],[S2]]=1,IF(Table_RiskAssessment[[#This Row],[F2]]=1,IF(Table_RiskAssessment[[#This Row],[P2]]=1,\"a\",IF(Table_RiskAssessment[[#This Row],[W2]]=1,\"a\",\"b\")),IF(Table_RiskAssessment[[#This Row],[P2]]=1,IF(Table_RiskAssessment[[#This Row],[W2]]=1,\"a\",\"b\"),IF(Table_RiskAssessment[[#This Row],[W2]]=1,\"b\",\"c\"))),IF(Table_RiskAssessment[[#This Row],[F2]]=1,IF(Table_RiskAssessment[[#This Row],[P2]]=1,IF(Table_RiskAssessment[[#This Row],[W2]]=1,\"b\",\"c\"),IF(Table_RiskAssessment[[#This Row],[W2]]=1,\"c\",\"d\")),IF(Table_RiskAssessment[[#This Row],[P2]]=1,IF(Table_RiskAssessment[[#This Row],[W2]]=1,\"c\",\"d\"),IF(Table_RiskAssessment[[#This Row],[W2]]=1,\"d\",\"e\")))),\"?\")","v":"?"},null,null,null,"-"]
[null,null,null,"2006 / 42","2.4.06.",{"$f":"Sprache!A$175","v":"Wartung"},"x","x","x",null,null,null,null,null,null,null,null,null,null,null,null,null,null,null,null,null,null,null,null,null,null,null,null,{"$f":"IF((Table_RiskAssessment[[#This Row],[S]]* Table_RiskAssessment[[#This Row],[F]]* Table_RiskAssessment[[#This Row],[P]]>0),IF(Table_RiskAssessment[[#This Row],[S]]=1,IF(Table_RiskAssessment[[#This Row],[F]]=1,IF(Table_RiskAssessment[[#This Row],[P]]=1,\"a\",IF(Table_RiskAssessment[[#This Row],[W]]=1,\"a\",\"b\")),IF(Table_RiskAssessment[[#This Row],[P]]=1,IF(Table_RiskAssessment[[#This Row],[W]]=1,\"a\",\"b\"),IF(Table_RiskAssessment[[#This Row],[W]]=1,\"b\",\"c\"))),IF(Table_RiskAssessment[[#This Row],[F]]=1,IF(Table_RiskAssessment[[#This Row],[P]]=1,IF(Table_RiskAssessment[[#This Row],[W]]=1,\"b\",\"c\"),IF(Table_RiskAssessment[[#This Row],[W]]=1,\"c\",\"d\")),IF(Table_RiskAssessment[[#This Row],[P]]=1,IF(Table_RiskAssessment[[#This Row],[W]]=1,\"c\",\"d\"),IF(Table_RiskAssessment[[#This Row],[W]]=1,\"d\",\"e\")))),\"?\")","v":"?"},null,null,null,null,null,null,null,null,null,null,null,null,null,null,{"$f":"IF((Table_RiskAssessment[[#This Row],[S2]]* Table_RiskAssessment[[#This Row],[F2]]* Table_RiskAssessment[[#This Row],[P2]]>0),IF(Table_RiskAssessment[[#This Row],[S2]]=1,IF(Table_RiskAssessment[[#This Row],[F2]]=1,IF(Table_RiskAssessment[[#This Row],[P2]]=1,\"a\",IF(Table_RiskAssessment[[#This Row],[W2]]=1,\"a\",\"b\")),IF(Table_RiskAssessment[[#This Row],[P2]]=1,IF(Table_RiskAssessment[[#This Row],[W2]]=1,\"a\",\"b\"),IF(Table_RiskAssessment[[#This Row],[W2]]=1,\"b\",\"c\"))),IF(Table_RiskAssessment[[#This Row],[F2]]=1,IF(Table_RiskAssessment[[#This Row],[P2]]=1,IF(Table_RiskAssessment[[#This Row],[W2]]=1,\"b\",\"c\"),IF(Table_RiskAssessment[[#This Row],[W2]]=1,\"c\",\"d\")),IF(Table_RiskAssessment[[#This Row],[P2]]=1,IF(Table_RiskAssessment[[#This Row],[W2]]=1,\"c\",\"d\"),IF(Table_RiskAssessment[[#This Row],[W2]]=1,\"d\",\"e\")))),\"?\")","v":"?"},null,null,null,"-"]
[null,null,null,"2006 / 42","2.4.06.1.",{"$f":"Sprache!A$176","v":"Reinigung"},"x","","x",null,null,null,null,null,null,null,null,null,null,null,null,null,null,null,null,null,null,null,null,null,null,null,null,{"$f":"IF((Table_RiskAssessment[[#This Row],[S]]* Table_RiskAssessment[[#This Row],[F]]* Table_RiskAssessment[[#This Row],[P]]>0),IF(Table_RiskAssessment[[#This Row],[S]]=1,IF(Table_RiskAssessment[[#This Row],[F]]=1,IF(Table_RiskAssessment[[#This Row],[P]]=1,\"a\",IF(Table_RiskAssessment[[#This Row],[W]]=1,\"a\",\"b\")),IF(Table_RiskAssessment[[#This Row],[P]]=1,IF(Table_RiskAssessment[[#This Row],[W]]=1,\"a\",\"b\"),IF(Table_RiskAssessment[[#This Row],[W]]=1,\"b\",\"c\"))),IF(Table_RiskAssessment[[#This Row],[F]]=1,IF(Table_RiskAssessment[[#This Row],[P]]=1,IF(Table_RiskAssessment[[#This Row],[W]]=1,\"b\",\"c\"),IF(Table_RiskAssessment[[#This Row],[W]]=1,\"c\",\"d\")),IF(Table_RiskAssessment[[#This Row],[P]]=1,IF(Table_RiskAssessment[[#This Row],[W]]=1,\"c\",\"d\"),IF(Table_RiskAssessment[[#This Row],[W]]=1,\"d\",\"e\")))),\"?\")","v":"?"},null,null,null,null,null,null,null,null,null,null,null,null,null,null,{"$f":"IF((Table_RiskAssessment[[#This Row],[S2]]* Table_RiskAssessment[[#This Row],[F2]]* Table_RiskAssessment[[#This Row],[P2]]>0),IF(Table_RiskAssessment[[#This Row],[S2]]=1,IF(Table_RiskAssessment[[#This Row],[F2]]=1,IF(Table_RiskAssessment[[#This Row],[P2]]=1,\"a\",IF(Table_RiskAssessment[[#This Row],[W2]]=1,\"a\",\"b\")),IF(Table_RiskAssessment[[#This Row],[P2]]=1,IF(Table_RiskAssessment[[#This Row],[W2]]=1,\"a\",\"b\"),IF(Table_RiskAssessment[[#This Row],[W2]]=1,\"b\",\"c\"))),IF(Table_RiskAssessment[[#This Row],[F2]]=1,IF(Table_RiskAssessment[[#This Row],[P2]]=1,IF(Table_RiskAssessment[[#This Row],[W2]]=1,\"b\",\"c\"),IF(Table_RiskAssessment[[#This Row],[W2]]=1,\"c\",\"d\")),IF(Table_RiskAssessment[[#This Row],[P2]]=1,IF(Table_RiskAssessment[[#This Row],[W2]]=1,\"c\",\"d\"),IF(Table_RiskAssessment[[#This Row],[W2]]=1,\"d\",\"e\")))),\"?\")","v":"?"},null,null,null,"-"]
[null,null,null,"2006 / 42","2.4.06.2.",{"$f":"Sprache!A$177","v":"Instandhaltung"},"x","","x",null,null,null,null,null,null,null,null,null,null,null,null,null,null,null,null,null,null,null,null,null,null,null,null,{"$f":"IF((Table_RiskAssessment[[#This Row],[S]]* Table_RiskAssessment[[#This Row],[F]]* Table_RiskAssessment[[#This Row],[P]]>0),IF(Table_RiskAssessment[[#This Row],[S]]=1,IF(Table_RiskAssessment[[#This Row],[F]]=1,IF(Table_RiskAssessment[[#This Row],[P]]=1,\"a\",IF(Table_RiskAssessment[[#This Row],[W]]=1,\"a\",\"b\")),IF(Table_RiskAssessment[[#This Row],[P]]=1,IF(Table_RiskAssessment[[#This Row],[W]]=1,\"a\",\"b\"),IF(Table_RiskAssessment[[#This Row],[W]]=1,\"b\",\"c\"))),IF(Table_RiskAssessment[[#This Row],[F]]=1,IF(Table_RiskAssessment[[#This Row],[P]]=1,IF(Table_RiskAssessment[[#This Row],[W]]=1,\"b\",\"c\"),IF(Table_RiskAssessment[[#This Row],[W]]=1,\"c\",\"d\")),IF(Table_RiskAssessment[[#This Row],[P]]=1,IF(Table_RiskAssessment[[#This Row],[W]]=1,\"c\",\"d\"),IF(Table_RiskAssessment[[#This Row],[W]]=1,\"d\",\"e\")))),\"?\")","v":"?"},null,null,null,null,null,null,null,null,null,null,null,null,null,null,{"$f":"IF((Table_RiskAssessment[[#This Row],[S2]]* Table_RiskAssessment[[#This Row],[F2]]* Table_RiskAssessment[[#This Row],[P2]]>0),IF(Table_RiskAssessment[[#This Row],[S2]]=1,IF(Table_RiskAssessment[[#This Row],[F2]]=1,IF(Table_RiskAssessment[[#This Row],[P2]]=1,\"a\",IF(Table_RiskAssessment[[#This Row],[W2]]=1,\"a\",\"b\")),IF(Table_RiskAssessment[[#This Row],[P2]]=1,IF(Table_RiskAssessment[[#This Row],[W2]]=1,\"a\",\"b\"),IF(Table_RiskAssessment[[#This Row],[W2]]=1,\"b\",\"c\"))),IF(Table_RiskAssessment[[#This Row],[F2]]=1,IF(Table_RiskAssessment[[#This Row],[P2]]=1,IF(Table_RiskAssessment[[#This Row],[W2]]=1,\"b\",\"c\"),IF(Table_RiskAssessment[[#This Row],[W2]]=1,\"c\",\"d\")),IF(Table_RiskAssessment[[#This Row],[P2]]=1,IF(Table_RiskAssessment[[#This Row],[W2]]=1,\"c\",\"d\"),IF(Table_RiskAssessment[[#This Row],[W2]]=1,\"d\",\"e\")))),\"?\")","v":"?"},null,null,null,"-"]
[null,null,null,"2006 / 42","2.4.07.",{"$f":"Sprache!A$178","v":"Kontrollen"},"x","","x",null,null,null,null,null,null,null,null,null,null,null,null,null,null,null,null,null,null,null,null,null,null,null,null,{"$f":"IF((Table_RiskAssessment[[#This Row],[S]]* Table_RiskAssessment[[#This Row],[F]]* Table_RiskAssessment[[#This Row],[P]]>0),IF(Table_RiskAssessment[[#This Row],[S]]=1,IF(Table_RiskAssessment[[#This Row],[F]]=1,IF(Table_RiskAssessment[[#This Row],[P]]=1,\"a\",IF(Table_RiskAssessment[[#This Row],[W]]=1,\"a\",\"b\")),IF(Table_RiskAssessment[[#This Row],[P]]=1,IF(Table_RiskAssessment[[#This Row],[W]]=1,\"a\",\"b\"),IF(Table_RiskAssessment[[#This Row],[W]]=1,\"b\",\"c\"))),IF(Table_RiskAssessment[[#This Row],[F]]=1,IF(Table_RiskAssessment[[#This Row],[P]]=1,IF(Table_RiskAssessment[[#This Row],[W]]=1,\"b\",\"c\"),IF(Table_RiskAssessment[[#This Row],[W]]=1,\"c\",\"d\")),IF(Table_RiskAssessment[[#This Row],[P]]=1,IF(Table_RiskAssessment[[#This Row],[W]]=1,\"c\",\"d\"),IF(Table_RiskAssessment[[#This Row],[W]]=1,\"d\",\"e\")))),\"?\")","v":"?"},null,null,null,null,null,null,null,null,null,null,null,null,null,null,{"$f":"IF((Table_RiskAssessment[[#This Row],[S2]]* Table_RiskAssessment[[#This Row],[F2]]* Table_RiskAssessment[[#This Row],[P2]]>0),IF(Table_RiskAssessment[[#This Row],[S2]]=1,IF(Table_RiskAssessment[[#This Row],[F2]]=1,IF(Table_RiskAssessment[[#This Row],[P2]]=1,\"a\",IF(Table_RiskAssessment[[#This Row],[W2]]=1,\"a\",\"b\")),IF(Table_RiskAssessment[[#This Row],[P2]]=1,IF(Table_RiskAssessment[[#This Row],[W2]]=1,\"a\",\"b\"),IF(Table_RiskAssessment[[#This Row],[W2]]=1,\"b\",\"c\"))),IF(Table_RiskAssessment[[#This Row],[F2]]=1,IF(Table_RiskAssessment[[#This Row],[P2]]=1,IF(Table_RiskAssessment[[#This Row],[W2]]=1,\"b\",\"c\"),IF(Table_RiskAssessment[[#This Row],[W2]]=1,\"c\",\"d\")),IF(Table_RiskAssessment[[#This Row],[P2]]=1,IF(Table_RiskAssessment[[#This Row],[W2]]=1,\"c\",\"d\"),IF(Table_RiskAssessment[[#This Row],[W2]]=1,\"d\",\"e\")))),\"?\")","v":"?"},null,null,null,"-"]
[null,null,null,"2006 / 42","2.4.08.",{"$f":"Sprache!A$179","v":"Kennzeichnung von Düsen, Sieben und Filtern"},"x","","x",null,null,null,null,null,null,null,null,null,null,null,null,null,null,null,null,null,null,null,null,null,null,null,null,{"$f":"IF((Table_RiskAssessment[[#This Row],[S]]* Table_RiskAssessment[[#This Row],[F]]* Table_RiskAssessment[[#This Row],[P]]>0),IF(Table_RiskAssessment[[#This Row],[S]]=1,IF(Table_RiskAssessment[[#This Row],[F]]=1,IF(Table_RiskAssessment[[#This Row],[P]]=1,\"a\",IF(Table_RiskAssessment[[#This Row],[W]]=1,\"a\",\"b\")),IF(Table_RiskAssessment[[#This Row],[P]]=1,IF(Table_RiskAssessment[[#This Row],[W]]=1,\"a\",\"b\"),IF(Table_RiskAssessment[[#This Row],[W]]=1,\"b\",\"c\"))),IF(Table_RiskAssessment[[#This Row],[F]]=1,IF(Table_RiskAssessment[[#This Row],[P]]=1,IF(Table_RiskAssessment[[#This Row],[W]]=1,\"b\",\"c\"),IF(Table_RiskAssessment[[#This Row],[W]]=1,\"c\",\"d\")),IF(Table_RiskAssessment[[#This Row],[P]]=1,IF(Table_RiskAssessment[[#This Row],[W]]=1,\"c\",\"d\"),IF(Table_RiskAssessment[[#This Row],[W]]=1,\"d\",\"e\")))),\"?\")","v":"?"},null,null,null,null,null,null,null,null,null,null,null,null,null,null,{"$f":"IF((Table_RiskAssessment[[#This Row],[S2]]* Table_RiskAssessment[[#This Row],[F2]]* Table_RiskAssessment[[#This Row],[P2]]>0),IF(Table_RiskAssessment[[#This Row],[S2]]=1,IF(Table_RiskAssessment[[#This Row],[F2]]=1,IF(Table_RiskAssessment[[#This Row],[P2]]=1,\"a\",IF(Table_RiskAssessment[[#This Row],[W2]]=1,\"a\",\"b\")),IF(Table_RiskAssessment[[#This Row],[P2]]=1,IF(Table_RiskAssessment[[#This Row],[W2]]=1,\"a\",\"b\"),IF(Table_RiskAssessment[[#This Row],[W2]]=1,\"b\",\"c\"))),IF(Table_RiskAssessment[[#This Row],[F2]]=1,IF(Table_RiskAssessment[[#This Row],[P2]]=1,IF(Table_RiskAssessment[[#This Row],[W2]]=1,\"b\",\"c\"),IF(Table_RiskAssessment[[#This Row],[W2]]=1,\"c\",\"d\")),IF(Table_RiskAssessment[[#This Row],[P2]]=1,IF(Table_RiskAssessment[[#This Row],[W2]]=1,\"c\",\"d\"),IF(Table_RiskAssessment[[#This Row],[W2]]=1,\"d\",\"e\")))),\"?\")","v":"?"},null,null,null,"-"]
[null,null,null,"2006 / 42","2.4.09.",{"$f":"Sprache!A$180","v":"Angabe des verwendeten Pestizids"},"x","","x",null,null,null,null,null,null,null,null,null,null,null,null,null,null,null,null,null,null,null,null,null,null,null,null,{"$f":"IF((Table_RiskAssessment[[#This Row],[S]]* Table_RiskAssessment[[#This Row],[F]]* Table_RiskAssessment[[#This Row],[P]]>0),IF(Table_RiskAssessment[[#This Row],[S]]=1,IF(Table_RiskAssessment[[#This Row],[F]]=1,IF(Table_RiskAssessment[[#This Row],[P]]=1,\"a\",IF(Table_RiskAssessment[[#This Row],[W]]=1,\"a\",\"b\")),IF(Table_RiskAssessment[[#This Row],[P]]=1,IF(Table_RiskAssessment[[#This Row],[W]]=1,\"a\",\"b\"),IF(Table_RiskAssessment[[#This Row],[W]]=1,\"b\",\"c\"))),IF(Table_RiskAssessment[[#This Row],[F]]=1,IF(Table_RiskAssessment[[#This Row],[P]]=1,IF(Table_RiskAssessment[[#This Row],[W]]=1,\"b\",\"c\"),IF(Table_RiskAssessment[[#This Row],[W]]=1,\"c\",\"d\")),IF(Table_RiskAssessment[[#This Row],[P]]=1,IF(Table_RiskAssessment[[#This Row],[W]]=1,\"c\",\"d\"),IF(Table_RiskAssessment[[#This Row],[W]]=1,\"d\",\"e\")))),\"?\")","v":"?"},null,null,null,null,null,null,null,null,null,null,null,null,null,null,{"$f":"IF((Table_RiskAssessment[[#This Row],[S2]]* Table_RiskAssessment[[#This Row],[F2]]* Table_RiskAssessment[[#This Row],[P2]]>0),IF(Table_RiskAssessment[[#This Row],[S2]]=1,IF(Table_RiskAssessment[[#This Row],[F2]]=1,IF(Table_RiskAssessment[[#This Row],[P2]]=1,\"a\",IF(Table_RiskAssessment[[#This Row],[W2]]=1,\"a\",\"b\")),IF(Table_RiskAssessment[[#This Row],[P2]]=1,IF(Table_RiskAssessment[[#This Row],[W2]]=1,\"a\",\"b\"),IF(Table_RiskAssessment[[#This Row],[W2]]=1,\"b\",\"c\"))),IF(Table_RiskAssessment[[#This Row],[F2]]=1,IF(Table_RiskAssessment[[#This Row],[P2]]=1,IF(Table_RiskAssessment[[#This Row],[W2]]=1,\"b\",\"c\"),IF(Table_RiskAssessment[[#This Row],[W2]]=1,\"c\",\"d\")),IF(Table_RiskAssessment[[#This Row],[P2]]=1,IF(Table_RiskAssessment[[#This Row],[W2]]=1,\"c\",\"d\"),IF(Table_RiskAssessment[[#This Row],[W2]]=1,\"d\",\"e\")))),\"?\")","v":"?"},null,null,null,"-"]
[null,null,null,"2006 / 42","2.4.10.",{"$f":"Sprache!A$181","v":"Betriebsanleitung"},"x","","x",null,null,null,null,null,null,null,null,null,null,null,null,null,null,null,null,null,null,null,null,null,null,null,null,{"$f":"IF((Table_RiskAssessment[[#This Row],[S]]* Table_RiskAssessment[[#This Row],[F]]* Table_RiskAssessment[[#This Row],[P]]>0),IF(Table_RiskAssessment[[#This Row],[S]]=1,IF(Table_RiskAssessment[[#This Row],[F]]=1,IF(Table_RiskAssessment[[#This Row],[P]]=1,\"a\",IF(Table_RiskAssessment[[#This Row],[W]]=1,\"a\",\"b\")),IF(Table_RiskAssessment[[#This Row],[P]]=1,IF(Table_RiskAssessment[[#This Row],[W]]=1,\"a\",\"b\"),IF(Table_RiskAssessment[[#This Row],[W]]=1,\"b\",\"c\"))),IF(Table_RiskAssessment[[#This Row],[F]]=1,IF(Table_RiskAssessment[[#This Row],[P]]=1,IF(Table_RiskAssessment[[#This Row],[W]]=1,\"b\",\"c\"),IF(Table_RiskAssessment[[#This Row],[W]]=1,\"c\",\"d\")),IF(Table_RiskAssessment[[#This Row],[P]]=1,IF(Table_RiskAssessment[[#This Row],[W]]=1,\"c\",\"d\"),IF(Table_RiskAssessment[[#This Row],[W]]=1,\"d\",\"e\")))),\"?\")","v":"?"},null,null,null,null,null,null,null,null,null,null,null,null,null,null,{"$f":"IF((Table_RiskAssessment[[#This Row],[S2]]* Table_RiskAssessment[[#This Row],[F2]]* Table_RiskAssessment[[#This Row],[P2]]>0),IF(Table_RiskAssessment[[#This Row],[S2]]=1,IF(Table_RiskAssessment[[#This Row],[F2]]=1,IF(Table_RiskAssessment[[#This Row],[P2]]=1,\"a\",IF(Table_RiskAssessment[[#This Row],[W2]]=1,\"a\",\"b\")),IF(Table_RiskAssessment[[#This Row],[P2]]=1,IF(Table_RiskAssessment[[#This Row],[W2]]=1,\"a\",\"b\"),IF(Table_RiskAssessment[[#This Row],[W2]]=1,\"b\",\"c\"))),IF(Table_RiskAssessment[[#This Row],[F2]]=1,IF(Table_RiskAssessment[[#This Row],[P2]]=1,IF(Table_RiskAssessment[[#This Row],[W2]]=1,\"b\",\"c\"),IF(Table_RiskAssessment[[#This Row],[W2]]=1,\"c\",\"d\")),IF(Table_RiskAssessment[[#This Row],[P2]]=1,IF(Table_RiskAssessment[[#This Row],[W2]]=1,\"c\",\"d\"),IF(Table_RiskAssessment[[#This Row],[W2]]=1,\"d\",\"e\")))),\"?\")","v":"?"},null,null,null,"-"]
[null,null,null,"2006 / 42","3.",{"$f":"Sprache!A$182","v":"Beweglichkeit von Maschinen"},"x","x","x",null,null,null,null,null,null,null,null,null,null,null,null,null,null,null,null,null,null,null,null,null,null,null,null,{"$f":"IF((Table_RiskAssessment[[#This Row],[S]]* Table_RiskAssessment[[#This Row],[F]]* Table_RiskAssessment[[#This Row],[P]]>0),IF(Table_RiskAssessment[[#This Row],[S]]=1,IF(Table_RiskAssessment[[#This Row],[F]]=1,IF(Table_RiskAssessment[[#This Row],[P]]=1,\"a\",IF(Table_RiskAssessment[[#This Row],[W]]=1,\"a\",\"b\")),IF(Table_RiskAssessment[[#This Row],[P]]=1,IF(Table_RiskAssessment[[#This Row],[W]]=1,\"a\",\"b\"),IF(Table_RiskAssessment[[#This Row],[W]]=1,\"b\",\"c\"))),IF(Table_RiskAssessment[[#This Row],[F]]=1,IF(Table_RiskAssessment[[#This Row],[P]]=1,IF(Table_RiskAssessment[[#This Row],[W]]=1,\"b\",\"c\"),IF(Table_RiskAssessment[[#This Row],[W]]=1,\"c\",\"d\")),IF(Table_RiskAssessment[[#This Row],[P]]=1,IF(Table_RiskAssessment[[#This Row],[W]]=1,\"c\",\"d\"),IF(Table_RiskAssessment[[#This Row],[W]]=1,\"d\",\"e\")))),\"?\")","v":"?"},null,null,null,null,null,null,null,null,null,null,null,null,null,null,{"$f":"IF((Table_RiskAssessment[[#This Row],[S2]]* Table_RiskAssessment[[#This Row],[F2]]* Table_RiskAssessment[[#This Row],[P2]]>0),IF(Table_RiskAssessment[[#This Row],[S2]]=1,IF(Table_RiskAssessment[[#This Row],[F2]]=1,IF(Table_RiskAssessment[[#This Row],[P2]]=1,\"a\",IF(Table_RiskAssessment[[#This Row],[W2]]=1,\"a\",\"b\")),IF(Table_RiskAssessment[[#This Row],[P2]]=1,IF(Table_RiskAssessment[[#This Row],[W2]]=1,\"a\",\"b\"),IF(Table_RiskAssessment[[#This Row],[W2]]=1,\"b\",\"c\"))),IF(Table_RiskAssessment[[#This Row],[F2]]=1,IF(Table_RiskAssessment[[#This Row],[P2]]=1,IF(Table_RiskAssessment[[#This Row],[W2]]=1,\"b\",\"c\"),IF(Table_RiskAssessment[[#This Row],[W2]]=1,\"c\",\"d\")),IF(Table_RiskAssessment[[#This Row],[P2]]=1,IF(Table_RiskAssessment[[#This Row],[W2]]=1,\"c\",\"d\"),IF(Table_RiskAssessment[[#This Row],[W2]]=1,\"d\",\"e\")))),\"?\")","v":"?"},null,null,null,"-"]
[null,null,null,"2006 / 42","3.1.",{"$f":"Sprache!A$183","v":"Allgemeines"},"x","x","x",null,null,null,null,null,null,null,null,null,null,null,null,null,null,null,null,null,null,null,null,null,null,null,null,{"$f":"IF((Table_RiskAssessment[[#This Row],[S]]* Table_RiskAssessment[[#This Row],[F]]* Table_RiskAssessment[[#This Row],[P]]>0),IF(Table_RiskAssessment[[#This Row],[S]]=1,IF(Table_RiskAssessment[[#This Row],[F]]=1,IF(Table_RiskAssessment[[#This Row],[P]]=1,\"a\",IF(Table_RiskAssessment[[#This Row],[W]]=1,\"a\",\"b\")),IF(Table_RiskAssessment[[#This Row],[P]]=1,IF(Table_RiskAssessment[[#This Row],[W]]=1,\"a\",\"b\"),IF(Table_RiskAssessment[[#This Row],[W]]=1,\"b\",\"c\"))),IF(Table_RiskAssessment[[#This Row],[F]]=1,IF(Table_RiskAssessment[[#This Row],[P]]=1,IF(Table_RiskAssessment[[#This Row],[W]]=1,\"b\",\"c\"),IF(Table_RiskAssessment[[#This Row],[W]]=1,\"c\",\"d\")),IF(Table_RiskAssessment[[#This Row],[P]]=1,IF(Table_RiskAssessment[[#This Row],[W]]=1,\"c\",\"d\"),IF(Table_RiskAssessment[[#This Row],[W]]=1,\"d\",\"e\")))),\"?\")","v":"?"},null,null,null,null,null,null,null,null,null,null,null,null,null,null,{"$f":"IF((Table_RiskAssessment[[#This Row],[S2]]* Table_RiskAssessment[[#This Row],[F2]]* Table_RiskAssessment[[#This Row],[P2]]>0),IF(Table_RiskAssessment[[#This Row],[S2]]=1,IF(Table_RiskAssessment[[#This Row],[F2]]=1,IF(Table_RiskAssessment[[#This Row],[P2]]=1,\"a\",IF(Table_RiskAssessment[[#This Row],[W2]]=1,\"a\",\"b\")),IF(Table_RiskAssessment[[#This Row],[P2]]=1,IF(Table_RiskAssessment[[#This Row],[W2]]=1,\"a\",\"b\"),IF(Table_RiskAssessment[[#This Row],[W2]]=1,\"b\",\"c\"))),IF(Table_RiskAssessment[[#This Row],[F2]]=1,IF(Table_RiskAssessment[[#This Row],[P2]]=1,IF(Table_RiskAssessment[[#This Row],[W2]]=1,\"b\",\"c\"),IF(Table_RiskAssessment[[#This Row],[W2]]=1,\"c\",\"d\")),IF(Table_RiskAssessment[[#This Row],[P2]]=1,IF(Table_RiskAssessment[[#This Row],[W2]]=1,\"c\",\"d\"),IF(Table_RiskAssessment[[#This Row],[W2]]=1,\"d\",\"e\")))),\"?\")","v":"?"},null,null,null,"-"]
[null,null,null,"2006 / 42","3.1.1.",{"$f":"Sprache!A$184","v":"Begriffsbestimmungen"},"x","","x",null,null,null,null,null,null,null,null,null,null,null,null,null,null,null,null,null,null,null,null,null,null,null,null,{"$f":"IF((Table_RiskAssessment[[#This Row],[S]]* Table_RiskAssessment[[#This Row],[F]]* Table_RiskAssessment[[#This Row],[P]]>0),IF(Table_RiskAssessment[[#This Row],[S]]=1,IF(Table_RiskAssessment[[#This Row],[F]]=1,IF(Table_RiskAssessment[[#This Row],[P]]=1,\"a\",IF(Table_RiskAssessment[[#This Row],[W]]=1,\"a\",\"b\")),IF(Table_RiskAssessment[[#This Row],[P]]=1,IF(Table_RiskAssessment[[#This Row],[W]]=1,\"a\",\"b\"),IF(Table_RiskAssessment[[#This Row],[W]]=1,\"b\",\"c\"))),IF(Table_RiskAssessment[[#This Row],[F]]=1,IF(Table_RiskAssessment[[#This Row],[P]]=1,IF(Table_RiskAssessment[[#This Row],[W]]=1,\"b\",\"c\"),IF(Table_RiskAssessment[[#This Row],[W]]=1,\"c\",\"d\")),IF(Table_RiskAssessment[[#This Row],[P]]=1,IF(Table_RiskAssessment[[#This Row],[W]]=1,\"c\",\"d\"),IF(Table_RiskAssessment[[#This Row],[W]]=1,\"d\",\"e\")))),\"?\")","v":"?"},null,null,null,null,null,null,null,null,null,null,null,null,null,null,{"$f":"IF((Table_RiskAssessment[[#This Row],[S2]]* Table_RiskAssessment[[#This Row],[F2]]* Table_RiskAssessment[[#This Row],[P2]]>0),IF(Table_RiskAssessment[[#This Row],[S2]]=1,IF(Table_RiskAssessment[[#This Row],[F2]]=1,IF(Table_RiskAssessment[[#This Row],[P2]]=1,\"a\",IF(Table_RiskAssessment[[#This Row],[W2]]=1,\"a\",\"b\")),IF(Table_RiskAssessment[[#This Row],[P2]]=1,IF(Table_RiskAssessment[[#This Row],[W2]]=1,\"a\",\"b\"),IF(Table_RiskAssessment[[#This Row],[W2]]=1,\"b\",\"c\"))),IF(Table_RiskAssessment[[#This Row],[F2]]=1,IF(Table_RiskAssessment[[#This Row],[P2]]=1,IF(Table_RiskAssessment[[#This Row],[W2]]=1,\"b\",\"c\"),IF(Table_RiskAssessment[[#This Row],[W2]]=1,\"c\",\"d\")),IF(Table_RiskAssessment[[#This Row],[P2]]=1,IF(Table_RiskAssessment[[#This Row],[W2]]=1,\"c\",\"d\"),IF(Table_RiskAssessment[[#This Row],[W2]]=1,\"d\",\"e\")))),\"?\")","v":"?"},null,null,null,"-"]
[null,null,null,"2006 / 42","3.2.",{"$f":"Sprache!A$185","v":"Bedienerplätze"},"x","x","x",null,null,null,null,null,null,null,null,null,null,null,null,null,null,null,null,null,null,null,null,null,null,null,null,{"$f":"IF((Table_RiskAssessment[[#This Row],[S]]* Table_RiskAssessment[[#This Row],[F]]* Table_RiskAssessment[[#This Row],[P]]>0),IF(Table_RiskAssessment[[#This Row],[S]]=1,IF(Table_RiskAssessment[[#This Row],[F]]=1,IF(Table_RiskAssessment[[#This Row],[P]]=1,\"a\",IF(Table_RiskAssessment[[#This Row],[W]]=1,\"a\",\"b\")),IF(Table_RiskAssessment[[#This Row],[P]]=1,IF(Table_RiskAssessment[[#This Row],[W]]=1,\"a\",\"b\"),IF(Table_RiskAssessment[[#This Row],[W]]=1,\"b\",\"c\"))),IF(Table_RiskAssessment[[#This Row],[F]]=1,IF(Table_RiskAssessment[[#This Row],[P]]=1,IF(Table_RiskAssessment[[#This Row],[W]]=1,\"b\",\"c\"),IF(Table_RiskAssessment[[#This Row],[W]]=1,\"c\",\"d\")),IF(Table_RiskAssessment[[#This Row],[P]]=1,IF(Table_RiskAssessment[[#This Row],[W]]=1,\"c\",\"d\"),IF(Table_RiskAssessment[[#This Row],[W]]=1,\"d\",\"e\")))),\"?\")","v":"?"},null,null,null,null,null,null,null,null,null,null,null,null,null,null,{"$f":"IF((Table_RiskAssessment[[#This Row],[S2]]* Table_RiskAssessment[[#This Row],[F2]]* Table_RiskAssessment[[#This Row],[P2]]>0),IF(Table_RiskAssessment[[#This Row],[S2]]=1,IF(Table_RiskAssessment[[#This Row],[F2]]=1,IF(Table_RiskAssessment[[#This Row],[P2]]=1,\"a\",IF(Table_RiskAssessment[[#This Row],[W2]]=1,\"a\",\"b\")),IF(Table_RiskAssessment[[#This Row],[P2]]=1,IF(Table_RiskAssessment[[#This Row],[W2]]=1,\"a\",\"b\"),IF(Table_RiskAssessment[[#This Row],[W2]]=1,\"b\",\"c\"))),IF(Table_RiskAssessment[[#This Row],[F2]]=1,IF(Table_RiskAssessment[[#This Row],[P2]]=1,IF(Table_RiskAssessment[[#This Row],[W2]]=1,\"b\",\"c\"),IF(Table_RiskAssessment[[#This Row],[W2]]=1,\"c\",\"d\")),IF(Table_RiskAssessment[[#This Row],[P2]]=1,IF(Table_RiskAssessment[[#This Row],[W2]]=1,\"c\",\"d\"),IF(Table_RiskAssessment[[#This Row],[W2]]=1,\"d\",\"e\")))),\"?\")","v":"?"},null,null,null,"-"]
[null,null,null,"2006 / 42","3.2.1.",{"$f":"Sprache!A$186","v":"Fahrerplatz"},"x","","x",null,null,null,null,null,null,null,null,null,null,null,null,null,null,null,null,null,null,null,null,null,null,null,null,{"$f":"IF((Table_RiskAssessment[[#This Row],[S]]* Table_RiskAssessment[[#This Row],[F]]* Table_RiskAssessment[[#This Row],[P]]>0),IF(Table_RiskAssessment[[#This Row],[S]]=1,IF(Table_RiskAssessment[[#This Row],[F]]=1,IF(Table_RiskAssessment[[#This Row],[P]]=1,\"a\",IF(Table_RiskAssessment[[#This Row],[W]]=1,\"a\",\"b\")),IF(Table_RiskAssessment[[#This Row],[P]]=1,IF(Table_RiskAssessment[[#This Row],[W]]=1,\"a\",\"b\"),IF(Table_RiskAssessment[[#This Row],[W]]=1,\"b\",\"c\"))),IF(Table_RiskAssessment[[#This Row],[F]]=1,IF(Table_RiskAssessment[[#This Row],[P]]=1,IF(Table_RiskAssessment[[#This Row],[W]]=1,\"b\",\"c\"),IF(Table_RiskAssessment[[#This Row],[W]]=1,\"c\",\"d\")),IF(Table_RiskAssessment[[#This Row],[P]]=1,IF(Table_RiskAssessment[[#This Row],[W]]=1,\"c\",\"d\"),IF(Table_RiskAssessment[[#This Row],[W]]=1,\"d\",\"e\")))),\"?\")","v":"?"},null,null,null,null,null,null,null,null,null,null,null,null,null,null,{"$f":"IF((Table_RiskAssessment[[#This Row],[S2]]* Table_RiskAssessment[[#This Row],[F2]]* Table_RiskAssessment[[#This Row],[P2]]>0),IF(Table_RiskAssessment[[#This Row],[S2]]=1,IF(Table_RiskAssessment[[#This Row],[F2]]=1,IF(Table_RiskAssessment[[#This Row],[P2]]=1,\"a\",IF(Table_RiskAssessment[[#This Row],[W2]]=1,\"a\",\"b\")),IF(Table_RiskAssessment[[#This Row],[P2]]=1,IF(Table_RiskAssessment[[#This Row],[W2]]=1,\"a\",\"b\"),IF(Table_RiskAssessment[[#This Row],[W2]]=1,\"b\",\"c\"))),IF(Table_RiskAssessment[[#This Row],[F2]]=1,IF(Table_RiskAssessment[[#This Row],[P2]]=1,IF(Table_RiskAssessment[[#This Row],[W2]]=1,\"b\",\"c\"),IF(Table_RiskAssessment[[#This Row],[W2]]=1,\"c\",\"d\")),IF(Table_RiskAssessment[[#This Row],[P2]]=1,IF(Table_RiskAssessment[[#This Row],[W2]]=1,\"c\",\"d\"),IF(Table_RiskAssessment[[#This Row],[W2]]=1,\"d\",\"e\")))),\"?\")","v":"?"},null,null,null,"-"]
[null,null,null,"2006 / 42","3.2.2.",{"$f":"Sprache!A$187","v":"Sitze"},"x","","x",null,null,null,null,null,null,null,null,null,null,null,null,null,null,null,null,null,null,null,null,null,null,null,null,{"$f":"IF((Table_RiskAssessment[[#This Row],[S]]* Table_RiskAssessment[[#This Row],[F]]* Table_RiskAssessment[[#This Row],[P]]>0),IF(Table_RiskAssessment[[#This Row],[S]]=1,IF(Table_RiskAssessment[[#This Row],[F]]=1,IF(Table_RiskAssessment[[#This Row],[P]]=1,\"a\",IF(Table_RiskAssessment[[#This Row],[W]]=1,\"a\",\"b\")),IF(Table_RiskAssessment[[#This Row],[P]]=1,IF(Table_RiskAssessment[[#This Row],[W]]=1,\"a\",\"b\"),IF(Table_RiskAssessment[[#This Row],[W]]=1,\"b\",\"c\"))),IF(Table_RiskAssessment[[#This Row],[F]]=1,IF(Table_RiskAssessment[[#This Row],[P]]=1,IF(Table_RiskAssessment[[#This Row],[W]]=1,\"b\",\"c\"),IF(Table_RiskAssessment[[#This Row],[W]]=1,\"c\",\"d\")),IF(Table_RiskAssessment[[#This Row],[P]]=1,IF(Table_RiskAssessment[[#This Row],[W]]=1,\"c\",\"d\"),IF(Table_RiskAssessment[[#This Row],[W]]=1,\"d\",\"e\")))),\"?\")","v":"?"},null,null,null,null,null,null,null,null,null,null,null,null,null,null,{"$f":"IF((Table_RiskAssessment[[#This Row],[S2]]* Table_RiskAssessment[[#This Row],[F2]]* Table_RiskAssessment[[#This Row],[P2]]>0),IF(Table_RiskAssessment[[#This Row],[S2]]=1,IF(Table_RiskAssessment[[#This Row],[F2]]=1,IF(Table_RiskAssessment[[#This Row],[P2]]=1,\"a\",IF(Table_RiskAssessment[[#This Row],[W2]]=1,\"a\",\"b\")),IF(Table_RiskAssessment[[#This Row],[P2]]=1,IF(Table_RiskAssessment[[#This Row],[W2]]=1,\"a\",\"b\"),IF(Table_RiskAssessment[[#This Row],[W2]]=1,\"b\",\"c\"))),IF(Table_RiskAssessment[[#This Row],[F2]]=1,IF(Table_RiskAssessment[[#This Row],[P2]]=1,IF(Table_RiskAssessment[[#This Row],[W2]]=1,\"b\",\"c\"),IF(Table_RiskAssessment[[#This Row],[W2]]=1,\"c\",\"d\")),IF(Table_RiskAssessment[[#This Row],[P2]]=1,IF(Table_RiskAssessment[[#This Row],[W2]]=1,\"c\",\"d\"),IF(Table_RiskAssessment[[#This Row],[W2]]=1,\"d\",\"e\")))),\"?\")","v":"?"},null,null,null,"-"]
[null,null,null,"2006 / 42","3.2.3.",{"$f":"Sprache!A$188","v":"Plätze für andere Personen"},"x","","x",null,null,null,null,null,null,null,null,null,null,null,null,null,null,null,null,null,null,null,null,null,null,null,null,{"$f":"IF((Table_RiskAssessment[[#This Row],[S]]* Table_RiskAssessment[[#This Row],[F]]* Table_RiskAssessment[[#This Row],[P]]>0),IF(Table_RiskAssessment[[#This Row],[S]]=1,IF(Table_RiskAssessment[[#This Row],[F]]=1,IF(Table_RiskAssessment[[#This Row],[P]]=1,\"a\",IF(Table_RiskAssessment[[#This Row],[W]]=1,\"a\",\"b\")),IF(Table_RiskAssessment[[#This Row],[P]]=1,IF(Table_RiskAssessment[[#This Row],[W]]=1,\"a\",\"b\"),IF(Table_RiskAssessment[[#This Row],[W]]=1,\"b\",\"c\"))),IF(Table_RiskAssessment[[#This Row],[F]]=1,IF(Table_RiskAssessment[[#This Row],[P]]=1,IF(Table_RiskAssessment[[#This Row],[W]]=1,\"b\",\"c\"),IF(Table_RiskAssessment[[#This Row],[W]]=1,\"c\",\"d\")),IF(Table_RiskAssessment[[#This Row],[P]]=1,IF(Table_RiskAssessment[[#This Row],[W]]=1,\"c\",\"d\"),IF(Table_RiskAssessment[[#This Row],[W]]=1,\"d\",\"e\")))),\"?\")","v":"?"},null,null,null,null,null,null,null,null,null,null,null,null,null,null,{"$f":"IF((Table_RiskAssessment[[#This Row],[S2]]* Table_RiskAssessment[[#This Row],[F2]]* Table_RiskAssessment[[#This Row],[P2]]>0),IF(Table_RiskAssessment[[#This Row],[S2]]=1,IF(Table_RiskAssessment[[#This Row],[F2]]=1,IF(Table_RiskAssessment[[#This Row],[P2]]=1,\"a\",IF(Table_RiskAssessment[[#This Row],[W2]]=1,\"a\",\"b\")),IF(Table_RiskAssessment[[#This Row],[P2]]=1,IF(Table_RiskAssessment[[#This Row],[W2]]=1,\"a\",\"b\"),IF(Table_RiskAssessment[[#This Row],[W2]]=1,\"b\",\"c\"))),IF(Table_RiskAssessment[[#This Row],[F2]]=1,IF(Table_RiskAssessment[[#This Row],[P2]]=1,IF(Table_RiskAssessment[[#This Row],[W2]]=1,\"b\",\"c\"),IF(Table_RiskAssessment[[#This Row],[W2]]=1,\"c\",\"d\")),IF(Table_RiskAssessment[[#This Row],[P2]]=1,IF(Table_RiskAssessment[[#This Row],[W2]]=1,\"c\",\"d\"),IF(Table_RiskAssessment[[#This Row],[W2]]=1,\"d\",\"e\")))),\"?\")","v":"?"},null,null,null,"-"]
[null,null,null,"2006 / 42","3.3.",{"$f":"Sprache!A$189","v":"Steuerung"},"x","x","x",null,null,null,null,null,null,null,null,null,null,null,null,null,null,null,null,null,null,null,null,null,null,null,null,{"$f":"IF((Table_RiskAssessment[[#This Row],[S]]* Table_RiskAssessment[[#This Row],[F]]* Table_RiskAssessment[[#This Row],[P]]>0),IF(Table_RiskAssessment[[#This Row],[S]]=1,IF(Table_RiskAssessment[[#This Row],[F]]=1,IF(Table_RiskAssessment[[#This Row],[P]]=1,\"a\",IF(Table_RiskAssessment[[#This Row],[W]]=1,\"a\",\"b\")),IF(Table_RiskAssessment[[#This Row],[P]]=1,IF(Table_RiskAssessment[[#This Row],[W]]=1,\"a\",\"b\"),IF(Table_RiskAssessment[[#This Row],[W]]=1,\"b\",\"c\"))),IF(Table_RiskAssessment[[#This Row],[F]]=1,IF(Table_RiskAssessment[[#This Row],[P]]=1,IF(Table_RiskAssessment[[#This Row],[W]]=1,\"b\",\"c\"),IF(Table_RiskAssessment[[#This Row],[W]]=1,\"c\",\"d\")),IF(Table_RiskAssessment[[#This Row],[P]]=1,IF(Table_RiskAssessment[[#This Row],[W]]=1,\"c\",\"d\"),IF(Table_RiskAssessment[[#This Row],[W]]=1,\"d\",\"e\")))),\"?\")","v":"?"},null,null,null,null,null,null,null,null,null,null,null,null,null,null,{"$f":"IF((Table_RiskAssessment[[#This Row],[S2]]* Table_RiskAssessment[[#This Row],[F2]]* Table_RiskAssessment[[#This Row],[P2]]>0),IF(Table_RiskAssessment[[#This Row],[S2]]=1,IF(Table_RiskAssessment[[#This Row],[F2]]=1,IF(Table_RiskAssessment[[#This Row],[P2]]=1,\"a\",IF(Table_RiskAssessment[[#This Row],[W2]]=1,\"a\",\"b\")),IF(Table_RiskAssessment[[#This Row],[P2]]=1,IF(Table_RiskAssessment[[#This Row],[W2]]=1,\"a\",\"b\"),IF(Table_RiskAssessment[[#This Row],[W2]]=1,\"b\",\"c\"))),IF(Table_RiskAssessment[[#This Row],[F2]]=1,IF(Table_RiskAssessment[[#This Row],[P2]]=1,IF(Table_RiskAssessment[[#This Row],[W2]]=1,\"b\",\"c\"),IF(Table_RiskAssessment[[#This Row],[W2]]=1,\"c\",\"d\")),IF(Table_RiskAssessment[[#This Row],[P2]]=1,IF(Table_RiskAssessment[[#This Row],[W2]]=1,\"c\",\"d\"),IF(Table_RiskAssessment[[#This Row],[W2]]=1,\"d\",\"e\")))),\"?\")","v":"?"},null,null,null,"-"]
[null,null,null,"2006 / 42","3.3.1.",{"$f":"Sprache!A$190","v":"Stellteile"},"x","","x",null,null,null,null,null,null,null,null,null,null,null,null,null,null,null,null,null,null,null,null,null,null,null,null,{"$f":"IF((Table_RiskAssessment[[#This Row],[S]]* Table_RiskAssessment[[#This Row],[F]]* Table_RiskAssessment[[#This Row],[P]]>0),IF(Table_RiskAssessment[[#This Row],[S]]=1,IF(Table_RiskAssessment[[#This Row],[F]]=1,IF(Table_RiskAssessment[[#This Row],[P]]=1,\"a\",IF(Table_RiskAssessment[[#This Row],[W]]=1,\"a\",\"b\")),IF(Table_RiskAssessment[[#This Row],[P]]=1,IF(Table_RiskAssessment[[#This Row],[W]]=1,\"a\",\"b\"),IF(Table_RiskAssessment[[#This Row],[W]]=1,\"b\",\"c\"))),IF(Table_RiskAssessment[[#This Row],[F]]=1,IF(Table_RiskAssessment[[#This Row],[P]]=1,IF(Table_RiskAssessment[[#This Row],[W]]=1,\"b\",\"c\"),IF(Table_RiskAssessment[[#This Row],[W]]=1,\"c\",\"d\")),IF(Table_RiskAssessment[[#This Row],[P]]=1,IF(Table_RiskAssessment[[#This Row],[W]]=1,\"c\",\"d\"),IF(Table_RiskAssessment[[#This Row],[W]]=1,\"d\",\"e\")))),\"?\")","v":"?"},null,null,null,null,null,null,null,null,null,null,null,null,null,null,{"$f":"IF((Table_RiskAssessment[[#This Row],[S2]]* Table_RiskAssessment[[#This Row],[F2]]* Table_RiskAssessment[[#This Row],[P2]]>0),IF(Table_RiskAssessment[[#This Row],[S2]]=1,IF(Table_RiskAssessment[[#This Row],[F2]]=1,IF(Table_RiskAssessment[[#This Row],[P2]]=1,\"a\",IF(Table_RiskAssessment[[#This Row],[W2]]=1,\"a\",\"b\")),IF(Table_RiskAssessment[[#This Row],[P2]]=1,IF(Table_RiskAssessment[[#This Row],[W2]]=1,\"a\",\"b\"),IF(Table_RiskAssessment[[#This Row],[W2]]=1,\"b\",\"c\"))),IF(Table_RiskAssessment[[#This Row],[F2]]=1,IF(Table_RiskAssessment[[#This Row],[P2]]=1,IF(Table_RiskAssessment[[#This Row],[W2]]=1,\"b\",\"c\"),IF(Table_RiskAssessment[[#This Row],[W2]]=1,\"c\",\"d\")),IF(Table_RiskAssessment[[#This Row],[P2]]=1,IF(Table_RiskAssessment[[#This Row],[W2]]=1,\"c\",\"d\"),IF(Table_RiskAssessment[[#This Row],[W2]]=1,\"d\",\"e\")))),\"?\")","v":"?"},null,null,null,"-"]
[null,null,null,"2006 / 42","3.3.2.",{"$f":"Sprache!A$191","v":"Ingangsetzen/Verfahren"},"x","","x",null,null,null,null,null,null,null,null,null,null,null,null,null,null,null,null,null,null,null,null,null,null,null,null,{"$f":"IF((Table_RiskAssessment[[#This Row],[S]]* Table_RiskAssessment[[#This Row],[F]]* Table_RiskAssessment[[#This Row],[P]]>0),IF(Table_RiskAssessment[[#This Row],[S]]=1,IF(Table_RiskAssessment[[#This Row],[F]]=1,IF(Table_RiskAssessment[[#This Row],[P]]=1,\"a\",IF(Table_RiskAssessment[[#This Row],[W]]=1,\"a\",\"b\")),IF(Table_RiskAssessment[[#This Row],[P]]=1,IF(Table_RiskAssessment[[#This Row],[W]]=1,\"a\",\"b\"),IF(Table_RiskAssessment[[#This Row],[W]]=1,\"b\",\"c\"))),IF(Table_RiskAssessment[[#This Row],[F]]=1,IF(Table_RiskAssessment[[#This Row],[P]]=1,IF(Table_RiskAssessment[[#This Row],[W]]=1,\"b\",\"c\"),IF(Table_RiskAssessment[[#This Row],[W]]=1,\"c\",\"d\")),IF(Table_RiskAssessment[[#This Row],[P]]=1,IF(Table_RiskAssessment[[#This Row],[W]]=1,\"c\",\"d\"),IF(Table_RiskAssessment[[#This Row],[W]]=1,\"d\",\"e\")))),\"?\")","v":"?"},null,null,null,null,null,null,null,null,null,null,null,null,null,null,{"$f":"IF((Table_RiskAssessment[[#This Row],[S2]]* Table_RiskAssessment[[#This Row],[F2]]* Table_RiskAssessment[[#This Row],[P2]]>0),IF(Table_RiskAssessment[[#This Row],[S2]]=1,IF(Table_RiskAssessment[[#This Row],[F2]]=1,IF(Table_RiskAssessment[[#This Row],[P2]]=1,\"a\",IF(Table_RiskAssessment[[#This Row],[W2]]=1,\"a\",\"b\")),IF(Table_RiskAssessment[[#This Row],[P2]]=1,IF(Table_RiskAssessment[[#This Row],[W2]]=1,\"a\",\"b\"),IF(Table_RiskAssessment[[#This Row],[W2]]=1,\"b\",\"c\"))),IF(Table_RiskAssessment[[#This Row],[F2]]=1,IF(Table_RiskAssessment[[#This Row],[P2]]=1,IF(Table_RiskAssessment[[#This Row],[W2]]=1,\"b\",\"c\"),IF(Table_RiskAssessment[[#This Row],[W2]]=1,\"c\",\"d\")),IF(Table_RiskAssessment[[#This Row],[P2]]=1,IF(Table_RiskAssessment[[#This Row],[W2]]=1,\"c\",\"d\"),IF(Table_RiskAssessment[[#This Row],[W2]]=1,\"d\",\"e\")))),\"?\")","v":"?"},null,null,null,"-"]
[null,null,null,"2006 / 42","3.3.3.",{"$f":"Sprache!A$192","v":"Stillsetzen/Bremsen"},"x","","x",null,null,null,null,null,null,null,null,null,null,null,null,null,null,null,null,null,null,null,null,null,null,null,null,{"$f":"IF((Table_RiskAssessment[[#This Row],[S]]* Table_RiskAssessment[[#This Row],[F]]* Table_RiskAssessment[[#This Row],[P]]>0),IF(Table_RiskAssessment[[#This Row],[S]]=1,IF(Table_RiskAssessment[[#This Row],[F]]=1,IF(Table_RiskAssessment[[#This Row],[P]]=1,\"a\",IF(Table_RiskAssessment[[#This Row],[W]]=1,\"a\",\"b\")),IF(Table_RiskAssessment[[#This Row],[P]]=1,IF(Table_RiskAssessment[[#This Row],[W]]=1,\"a\",\"b\"),IF(Table_RiskAssessment[[#This Row],[W]]=1,\"b\",\"c\"))),IF(Table_RiskAssessment[[#This Row],[F]]=1,IF(Table_RiskAssessment[[#This Row],[P]]=1,IF(Table_RiskAssessment[[#This Row],[W]]=1,\"b\",\"c\"),IF(Table_RiskAssessment[[#This Row],[W]]=1,\"c\",\"d\")),IF(Table_RiskAssessment[[#This Row],[P]]=1,IF(Table_RiskAssessment[[#This Row],[W]]=1,\"c\",\"d\"),IF(Table_RiskAssessment[[#This Row],[W]]=1,\"d\",\"e\")))),\"?\")","v":"?"},null,null,null,null,null,null,null,null,null,null,null,null,null,null,{"$f":"IF((Table_RiskAssessment[[#This Row],[S2]]* Table_RiskAssessment[[#This Row],[F2]]* Table_RiskAssessment[[#This Row],[P2]]>0),IF(Table_RiskAssessment[[#This Row],[S2]]=1,IF(Table_RiskAssessment[[#This Row],[F2]]=1,IF(Table_RiskAssessment[[#This Row],[P2]]=1,\"a\",IF(Table_RiskAssessment[[#This Row],[W2]]=1,\"a\",\"b\")),IF(Table_RiskAssessment[[#This Row],[P2]]=1,IF(Table_RiskAssessment[[#This Row],[W2]]=1,\"a\",\"b\"),IF(Table_RiskAssessment[[#This Row],[W2]]=1,\"b\",\"c\"))),IF(Table_RiskAssessment[[#This Row],[F2]]=1,IF(Table_RiskAssessment[[#This Row],[P2]]=1,IF(Table_RiskAssessment[[#This Row],[W2]]=1,\"b\",\"c\"),IF(Table_RiskAssessment[[#This Row],[W2]]=1,\"c\",\"d\")),IF(Table_RiskAssessment[[#This Row],[P2]]=1,IF(Table_RiskAssessment[[#This Row],[W2]]=1,\"c\",\"d\"),IF(Table_RiskAssessment[[#This Row],[W2]]=1,\"d\",\"e\")))),\"?\")","v":"?"},null,null,null,"-"]
[null,null,null,"2006 / 42","3.3.4.",{"$f":"Sprache!A$193","v":"Verfahren mitgängergeführter Maschinen"},"x","","x",null,null,null,null,null,null,null,null,null,null,null,null,null,null,null,null,null,null,null,null,null,null,null,null,{"$f":"IF((Table_RiskAssessment[[#This Row],[S]]* Table_RiskAssessment[[#This Row],[F]]* Table_RiskAssessment[[#This Row],[P]]>0),IF(Table_RiskAssessment[[#This Row],[S]]=1,IF(Table_RiskAssessment[[#This Row],[F]]=1,IF(Table_RiskAssessment[[#This Row],[P]]=1,\"a\",IF(Table_RiskAssessment[[#This Row],[W]]=1,\"a\",\"b\")),IF(Table_RiskAssessment[[#This Row],[P]]=1,IF(Table_RiskAssessment[[#This Row],[W]]=1,\"a\",\"b\"),IF(Table_RiskAssessment[[#This Row],[W]]=1,\"b\",\"c\"))),IF(Table_RiskAssessment[[#This Row],[F]]=1,IF(Table_RiskAssessment[[#This Row],[P]]=1,IF(Table_RiskAssessment[[#This Row],[W]]=1,\"b\",\"c\"),IF(Table_RiskAssessment[[#This Row],[W]]=1,\"c\",\"d\")),IF(Table_RiskAssessment[[#This Row],[P]]=1,IF(Table_RiskAssessment[[#This Row],[W]]=1,\"c\",\"d\"),IF(Table_RiskAssessment[[#This Row],[W]]=1,\"d\",\"e\")))),\"?\")","v":"?"},null,null,null,null,null,null,null,null,null,null,null,null,null,null,{"$f":"IF((Table_RiskAssessment[[#This Row],[S2]]* Table_RiskAssessment[[#This Row],[F2]]* Table_RiskAssessment[[#This Row],[P2]]>0),IF(Table_RiskAssessment[[#This Row],[S2]]=1,IF(Table_RiskAssessment[[#This Row],[F2]]=1,IF(Table_RiskAssessment[[#This Row],[P2]]=1,\"a\",IF(Table_RiskAssessment[[#This Row],[W2]]=1,\"a\",\"b\")),IF(Table_RiskAssessment[[#This Row],[P2]]=1,IF(Table_RiskAssessment[[#This Row],[W2]]=1,\"a\",\"b\"),IF(Table_RiskAssessment[[#This Row],[W2]]=1,\"b\",\"c\"))),IF(Table_RiskAssessment[[#This Row],[F2]]=1,IF(Table_RiskAssessment[[#This Row],[P2]]=1,IF(Table_RiskAssessment[[#This Row],[W2]]=1,\"b\",\"c\"),IF(Table_RiskAssessment[[#This Row],[W2]]=1,\"c\",\"d\")),IF(Table_RiskAssessment[[#This Row],[P2]]=1,IF(Table_RiskAssessment[[#This Row],[W2]]=1,\"c\",\"d\"),IF(Table_RiskAssessment[[#This Row],[W2]]=1,\"d\",\"e\")))),\"?\")","v":"?"},null,null,null,"-"]
[null,null,null,"2006 / 42","3.3.5.",{"$f":"Sprache!A$194","v":"Störung des Steuerkreises"},"x","","x",null,null,null,null,null,null,null,null,null,null,null,null,null,null,null,null,null,null,null,null,null,null,null,null,{"$f":"IF((Table_RiskAssessment[[#This Row],[S]]* Table_RiskAssessment[[#This Row],[F]]* Table_RiskAssessment[[#This Row],[P]]>0),IF(Table_RiskAssessment[[#This Row],[S]]=1,IF(Table_RiskAssessment[[#This Row],[F]]=1,IF(Table_RiskAssessment[[#This Row],[P]]=1,\"a\",IF(Table_RiskAssessment[[#This Row],[W]]=1,\"a\",\"b\")),IF(Table_RiskAssessment[[#This Row],[P]]=1,IF(Table_RiskAssessment[[#This Row],[W]]=1,\"a\",\"b\"),IF(Table_RiskAssessment[[#This Row],[W]]=1,\"b\",\"c\"))),IF(Table_RiskAssessment[[#This Row],[F]]=1,IF(Table_RiskAssessment[[#This Row],[P]]=1,IF(Table_RiskAssessment[[#This Row],[W]]=1,\"b\",\"c\"),IF(Table_RiskAssessment[[#This Row],[W]]=1,\"c\",\"d\")),IF(Table_RiskAssessment[[#This Row],[P]]=1,IF(Table_RiskAssessment[[#This Row],[W]]=1,\"c\",\"d\"),IF(Table_RiskAssessment[[#This Row],[W]]=1,\"d\",\"e\")))),\"?\")","v":"?"},null,null,null,null,null,null,null,null,null,null,null,null,null,null,{"$f":"IF((Table_RiskAssessment[[#This Row],[S2]]* Table_RiskAssessment[[#This Row],[F2]]* Table_RiskAssessment[[#This Row],[P2]]>0),IF(Table_RiskAssessment[[#This Row],[S2]]=1,IF(Table_RiskAssessment[[#This Row],[F2]]=1,IF(Table_RiskAssessment[[#This Row],[P2]]=1,\"a\",IF(Table_RiskAssessment[[#This Row],[W2]]=1,\"a\",\"b\")),IF(Table_RiskAssessment[[#This Row],[P2]]=1,IF(Table_RiskAssessment[[#This Row],[W2]]=1,\"a\",\"b\"),IF(Table_RiskAssessment[[#This Row],[W2]]=1,\"b\",\"c\"))),IF(Table_RiskAssessment[[#This Row],[F2]]=1,IF(Table_RiskAssessment[[#This Row],[P2]]=1,IF(Table_RiskAssessment[[#This Row],[W2]]=1,\"b\",\"c\"),IF(Table_RiskAssessment[[#This Row],[W2]]=1,\"c\",\"d\")),IF(Table_RiskAssessment[[#This Row],[P2]]=1,IF(Table_RiskAssessment[[#This Row],[W2]]=1,\"c\",\"d\"),IF(Table_RiskAssessment[[#This Row],[W2]]=1,\"d\",\"e\")))),\"?\")","v":"?"},null,null,null,"-"]
[null,null,null,"2006 / 42","3.4.",{"$f":"Sprache!A$195","v":"Schutzmaßnahmen gegen mechanische Gefährdungen"},"x","x","x",null,null,null,null,null,null,null,null,null,null,null,null,null,null,null,null,null,null,null,null,null,null,null,null,{"$f":"IF((Table_RiskAssessment[[#This Row],[S]]* Table_RiskAssessment[[#This Row],[F]]* Table_RiskAssessment[[#This Row],[P]]>0),IF(Table_RiskAssessment[[#This Row],[S]]=1,IF(Table_RiskAssessment[[#This Row],[F]]=1,IF(Table_RiskAssessment[[#This Row],[P]]=1,\"a\",IF(Table_RiskAssessment[[#This Row],[W]]=1,\"a\",\"b\")),IF(Table_RiskAssessment[[#This Row],[P]]=1,IF(Table_RiskAssessment[[#This Row],[W]]=1,\"a\",\"b\"),IF(Table_RiskAssessment[[#This Row],[W]]=1,\"b\",\"c\"))),IF(Table_RiskAssessment[[#This Row],[F]]=1,IF(Table_RiskAssessment[[#This Row],[P]]=1,IF(Table_RiskAssessment[[#This Row],[W]]=1,\"b\",\"c\"),IF(Table_RiskAssessment[[#This Row],[W]]=1,\"c\",\"d\")),IF(Table_RiskAssessment[[#This Row],[P]]=1,IF(Table_RiskAssessment[[#This Row],[W]]=1,\"c\",\"d\"),IF(Table_RiskAssessment[[#This Row],[W]]=1,\"d\",\"e\")))),\"?\")","v":"?"},null,null,null,null,null,null,null,null,null,null,null,null,null,null,{"$f":"IF((Table_RiskAssessment[[#This Row],[S2]]* Table_RiskAssessment[[#This Row],[F2]]* Table_RiskAssessment[[#This Row],[P2]]>0),IF(Table_RiskAssessment[[#This Row],[S2]]=1,IF(Table_RiskAssessment[[#This Row],[F2]]=1,IF(Table_RiskAssessment[[#This Row],[P2]]=1,\"a\",IF(Table_RiskAssessment[[#This Row],[W2]]=1,\"a\",\"b\")),IF(Table_RiskAssessment[[#This Row],[P2]]=1,IF(Table_RiskAssessment[[#This Row],[W2]]=1,\"a\",\"b\"),IF(Table_RiskAssessment[[#This Row],[W2]]=1,\"b\",\"c\"))),IF(Table_RiskAssessment[[#This Row],[F2]]=1,IF(Table_RiskAssessment[[#This Row],[P2]]=1,IF(Table_RiskAssessment[[#This Row],[W2]]=1,\"b\",\"c\"),IF(Table_RiskAssessment[[#This Row],[W2]]=1,\"c\",\"d\")),IF(Table_RiskAssessment[[#This Row],[P2]]=1,IF(Table_RiskAssessment[[#This Row],[W2]]=1,\"c\",\"d\"),IF(Table_RiskAssessment[[#This Row],[W2]]=1,\"d\",\"e\")))),\"?\")","v":"?"},null,null,null,"-"]
[null,null,null,"2006 / 42","3.4.1.",{"$f":"Sprache!A$196","v":"Unkontrollierte Bewegungen"},"x","","x",null,null,null,null,null,null,null,null,null,null,null,null,null,null,null,null,null,null,null,null,null,null,null,null,{"$f":"IF((Table_RiskAssessment[[#This Row],[S]]* Table_RiskAssessment[[#This Row],[F]]* Table_RiskAssessment[[#This Row],[P]]>0),IF(Table_RiskAssessment[[#This Row],[S]]=1,IF(Table_RiskAssessment[[#This Row],[F]]=1,IF(Table_RiskAssessment[[#This Row],[P]]=1,\"a\",IF(Table_RiskAssessment[[#This Row],[W]]=1,\"a\",\"b\")),IF(Table_RiskAssessment[[#This Row],[P]]=1,IF(Table_RiskAssessment[[#This Row],[W]]=1,\"a\",\"b\"),IF(Table_RiskAssessment[[#This Row],[W]]=1,\"b\",\"c\"))),IF(Table_RiskAssessment[[#This Row],[F]]=1,IF(Table_RiskAssessment[[#This Row],[P]]=1,IF(Table_RiskAssessment[[#This Row],[W]]=1,\"b\",\"c\"),IF(Table_RiskAssessment[[#This Row],[W]]=1,\"c\",\"d\")),IF(Table_RiskAssessment[[#This Row],[P]]=1,IF(Table_RiskAssessment[[#This Row],[W]]=1,\"c\",\"d\"),IF(Table_RiskAssessment[[#This Row],[W]]=1,\"d\",\"e\")))),\"?\")","v":"?"},null,null,null,null,null,null,null,null,null,null,null,null,null,null,{"$f":"IF((Table_RiskAssessment[[#This Row],[S2]]* Table_RiskAssessment[[#This Row],[F2]]* Table_RiskAssessment[[#This Row],[P2]]>0),IF(Table_RiskAssessment[[#This Row],[S2]]=1,IF(Table_RiskAssessment[[#This Row],[F2]]=1,IF(Table_RiskAssessment[[#This Row],[P2]]=1,\"a\",IF(Table_RiskAssessment[[#This Row],[W2]]=1,\"a\",\"b\")),IF(Table_RiskAssessment[[#This Row],[P2]]=1,IF(Table_RiskAssessment[[#This Row],[W2]]=1,\"a\",\"b\"),IF(Table_RiskAssessment[[#This Row],[W2]]=1,\"b\",\"c\"))),IF(Table_RiskAssessment[[#This Row],[F2]]=1,IF(Table_RiskAssessment[[#This Row],[P2]]=1,IF(Table_RiskAssessment[[#This Row],[W2]]=1,\"b\",\"c\"),IF(Table_RiskAssessment[[#This Row],[W2]]=1,\"c\",\"d\")),IF(Table_RiskAssessment[[#This Row],[P2]]=1,IF(Table_RiskAssessment[[#This Row],[W2]]=1,\"c\",\"d\"),IF(Table_RiskAssessment[[#This Row],[W2]]=1,\"d\",\"e\")))),\"?\")","v":"?"},null,null,null,"-"]
[null,null,null,"2006 / 42","3.4.2.",{"$f":"Sprache!A$197","v":"Bewegliche Übertragungselemente"},"x","","x",null,null,null,null,null,null,null,null,null,null,null,null,null,null,null,null,null,null,null,null,null,null,null,null,{"$f":"IF((Table_RiskAssessment[[#This Row],[S]]* Table_RiskAssessment[[#This Row],[F]]* Table_RiskAssessment[[#This Row],[P]]>0),IF(Table_RiskAssessment[[#This Row],[S]]=1,IF(Table_RiskAssessment[[#This Row],[F]]=1,IF(Table_RiskAssessment[[#This Row],[P]]=1,\"a\",IF(Table_RiskAssessment[[#This Row],[W]]=1,\"a\",\"b\")),IF(Table_RiskAssessment[[#This Row],[P]]=1,IF(Table_RiskAssessment[[#This Row],[W]]=1,\"a\",\"b\"),IF(Table_RiskAssessment[[#This Row],[W]]=1,\"b\",\"c\"))),IF(Table_RiskAssessment[[#This Row],[F]]=1,IF(Table_RiskAssessment[[#This Row],[P]]=1,IF(Table_RiskAssessment[[#This Row],[W]]=1,\"b\",\"c\"),IF(Table_RiskAssessment[[#This Row],[W]]=1,\"c\",\"d\")),IF(Table_RiskAssessment[[#This Row],[P]]=1,IF(Table_RiskAssessment[[#This Row],[W]]=1,\"c\",\"d\"),IF(Table_RiskAssessment[[#This Row],[W]]=1,\"d\",\"e\")))),\"?\")","v":"?"},null,null,null,null,null,null,null,null,null,null,null,null,null,null,{"$f":"IF((Table_RiskAssessment[[#This Row],[S2]]* Table_RiskAssessment[[#This Row],[F2]]* Table_RiskAssessment[[#This Row],[P2]]>0),IF(Table_RiskAssessment[[#This Row],[S2]]=1,IF(Table_RiskAssessment[[#This Row],[F2]]=1,IF(Table_RiskAssessment[[#This Row],[P2]]=1,\"a\",IF(Table_RiskAssessment[[#This Row],[W2]]=1,\"a\",\"b\")),IF(Table_RiskAssessment[[#This Row],[P2]]=1,IF(Table_RiskAssessment[[#This Row],[W2]]=1,\"a\",\"b\"),IF(Table_RiskAssessment[[#This Row],[W2]]=1,\"b\",\"c\"))),IF(Table_RiskAssessment[[#This Row],[F2]]=1,IF(Table_RiskAssessment[[#This Row],[P2]]=1,IF(Table_RiskAssessment[[#This Row],[W2]]=1,\"b\",\"c\"),IF(Table_RiskAssessment[[#This Row],[W2]]=1,\"c\",\"d\")),IF(Table_RiskAssessment[[#This Row],[P2]]=1,IF(Table_RiskAssessment[[#This Row],[W2]]=1,\"c\",\"d\"),IF(Table_RiskAssessment[[#This Row],[W2]]=1,\"d\",\"e\")))),\"?\")","v":"?"},null,null,null,"-"]
[null,null,null,"2006 / 42","3.4.3.",{"$f":"Sprache!A$198","v":"Überrollen und Umkippen"},"x","","x",null,null,null,null,null,null,null,null,null,null,null,null,null,null,null,null,null,null,null,null,null,null,null,null,{"$f":"IF((Table_RiskAssessment[[#This Row],[S]]* Table_RiskAssessment[[#This Row],[F]]* Table_RiskAssessment[[#This Row],[P]]>0),IF(Table_RiskAssessment[[#This Row],[S]]=1,IF(Table_RiskAssessment[[#This Row],[F]]=1,IF(Table_RiskAssessment[[#This Row],[P]]=1,\"a\",IF(Table_RiskAssessment[[#This Row],[W]]=1,\"a\",\"b\")),IF(Table_RiskAssessment[[#This Row],[P]]=1,IF(Table_RiskAssessment[[#This Row],[W]]=1,\"a\",\"b\"),IF(Table_RiskAssessment[[#This Row],[W]]=1,\"b\",\"c\"))),IF(Table_RiskAssessment[[#This Row],[F]]=1,IF(Table_RiskAssessment[[#This Row],[P]]=1,IF(Table_RiskAssessment[[#This Row],[W]]=1,\"b\",\"c\"),IF(Table_RiskAssessment[[#This Row],[W]]=1,\"c\",\"d\")),IF(Table_RiskAssessment[[#This Row],[P]]=1,IF(Table_RiskAssessment[[#This Row],[W]]=1,\"c\",\"d\"),IF(Table_RiskAssessment[[#This Row],[W]]=1,\"d\",\"e\")))),\"?\")","v":"?"},null,null,null,null,null,null,null,null,null,null,null,null,null,null,{"$f":"IF((Table_RiskAssessment[[#This Row],[S2]]* Table_RiskAssessment[[#This Row],[F2]]* Table_RiskAssessment[[#This Row],[P2]]>0),IF(Table_RiskAssessment[[#This Row],[S2]]=1,IF(Table_RiskAssessment[[#This Row],[F2]]=1,IF(Table_RiskAssessment[[#This Row],[P2]]=1,\"a\",IF(Table_RiskAssessment[[#This Row],[W2]]=1,\"a\",\"b\")),IF(Table_RiskAssessment[[#This Row],[P2]]=1,IF(Table_RiskAssessment[[#This Row],[W2]]=1,\"a\",\"b\"),IF(Table_RiskAssessment[[#This Row],[W2]]=1,\"b\",\"c\"))),IF(Table_RiskAssessment[[#This Row],[F2]]=1,IF(Table_RiskAssessment[[#This Row],[P2]]=1,IF(Table_RiskAssessment[[#This Row],[W2]]=1,\"b\",\"c\"),IF(Table_RiskAssessment[[#This Row],[W2]]=1,\"c\",\"d\")),IF(Table_RiskAssessment[[#This Row],[P2]]=1,IF(Table_RiskAssessment[[#This Row],[W2]]=1,\"c\",\"d\"),IF(Table_RiskAssessment[[#This Row],[W2]]=1,\"d\",\"e\")))),\"?\")","v":"?"},null,null,null,"-"]
[null,null,null,"2006 / 42","3.4.4.",{"$f":"Sprache!A$199","v":"Herabfallende Gegenstände"},"x","","x",null,null,null,null,null,null,null,null,null,null,null,null,null,null,null,null,null,null,null,null,null,null,null,null,{"$f":"IF((Table_RiskAssessment[[#This Row],[S]]* Table_RiskAssessment[[#This Row],[F]]* Table_RiskAssessment[[#This Row],[P]]>0),IF(Table_RiskAssessment[[#This Row],[S]]=1,IF(Table_RiskAssessment[[#This Row],[F]]=1,IF(Table_RiskAssessment[[#This Row],[P]]=1,\"a\",IF(Table_RiskAssessment[[#This Row],[W]]=1,\"a\",\"b\")),IF(Table_RiskAssessment[[#This Row],[P]]=1,IF(Table_RiskAssessment[[#This Row],[W]]=1,\"a\",\"b\"),IF(Table_RiskAssessment[[#This Row],[W]]=1,\"b\",\"c\"))),IF(Table_RiskAssessment[[#This Row],[F]]=1,IF(Table_RiskAssessment[[#This Row],[P]]=1,IF(Table_RiskAssessment[[#This Row],[W]]=1,\"b\",\"c\"),IF(Table_RiskAssessment[[#This Row],[W]]=1,\"c\",\"d\")),IF(Table_RiskAssessment[[#This Row],[P]]=1,IF(Table_RiskAssessment[[#This Row],[W]]=1,\"c\",\"d\"),IF(Table_RiskAssessment[[#This Row],[W]]=1,\"d\",\"e\")))),\"?\")","v":"?"},null,null,null,null,null,null,null,null,null,null,null,null,null,null,{"$f":"IF((Table_RiskAssessment[[#This Row],[S2]]* Table_RiskAssessment[[#This Row],[F2]]* Table_RiskAssessment[[#This Row],[P2]]>0),IF(Table_RiskAssessment[[#This Row],[S2]]=1,IF(Table_RiskAssessment[[#This Row],[F2]]=1,IF(Table_RiskAssessment[[#This Row],[P2]]=1,\"a\",IF(Table_RiskAssessment[[#This Row],[W2]]=1,\"a\",\"b\")),IF(Table_RiskAssessment[[#This Row],[P2]]=1,IF(Table_RiskAssessment[[#This Row],[W2]]=1,\"a\",\"b\"),IF(Table_RiskAssessment[[#This Row],[W2]]=1,\"b\",\"c\"))),IF(Table_RiskAssessment[[#This Row],[F2]]=1,IF(Table_RiskAssessment[[#This Row],[P2]]=1,IF(Table_RiskAssessment[[#This Row],[W2]]=1,\"b\",\"c\"),IF(Table_RiskAssessment[[#This Row],[W2]]=1,\"c\",\"d\")),IF(Table_RiskAssessment[[#This Row],[P2]]=1,IF(Table_RiskAssessment[[#This Row],[W2]]=1,\"c\",\"d\"),IF(Table_RiskAssessment[[#This Row],[W2]]=1,\"d\",\"e\")))),\"?\")","v":"?"},null,null,null,"-"]
[null,null,null,"2006 / 42","3.4.5.",{"$f":"Sprache!A$200","v":"Zugänge"},"x","","x",null,null,null,null,null,null,null,null,null,null,null,null,null,null,null,null,null,null,null,null,null,null,null,null,{"$f":"IF((Table_RiskAssessment[[#This Row],[S]]* Table_RiskAssessment[[#This Row],[F]]* Table_RiskAssessment[[#This Row],[P]]>0),IF(Table_RiskAssessment[[#This Row],[S]]=1,IF(Table_RiskAssessment[[#This Row],[F]]=1,IF(Table_RiskAssessment[[#This Row],[P]]=1,\"a\",IF(Table_RiskAssessment[[#This Row],[W]]=1,\"a\",\"b\")),IF(Table_RiskAssessment[[#This Row],[P]]=1,IF(Table_RiskAssessment[[#This Row],[W]]=1,\"a\",\"b\"),IF(Table_RiskAssessment[[#This Row],[W]]=1,\"b\",\"c\"))),IF(Table_RiskAssessment[[#This Row],[F]]=1,IF(Table_RiskAssessment[[#This Row],[P]]=1,IF(Table_RiskAssessment[[#This Row],[W]]=1,\"b\",\"c\"),IF(Table_RiskAssessment[[#This Row],[W]]=1,\"c\",\"d\")),IF(Table_RiskAssessment[[#This Row],[P]]=1,IF(Table_RiskAssessment[[#This Row],[W]]=1,\"c\",\"d\"),IF(Table_RiskAssessment[[#This Row],[W]]=1,\"d\",\"e\")))),\"?\")","v":"?"},null,null,null,null,null,null,null,null,null,null,null,null,null,null,{"$f":"IF((Table_RiskAssessment[[#This Row],[S2]]* Table_RiskAssessment[[#This Row],[F2]]* Table_RiskAssessment[[#This Row],[P2]]>0),IF(Table_RiskAssessment[[#This Row],[S2]]=1,IF(Table_RiskAssessment[[#This Row],[F2]]=1,IF(Table_RiskAssessment[[#This Row],[P2]]=1,\"a\",IF(Table_RiskAssessment[[#This Row],[W2]]=1,\"a\",\"b\")),IF(Table_RiskAssessment[[#This Row],[P2]]=1,IF(Table_RiskAssessment[[#This Row],[W2]]=1,\"a\",\"b\"),IF(Table_RiskAssessment[[#This Row],[W2]]=1,\"b\",\"c\"))),IF(Table_RiskAssessment[[#This Row],[F2]]=1,IF(Table_RiskAssessment[[#This Row],[P2]]=1,IF(Table_RiskAssessment[[#This Row],[W2]]=1,\"b\",\"c\"),IF(Table_RiskAssessment[[#This Row],[W2]]=1,\"c\",\"d\")),IF(Table_RiskAssessment[[#This Row],[P2]]=1,IF(Table_RiskAssessment[[#This Row],[W2]]=1,\"c\",\"d\"),IF(Table_RiskAssessment[[#This Row],[W2]]=1,\"d\",\"e\")))),\"?\")","v":"?"},null,null,null,"-"]
[null,null,null,"2006 / 42","3.4.6.",{"$f":"Sprache!A$201","v":"Anhängevorrichtungen"},"x","","x",null,null,null,null,null,null,null,null,null,null,null,null,null,null,null,null,null,null,null,null,null,null,null,null,{"$f":"IF((Table_RiskAssessment[[#This Row],[S]]* Table_RiskAssessment[[#This Row],[F]]* Table_RiskAssessment[[#This Row],[P]]>0),IF(Table_RiskAssessment[[#This Row],[S]]=1,IF(Table_RiskAssessment[[#This Row],[F]]=1,IF(Table_RiskAssessment[[#This Row],[P]]=1,\"a\",IF(Table_RiskAssessment[[#This Row],[W]]=1,\"a\",\"b\")),IF(Table_RiskAssessment[[#This Row],[P]]=1,IF(Table_RiskAssessment[[#This Row],[W]]=1,\"a\",\"b\"),IF(Table_RiskAssessment[[#This Row],[W]]=1,\"b\",\"c\"))),IF(Table_RiskAssessment[[#This Row],[F]]=1,IF(Table_RiskAssessment[[#This Row],[P]]=1,IF(Table_RiskAssessment[[#This Row],[W]]=1,\"b\",\"c\"),IF(Table_RiskAssessment[[#This Row],[W]]=1,\"c\",\"d\")),IF(Table_RiskAssessment[[#This Row],[P]]=1,IF(Table_RiskAssessment[[#This Row],[W]]=1,\"c\",\"d\"),IF(Table_RiskAssessment[[#This Row],[W]]=1,\"d\",\"e\")))),\"?\")","v":"?"},null,null,null,null,null,null,null,null,null,null,null,null,null,null,{"$f":"IF((Table_RiskAssessment[[#This Row],[S2]]* Table_RiskAssessment[[#This Row],[F2]]* Table_RiskAssessment[[#This Row],[P2]]>0),IF(Table_RiskAssessment[[#This Row],[S2]]=1,IF(Table_RiskAssessment[[#This Row],[F2]]=1,IF(Table_RiskAssessment[[#This Row],[P2]]=1,\"a\",IF(Table_RiskAssessment[[#This Row],[W2]]=1,\"a\",\"b\")),IF(Table_RiskAssessment[[#This Row],[P2]]=1,IF(Table_RiskAssessment[[#This Row],[W2]]=1,\"a\",\"b\"),IF(Table_RiskAssessment[[#This Row],[W2]]=1,\"b\",\"c\"))),IF(Table_RiskAssessment[[#This Row],[F2]]=1,IF(Table_RiskAssessment[[#This Row],[P2]]=1,IF(Table_RiskAssessment[[#This Row],[W2]]=1,\"b\",\"c\"),IF(Table_RiskAssessment[[#This Row],[W2]]=1,\"c\",\"d\")),IF(Table_RiskAssessment[[#This Row],[P2]]=1,IF(Table_RiskAssessment[[#This Row],[W2]]=1,\"c\",\"d\"),IF(Table_RiskAssessment[[#This Row],[W2]]=1,\"d\",\"e\")))),\"?\")","v":"?"},null,null,null,"-"]
[null,null,null,"2006 / 42","3.4.7.",{"$f":"Sprache!A$202","v":"Kraftübertragung zwischen einer selbstfahrenden Maschine (oder einer Zugmaschine) und einer angetriebenen Maschine"},"x","","x",null,null,null,null,null,null,null,null,null,null,null,null,null,null,null,null,null,null,null,null,null,null,null,null,{"$f":"IF((Table_RiskAssessment[[#This Row],[S]]* Table_RiskAssessment[[#This Row],[F]]* Table_RiskAssessment[[#This Row],[P]]>0),IF(Table_RiskAssessment[[#This Row],[S]]=1,IF(Table_RiskAssessment[[#This Row],[F]]=1,IF(Table_RiskAssessment[[#This Row],[P]]=1,\"a\",IF(Table_RiskAssessment[[#This Row],[W]]=1,\"a\",\"b\")),IF(Table_RiskAssessment[[#This Row],[P]]=1,IF(Table_RiskAssessment[[#This Row],[W]]=1,\"a\",\"b\"),IF(Table_RiskAssessment[[#This Row],[W]]=1,\"b\",\"c\"))),IF(Table_RiskAssessment[[#This Row],[F]]=1,IF(Table_RiskAssessment[[#This Row],[P]]=1,IF(Table_RiskAssessment[[#This Row],[W]]=1,\"b\",\"c\"),IF(Table_RiskAssessment[[#This Row],[W]]=1,\"c\",\"d\")),IF(Table_RiskAssessment[[#This Row],[P]]=1,IF(Table_RiskAssessment[[#This Row],[W]]=1,\"c\",\"d\"),IF(Table_RiskAssessment[[#This Row],[W]]=1,\"d\",\"e\")))),\"?\")","v":"?"},null,null,null,null,null,null,null,null,null,null,null,null,null,null,{"$f":"IF((Table_RiskAssessment[[#This Row],[S2]]* Table_RiskAssessment[[#This Row],[F2]]* Table_RiskAssessment[[#This Row],[P2]]>0),IF(Table_RiskAssessment[[#This Row],[S2]]=1,IF(Table_RiskAssessment[[#This Row],[F2]]=1,IF(Table_RiskAssessment[[#This Row],[P2]]=1,\"a\",IF(Table_RiskAssessment[[#This Row],[W2]]=1,\"a\",\"b\")),IF(Table_RiskAssessment[[#This Row],[P2]]=1,IF(Table_RiskAssessment[[#This Row],[W2]]=1,\"a\",\"b\"),IF(Table_RiskAssessment[[#This Row],[W2]]=1,\"b\",\"c\"))),IF(Table_RiskAssessment[[#This Row],[F2]]=1,IF(Table_RiskAssessment[[#This Row],[P2]]=1,IF(Table_RiskAssessment[[#This Row],[W2]]=1,\"b\",\"c\"),IF(Table_RiskAssessment[[#This Row],[W2]]=1,\"c\",\"d\")),IF(Table_RiskAssessment[[#This Row],[P2]]=1,IF(Table_RiskAssessment[[#This Row],[W2]]=1,\"c\",\"d\"),IF(Table_RiskAssessment[[#This Row],[W2]]=1,\"d\",\"e\")))),\"?\")","v":"?"},null,null,null,"-"]
[null,null,null,"2006 / 42","3.5.",{"$f":"Sprache!A$203","v":"Schutzmaßnahmen gegen sonstige Gefährdungen"},"x","x","x",null,null,null,null,null,null,null,null,null,null,null,null,null,null,null,null,null,null,null,null,null,null,null,null,{"$f":"IF((Table_RiskAssessment[[#This Row],[S]]* Table_RiskAssessment[[#This Row],[F]]* Table_RiskAssessment[[#This Row],[P]]>0),IF(Table_RiskAssessment[[#This Row],[S]]=1,IF(Table_RiskAssessment[[#This Row],[F]]=1,IF(Table_RiskAssessment[[#This Row],[P]]=1,\"a\",IF(Table_RiskAssessment[[#This Row],[W]]=1,\"a\",\"b\")),IF(Table_RiskAssessment[[#This Row],[P]]=1,IF(Table_RiskAssessment[[#This Row],[W]]=1,\"a\",\"b\"),IF(Table_RiskAssessment[[#This Row],[W]]=1,\"b\",\"c\"))),IF(Table_RiskAssessment[[#This Row],[F]]=1,IF(Table_RiskAssessment[[#This Row],[P]]=1,IF(Table_RiskAssessment[[#This Row],[W]]=1,\"b\",\"c\"),IF(Table_RiskAssessment[[#This Row],[W]]=1,\"c\",\"d\")),IF(Table_RiskAssessment[[#This Row],[P]]=1,IF(Table_RiskAssessment[[#This Row],[W]]=1,\"c\",\"d\"),IF(Table_RiskAssessment[[#This Row],[W]]=1,\"d\",\"e\")))),\"?\")","v":"?"},null,null,null,null,null,null,null,null,null,null,null,null,null,null,{"$f":"IF((Table_RiskAssessment[[#This Row],[S2]]* Table_RiskAssessment[[#This Row],[F2]]* Table_RiskAssessment[[#This Row],[P2]]>0),IF(Table_RiskAssessment[[#This Row],[S2]]=1,IF(Table_RiskAssessment[[#This Row],[F2]]=1,IF(Table_RiskAssessment[[#This Row],[P2]]=1,\"a\",IF(Table_RiskAssessment[[#This Row],[W2]]=1,\"a\",\"b\")),IF(Table_RiskAssessment[[#This Row],[P2]]=1,IF(Table_RiskAssessment[[#This Row],[W2]]=1,\"a\",\"b\"),IF(Table_RiskAssessment[[#This Row],[W2]]=1,\"b\",\"c\"))),IF(Table_RiskAssessment[[#This Row],[F2]]=1,IF(Table_RiskAssessment[[#This Row],[P2]]=1,IF(Table_RiskAssessment[[#This Row],[W2]]=1,\"b\",\"c\"),IF(Table_RiskAssessment[[#This Row],[W2]]=1,\"c\",\"d\")),IF(Table_RiskAssessment[[#This Row],[P2]]=1,IF(Table_RiskAssessment[[#This Row],[W2]]=1,\"c\",\"d\"),IF(Table_RiskAssessment[[#This Row],[W2]]=1,\"d\",\"e\")))),\"?\")","v":"?"},null,null,null,"-"]
[null,null,null,"2006 / 42","3.5.1.",{"$f":"Sprache!A$204","v":"Batterien"},"x","","x",null,null,null,null,null,null,null,null,null,null,null,null,null,null,null,null,null,null,null,null,null,null,null,null,{"$f":"IF((Table_RiskAssessment[[#This Row],[S]]* Table_RiskAssessment[[#This Row],[F]]* Table_RiskAssessment[[#This Row],[P]]>0),IF(Table_RiskAssessment[[#This Row],[S]]=1,IF(Table_RiskAssessment[[#This Row],[F]]=1,IF(Table_RiskAssessment[[#This Row],[P]]=1,\"a\",IF(Table_RiskAssessment[[#This Row],[W]]=1,\"a\",\"b\")),IF(Table_RiskAssessment[[#This Row],[P]]=1,IF(Table_RiskAssessment[[#This Row],[W]]=1,\"a\",\"b\"),IF(Table_RiskAssessment[[#This Row],[W]]=1,\"b\",\"c\"))),IF(Table_RiskAssessment[[#This Row],[F]]=1,IF(Table_RiskAssessment[[#This Row],[P]]=1,IF(Table_RiskAssessment[[#This Row],[W]]=1,\"b\",\"c\"),IF(Table_RiskAssessment[[#This Row],[W]]=1,\"c\",\"d\")),IF(Table_RiskAssessment[[#This Row],[P]]=1,IF(Table_RiskAssessment[[#This Row],[W]]=1,\"c\",\"d\"),IF(Table_RiskAssessment[[#This Row],[W]]=1,\"d\",\"e\")))),\"?\")","v":"?"},null,null,null,null,null,null,null,null,null,null,null,null,null,null,{"$f":"IF((Table_RiskAssessment[[#This Row],[S2]]* Table_RiskAssessment[[#This Row],[F2]]* Table_RiskAssessment[[#This Row],[P2]]>0),IF(Table_RiskAssessment[[#This Row],[S2]]=1,IF(Table_RiskAssessment[[#This Row],[F2]]=1,IF(Table_RiskAssessment[[#This Row],[P2]]=1,\"a\",IF(Table_RiskAssessment[[#This Row],[W2]]=1,\"a\",\"b\")),IF(Table_RiskAssessment[[#This Row],[P2]]=1,IF(Table_RiskAssessment[[#This Row],[W2]]=1,\"a\",\"b\"),IF(Table_RiskAssessment[[#This Row],[W2]]=1,\"b\",\"c\"))),IF(Table_RiskAssessment[[#This Row],[F2]]=1,IF(Table_RiskAssessment[[#This Row],[P2]]=1,IF(Table_RiskAssessment[[#This Row],[W2]]=1,\"b\",\"c\"),IF(Table_RiskAssessment[[#This Row],[W2]]=1,\"c\",\"d\")),IF(Table_RiskAssessment[[#This Row],[P2]]=1,IF(Table_RiskAssessment[[#This Row],[W2]]=1,\"c\",\"d\"),IF(Table_RiskAssessment[[#This Row],[W2]]=1,\"d\",\"e\")))),\"?\")","v":"?"},null,null,null,"-"]
[null,null,null,"2006 / 42","3.5.2.",{"$f":"Sprache!A$205","v":"Brand"},"x","","x",null,null,null,null,null,null,null,null,null,null,null,null,null,null,null,null,null,null,null,null,null,null,null,null,{"$f":"IF((Table_RiskAssessment[[#This Row],[S]]* Table_RiskAssessment[[#This Row],[F]]* Table_RiskAssessment[[#This Row],[P]]>0),IF(Table_RiskAssessment[[#This Row],[S]]=1,IF(Table_RiskAssessment[[#This Row],[F]]=1,IF(Table_RiskAssessment[[#This Row],[P]]=1,\"a\",IF(Table_RiskAssessment[[#This Row],[W]]=1,\"a\",\"b\")),IF(Table_RiskAssessment[[#This Row],[P]]=1,IF(Table_RiskAssessment[[#This Row],[W]]=1,\"a\",\"b\"),IF(Table_RiskAssessment[[#This Row],[W]]=1,\"b\",\"c\"))),IF(Table_RiskAssessment[[#This Row],[F]]=1,IF(Table_RiskAssessment[[#This Row],[P]]=1,IF(Table_RiskAssessment[[#This Row],[W]]=1,\"b\",\"c\"),IF(Table_RiskAssessment[[#This Row],[W]]=1,\"c\",\"d\")),IF(Table_RiskAssessment[[#This Row],[P]]=1,IF(Table_RiskAssessment[[#This Row],[W]]=1,\"c\",\"d\"),IF(Table_RiskAssessment[[#This Row],[W]]=1,\"d\",\"e\")))),\"?\")","v":"?"},null,null,null,null,null,null,null,null,null,null,null,null,null,null,{"$f":"IF((Table_RiskAssessment[[#This Row],[S2]]* Table_RiskAssessment[[#This Row],[F2]]* Table_RiskAssessment[[#This Row],[P2]]>0),IF(Table_RiskAssessment[[#This Row],[S2]]=1,IF(Table_RiskAssessment[[#This Row],[F2]]=1,IF(Table_RiskAssessment[[#This Row],[P2]]=1,\"a\",IF(Table_RiskAssessment[[#This Row],[W2]]=1,\"a\",\"b\")),IF(Table_RiskAssessment[[#This Row],[P2]]=1,IF(Table_RiskAssessment[[#This Row],[W2]]=1,\"a\",\"b\"),IF(Table_RiskAssessment[[#This Row],[W2]]=1,\"b\",\"c\"))),IF(Table_RiskAssessment[[#This Row],[F2]]=1,IF(Table_RiskAssessment[[#This Row],[P2]]=1,IF(Table_RiskAssessment[[#This Row],[W2]]=1,\"b\",\"c\"),IF(Table_RiskAssessment[[#This Row],[W2]]=1,\"c\",\"d\")),IF(Table_RiskAssessment[[#This Row],[P2]]=1,IF(Table_RiskAssessment[[#This Row],[W2]]=1,\"c\",\"d\"),IF(Table_RiskAssessment[[#This Row],[W2]]=1,\"d\",\"e\")))),\"?\")","v":"?"},null,null,null,"-"]
[null,null,null,"2006 / 42","3.5.3.",{"$f":"Sprache!A$206","v":"Emission von gefährlichen Stoffen"},"x","","x",null,null,null,null,null,null,null,null,null,null,null,null,null,null,null,null,null,null,null,null,null,null,null,null,{"$f":"IF((Table_RiskAssessment[[#This Row],[S]]* Table_RiskAssessment[[#This Row],[F]]* Table_RiskAssessment[[#This Row],[P]]>0),IF(Table_RiskAssessment[[#This Row],[S]]=1,IF(Table_RiskAssessment[[#This Row],[F]]=1,IF(Table_RiskAssessment[[#This Row],[P]]=1,\"a\",IF(Table_RiskAssessment[[#This Row],[W]]=1,\"a\",\"b\")),IF(Table_RiskAssessment[[#This Row],[P]]=1,IF(Table_RiskAssessment[[#This Row],[W]]=1,\"a\",\"b\"),IF(Table_RiskAssessment[[#This Row],[W]]=1,\"b\",\"c\"))),IF(Table_RiskAssessment[[#This Row],[F]]=1,IF(Table_RiskAssessment[[#This Row],[P]]=1,IF(Table_RiskAssessment[[#This Row],[W]]=1,\"b\",\"c\"),IF(Table_RiskAssessment[[#This Row],[W]]=1,\"c\",\"d\")),IF(Table_RiskAssessment[[#This Row],[P]]=1,IF(Table_RiskAssessment[[#This Row],[W]]=1,\"c\",\"d\"),IF(Table_RiskAssessment[[#This Row],[W]]=1,\"d\",\"e\")))),\"?\")","v":"?"},null,null,null,null,null,null,null,null,null,null,null,null,null,null,{"$f":"IF((Table_RiskAssessment[[#This Row],[S2]]* Table_RiskAssessment[[#This Row],[F2]]* Table_RiskAssessment[[#This Row],[P2]]>0),IF(Table_RiskAssessment[[#This Row],[S2]]=1,IF(Table_RiskAssessment[[#This Row],[F2]]=1,IF(Table_RiskAssessment[[#This Row],[P2]]=1,\"a\",IF(Table_RiskAssessment[[#This Row],[W2]]=1,\"a\",\"b\")),IF(Table_RiskAssessment[[#This Row],[P2]]=1,IF(Table_RiskAssessment[[#This Row],[W2]]=1,\"a\",\"b\"),IF(Table_RiskAssessment[[#This Row],[W2]]=1,\"b\",\"c\"))),IF(Table_RiskAssessment[[#This Row],[F2]]=1,IF(Table_RiskAssessment[[#This Row],[P2]]=1,IF(Table_RiskAssessment[[#This Row],[W2]]=1,\"b\",\"c\"),IF(Table_RiskAssessment[[#This Row],[W2]]=1,\"c\",\"d\")),IF(Table_RiskAssessment[[#This Row],[P2]]=1,IF(Table_RiskAssessment[[#This Row],[W2]]=1,\"c\",\"d\"),IF(Table_RiskAssessment[[#This Row],[W2]]=1,\"d\",\"e\")))),\"?\")","v":"?"},null,null,null,"-"]
[null,null,null,"2006 / 42","3.6.",{"$f":"Sprache!A$207","v":"Informationen und Angaben"},"x","x","x",null,null,null,null,null,null,null,null,null,null,null,null,null,null,null,null,null,null,null,null,null,null,null,null,{"$f":"IF((Table_RiskAssessment[[#This Row],[S]]* Table_RiskAssessment[[#This Row],[F]]* Table_RiskAssessment[[#This Row],[P]]>0),IF(Table_RiskAssessment[[#This Row],[S]]=1,IF(Table_RiskAssessment[[#This Row],[F]]=1,IF(Table_RiskAssessment[[#This Row],[P]]=1,\"a\",IF(Table_RiskAssessment[[#This Row],[W]]=1,\"a\",\"b\")),IF(Table_RiskAssessment[[#This Row],[P]]=1,IF(Table_RiskAssessment[[#This Row],[W]]=1,\"a\",\"b\"),IF(Table_RiskAssessment[[#This Row],[W]]=1,\"b\",\"c\"))),IF(Table_RiskAssessment[[#This Row],[F]]=1,IF(Table_RiskAssessment[[#This Row],[P]]=1,IF(Table_RiskAssessment[[#This Row],[W]]=1,\"b\",\"c\"),IF(Table_RiskAssessment[[#This Row],[W]]=1,\"c\",\"d\")),IF(Table_RiskAssessment[[#This Row],[P]]=1,IF(Table_RiskAssessment[[#This Row],[W]]=1,\"c\",\"d\"),IF(Table_RiskAssessment[[#This Row],[W]]=1,\"d\",\"e\")))),\"?\")","v":"?"},null,null,null,null,null,null,null,null,null,null,null,null,null,null,{"$f":"IF((Table_RiskAssessment[[#This Row],[S2]]* Table_RiskAssessment[[#This Row],[F2]]* Table_RiskAssessment[[#This Row],[P2]]>0),IF(Table_RiskAssessment[[#This Row],[S2]]=1,IF(Table_RiskAssessment[[#This Row],[F2]]=1,IF(Table_RiskAssessment[[#This Row],[P2]]=1,\"a\",IF(Table_RiskAssessment[[#This Row],[W2]]=1,\"a\",\"b\")),IF(Table_RiskAssessment[[#This Row],[P2]]=1,IF(Table_RiskAssessment[[#This Row],[W2]]=1,\"a\",\"b\"),IF(Table_RiskAssessment[[#This Row],[W2]]=1,\"b\",\"c\"))),IF(Table_RiskAssessment[[#This Row],[F2]]=1,IF(Table_RiskAssessment[[#This Row],[P2]]=1,IF(Table_RiskAssessment[[#This Row],[W2]]=1,\"b\",\"c\"),IF(Table_RiskAssessment[[#This Row],[W2]]=1,\"c\",\"d\")),IF(Table_RiskAssessment[[#This Row],[P2]]=1,IF(Table_RiskAssessment[[#This Row],[W2]]=1,\"c\",\"d\"),IF(Table_RiskAssessment[[#This Row],[W2]]=1,\"d\",\"e\")))),\"?\")","v":"?"},null,null,null,"-"]
[null,null,null,"2006 / 42","3.6.1.",{"$f":"Sprache!A$208","v":"Zeichen, Signaleinrichtungen und Warnhinweise"},"x","","x",null,null,null,null,null,null,null,null,null,null,null,null,null,null,null,null,null,null,null,null,null,null,null,null,{"$f":"IF((Table_RiskAssessment[[#This Row],[S]]* Table_RiskAssessment[[#This Row],[F]]* Table_RiskAssessment[[#This Row],[P]]>0),IF(Table_RiskAssessment[[#This Row],[S]]=1,IF(Table_RiskAssessment[[#This Row],[F]]=1,IF(Table_RiskAssessment[[#This Row],[P]]=1,\"a\",IF(Table_RiskAssessment[[#This Row],[W]]=1,\"a\",\"b\")),IF(Table_RiskAssessment[[#This Row],[P]]=1,IF(Table_RiskAssessment[[#This Row],[W]]=1,\"a\",\"b\"),IF(Table_RiskAssessment[[#This Row],[W]]=1,\"b\",\"c\"))),IF(Table_RiskAssessment[[#This Row],[F]]=1,IF(Table_RiskAssessment[[#This Row],[P]]=1,IF(Table_RiskAssessment[[#This Row],[W]]=1,\"b\",\"c\"),IF(Table_RiskAssessment[[#This Row],[W]]=1,\"c\",\"d\")),IF(Table_RiskAssessment[[#This Row],[P]]=1,IF(Table_RiskAssessment[[#This Row],[W]]=1,\"c\",\"d\"),IF(Table_RiskAssessment[[#This Row],[W]]=1,\"d\",\"e\")))),\"?\")","v":"?"},null,null,null,null,null,null,null,null,null,null,null,null,null,null,{"$f":"IF((Table_RiskAssessment[[#This Row],[S2]]* Table_RiskAssessment[[#This Row],[F2]]* Table_RiskAssessment[[#This Row],[P2]]>0),IF(Table_RiskAssessment[[#This Row],[S2]]=1,IF(Table_RiskAssessment[[#This Row],[F2]]=1,IF(Table_RiskAssessment[[#This Row],[P2]]=1,\"a\",IF(Table_RiskAssessment[[#This Row],[W2]]=1,\"a\",\"b\")),IF(Table_RiskAssessment[[#This Row],[P2]]=1,IF(Table_RiskAssessment[[#This Row],[W2]]=1,\"a\",\"b\"),IF(Table_RiskAssessment[[#This Row],[W2]]=1,\"b\",\"c\"))),IF(Table_RiskAssessment[[#This Row],[F2]]=1,IF(Table_RiskAssessment[[#This Row],[P2]]=1,IF(Table_RiskAssessment[[#This Row],[W2]]=1,\"b\",\"c\"),IF(Table_RiskAssessment[[#This Row],[W2]]=1,\"c\",\"d\")),IF(Table_RiskAssessment[[#This Row],[P2]]=1,IF(Table_RiskAssessment[[#This Row],[W2]]=1,\"c\",\"d\"),IF(Table_RiskAssessment[[#This Row],[W2]]=1,\"d\",\"e\")))),\"?\")","v":"?"},null,null,null,"-"]
[null,null,null,"2006 / 42","3.6.2.",{"$f":"Sprache!A$209","v":"Kennzeichnung"},"x","","x",null,null,null,null,null,null,null,null,null,null,null,null,null,null,null,null,null,null,null,null,null,null,null,null,{"$f":"IF((Table_RiskAssessment[[#This Row],[S]]* Table_RiskAssessment[[#This Row],[F]]* Table_RiskAssessment[[#This Row],[P]]>0),IF(Table_RiskAssessment[[#This Row],[S]]=1,IF(Table_RiskAssessment[[#This Row],[F]]=1,IF(Table_RiskAssessment[[#This Row],[P]]=1,\"a\",IF(Table_RiskAssessment[[#This Row],[W]]=1,\"a\",\"b\")),IF(Table_RiskAssessment[[#This Row],[P]]=1,IF(Table_RiskAssessment[[#This Row],[W]]=1,\"a\",\"b\"),IF(Table_RiskAssessment[[#This Row],[W]]=1,\"b\",\"c\"))),IF(Table_RiskAssessment[[#This Row],[F]]=1,IF(Table_RiskAssessment[[#This Row],[P]]=1,IF(Table_RiskAssessment[[#This Row],[W]]=1,\"b\",\"c\"),IF(Table_RiskAssessment[[#This Row],[W]]=1,\"c\",\"d\")),IF(Table_RiskAssessment[[#This Row],[P]]=1,IF(Table_RiskAssessment[[#This Row],[W]]=1,\"c\",\"d\"),IF(Table_RiskAssessment[[#This Row],[W]]=1,\"d\",\"e\")))),\"?\")","v":"?"},null,null,null,null,null,null,null,null,null,null,null,null,null,null,{"$f":"IF((Table_RiskAssessment[[#This Row],[S2]]* Table_RiskAssessment[[#This Row],[F2]]* Table_RiskAssessment[[#This Row],[P2]]>0),IF(Table_RiskAssessment[[#This Row],[S2]]=1,IF(Table_RiskAssessment[[#This Row],[F2]]=1,IF(Table_RiskAssessment[[#This Row],[P2]]=1,\"a\",IF(Table_RiskAssessment[[#This Row],[W2]]=1,\"a\",\"b\")),IF(Table_RiskAssessment[[#This Row],[P2]]=1,IF(Table_RiskAssessment[[#This Row],[W2]]=1,\"a\",\"b\"),IF(Table_RiskAssessment[[#This Row],[W2]]=1,\"b\",\"c\"))),IF(Table_RiskAssessment[[#This Row],[F2]]=1,IF(Table_RiskAssessment[[#This Row],[P2]]=1,IF(Table_RiskAssessment[[#This Row],[W2]]=1,\"b\",\"c\"),IF(Table_RiskAssessment[[#This Row],[W2]]=1,\"c\",\"d\")),IF(Table_RiskAssessment[[#This Row],[P2]]=1,IF(Table_RiskAssessment[[#This Row],[W2]]=1,\"c\",\"d\"),IF(Table_RiskAssessment[[#This Row],[W2]]=1,\"d\",\"e\")))),\"?\")","v":"?"},null,null,null,"-"]
[null,null,null,"2006 / 42","3.6.3.",{"$f":"Sprache!A$210","v":"Betriebsanleitung"},"x","x","x",null,null,null,null,null,null,null,null,null,null,null,null,null,null,null,null,null,null,null,null,null,null,null,null,{"$f":"IF((Table_RiskAssessment[[#This Row],[S]]* Table_RiskAssessment[[#This Row],[F]]* Table_RiskAssessment[[#This Row],[P]]>0),IF(Table_RiskAssessment[[#This Row],[S]]=1,IF(Table_RiskAssessment[[#This Row],[F]]=1,IF(Table_RiskAssessment[[#This Row],[P]]=1,\"a\",IF(Table_RiskAssessment[[#This Row],[W]]=1,\"a\",\"b\")),IF(Table_RiskAssessment[[#This Row],[P]]=1,IF(Table_RiskAssessment[[#This Row],[W]]=1,\"a\",\"b\"),IF(Table_RiskAssessment[[#This Row],[W]]=1,\"b\",\"c\"))),IF(Table_RiskAssessment[[#This Row],[F]]=1,IF(Table_RiskAssessment[[#This Row],[P]]=1,IF(Table_RiskAssessment[[#This Row],[W]]=1,\"b\",\"c\"),IF(Table_RiskAssessment[[#This Row],[W]]=1,\"c\",\"d\")),IF(Table_RiskAssessment[[#This Row],[P]]=1,IF(Table_RiskAssessment[[#This Row],[W]]=1,\"c\",\"d\"),IF(Table_RiskAssessment[[#This Row],[W]]=1,\"d\",\"e\")))),\"?\")","v":"?"},null,null,null,null,null,null,null,null,null,null,null,null,null,null,{"$f":"IF((Table_RiskAssessment[[#This Row],[S2]]* Table_RiskAssessment[[#This Row],[F2]]* Table_RiskAssessment[[#This Row],[P2]]>0),IF(Table_RiskAssessment[[#This Row],[S2]]=1,IF(Table_RiskAssessment[[#This Row],[F2]]=1,IF(Table_RiskAssessment[[#This Row],[P2]]=1,\"a\",IF(Table_RiskAssessment[[#This Row],[W2]]=1,\"a\",\"b\")),IF(Table_RiskAssessment[[#This Row],[P2]]=1,IF(Table_RiskAssessment[[#This Row],[W2]]=1,\"a\",\"b\"),IF(Table_RiskAssessment[[#This Row],[W2]]=1,\"b\",\"c\"))),IF(Table_RiskAssessment[[#This Row],[F2]]=1,IF(Table_RiskAssessment[[#This Row],[P2]]=1,IF(Table_RiskAssessment[[#This Row],[W2]]=1,\"b\",\"c\"),IF(Table_RiskAssessment[[#This Row],[W2]]=1,\"c\",\"d\")),IF(Table_RiskAssessment[[#This Row],[P2]]=1,IF(Table_RiskAssessment[[#This Row],[W2]]=1,\"c\",\"d\"),IF(Table_RiskAssessment[[#This Row],[W2]]=1,\"d\",\"e\")))),\"?\")","v":"?"},null,null,null,"-"]
[null,null,null,"2006 / 42","3.6.3.1.",{"$f":"Sprache!A$211","v":"Vibrationen"},"x","","x",null,null,null,null,null,null,null,null,null,null,null,null,null,null,null,null,null,null,null,null,null,null,null,null,{"$f":"IF((Table_RiskAssessment[[#This Row],[S]]* Table_RiskAssessment[[#This Row],[F]]* Table_RiskAssessment[[#This Row],[P]]>0),IF(Table_RiskAssessment[[#This Row],[S]]=1,IF(Table_RiskAssessment[[#This Row],[F]]=1,IF(Table_RiskAssessment[[#This Row],[P]]=1,\"a\",IF(Table_RiskAssessment[[#This Row],[W]]=1,\"a\",\"b\")),IF(Table_RiskAssessment[[#This Row],[P]]=1,IF(Table_RiskAssessment[[#This Row],[W]]=1,\"a\",\"b\"),IF(Table_RiskAssessment[[#This Row],[W]]=1,\"b\",\"c\"))),IF(Table_RiskAssessment[[#This Row],[F]]=1,IF(Table_RiskAssessment[[#This Row],[P]]=1,IF(Table_RiskAssessment[[#This Row],[W]]=1,\"b\",\"c\"),IF(Table_RiskAssessment[[#This Row],[W]]=1,\"c\",\"d\")),IF(Table_RiskAssessment[[#This Row],[P]]=1,IF(Table_RiskAssessment[[#This Row],[W]]=1,\"c\",\"d\"),IF(Table_RiskAssessment[[#This Row],[W]]=1,\"d\",\"e\")))),\"?\")","v":"?"},null,null,null,null,null,null,null,null,null,null,null,null,null,null,{"$f":"IF((Table_RiskAssessment[[#This Row],[S2]]* Table_RiskAssessment[[#This Row],[F2]]* Table_RiskAssessment[[#This Row],[P2]]>0),IF(Table_RiskAssessment[[#This Row],[S2]]=1,IF(Table_RiskAssessment[[#This Row],[F2]]=1,IF(Table_RiskAssessment[[#This Row],[P2]]=1,\"a\",IF(Table_RiskAssessment[[#This Row],[W2]]=1,\"a\",\"b\")),IF(Table_RiskAssessment[[#This Row],[P2]]=1,IF(Table_RiskAssessment[[#This Row],[W2]]=1,\"a\",\"b\"),IF(Table_RiskAssessment[[#This Row],[W2]]=1,\"b\",\"c\"))),IF(Table_RiskAssessment[[#This Row],[F2]]=1,IF(Table_RiskAssessment[[#This Row],[P2]]=1,IF(Table_RiskAssessment[[#This Row],[W2]]=1,\"b\",\"c\"),IF(Table_RiskAssessment[[#This Row],[W2]]=1,\"c\",\"d\")),IF(Table_RiskAssessment[[#This Row],[P2]]=1,IF(Table_RiskAssessment[[#This Row],[W2]]=1,\"c\",\"d\"),IF(Table_RiskAssessment[[#This Row],[W2]]=1,\"d\",\"e\")))),\"?\")","v":"?"},null,null,null,"-"]
[null,null,null,"2006 / 42","3.6.3.2.",{"$f":"Sprache!A$212","v":"Mehrere Verwendungsmöglichkeiten"},"x","","x",null,null,null,null,null,null,null,null,null,null,null,null,null,null,null,null,null,null,null,null,null,null,null,null,{"$f":"IF((Table_RiskAssessment[[#This Row],[S]]* Table_RiskAssessment[[#This Row],[F]]* Table_RiskAssessment[[#This Row],[P]]>0),IF(Table_RiskAssessment[[#This Row],[S]]=1,IF(Table_RiskAssessment[[#This Row],[F]]=1,IF(Table_RiskAssessment[[#This Row],[P]]=1,\"a\",IF(Table_RiskAssessment[[#This Row],[W]]=1,\"a\",\"b\")),IF(Table_RiskAssessment[[#This Row],[P]]=1,IF(Table_RiskAssessment[[#This Row],[W]]=1,\"a\",\"b\"),IF(Table_RiskAssessment[[#This Row],[W]]=1,\"b\",\"c\"))),IF(Table_RiskAssessment[[#This Row],[F]]=1,IF(Table_RiskAssessment[[#This Row],[P]]=1,IF(Table_RiskAssessment[[#This Row],[W]]=1,\"b\",\"c\"),IF(Table_RiskAssessment[[#This Row],[W]]=1,\"c\",\"d\")),IF(Table_RiskAssessment[[#This Row],[P]]=1,IF(Table_RiskAssessment[[#This Row],[W]]=1,\"c\",\"d\"),IF(Table_RiskAssessment[[#This Row],[W]]=1,\"d\",\"e\")))),\"?\")","v":"?"},null,null,null,null,null,null,null,null,null,null,null,null,null,null,{"$f":"IF((Table_RiskAssessment[[#This Row],[S2]]* Table_RiskAssessment[[#This Row],[F2]]* Table_RiskAssessment[[#This Row],[P2]]>0),IF(Table_RiskAssessment[[#This Row],[S2]]=1,IF(Table_RiskAssessment[[#This Row],[F2]]=1,IF(Table_RiskAssessment[[#This Row],[P2]]=1,\"a\",IF(Table_RiskAssessment[[#This Row],[W2]]=1,\"a\",\"b\")),IF(Table_RiskAssessment[[#This Row],[P2]]=1,IF(Table_RiskAssessment[[#This Row],[W2]]=1,\"a\",\"b\"),IF(Table_RiskAssessment[[#This Row],[W2]]=1,\"b\",\"c\"))),IF(Table_RiskAssessment[[#This Row],[F2]]=1,IF(Table_RiskAssessment[[#This Row],[P2]]=1,IF(Table_RiskAssessment[[#This Row],[W2]]=1,\"b\",\"c\"),IF(Table_RiskAssessment[[#This Row],[W2]]=1,\"c\",\"d\")),IF(Table_RiskAssessment[[#This Row],[P2]]=1,IF(Table_RiskAssessment[[#This Row],[W2]]=1,\"c\",\"d\"),IF(Table_RiskAssessment[[#This Row],[W2]]=1,\"d\",\"e\")))),\"?\")","v":"?"},null,null,null,"-"]
[null,null,null,"2006 / 42","4.",{"$f":"Sprache!A$213","v":"durch Hebevorgänge bedingten Gefährdungen"},"x","x","x",null,null,null,null,null,null,null,null,null,null,null,null,null,null,null,null,null,null,null,null,null,null,null,null,{"$f":"IF((Table_RiskAssessment[[#This Row],[S]]* Table_RiskAssessment[[#This Row],[F]]* Table_RiskAssessment[[#This Row],[P]]>0),IF(Table_RiskAssessment[[#This Row],[S]]=1,IF(Table_RiskAssessment[[#This Row],[F]]=1,IF(Table_RiskAssessment[[#This Row],[P]]=1,\"a\",IF(Table_RiskAssessment[[#This Row],[W]]=1,\"a\",\"b\")),IF(Table_RiskAssessment[[#This Row],[P]]=1,IF(Table_RiskAssessment[[#This Row],[W]]=1,\"a\",\"b\"),IF(Table_RiskAssessment[[#This Row],[W]]=1,\"b\",\"c\"))),IF(Table_RiskAssessment[[#This Row],[F]]=1,IF(Table_RiskAssessment[[#This Row],[P]]=1,IF(Table_RiskAssessment[[#This Row],[W]]=1,\"b\",\"c\"),IF(Table_RiskAssessment[[#This Row],[W]]=1,\"c\",\"d\")),IF(Table_RiskAssessment[[#This Row],[P]]=1,IF(Table_RiskAssessment[[#This Row],[W]]=1,\"c\",\"d\"),IF(Table_RiskAssessment[[#This Row],[W]]=1,\"d\",\"e\")))),\"?\")","v":"?"},null,null,null,null,null,null,null,null,null,null,null,null,null,null,{"$f":"IF((Table_RiskAssessment[[#This Row],[S2]]* Table_RiskAssessment[[#This Row],[F2]]* Table_RiskAssessment[[#This Row],[P2]]>0),IF(Table_RiskAssessment[[#This Row],[S2]]=1,IF(Table_RiskAssessment[[#This Row],[F2]]=1,IF(Table_RiskAssessment[[#This Row],[P2]]=1,\"a\",IF(Table_RiskAssessment[[#This Row],[W2]]=1,\"a\",\"b\")),IF(Table_RiskAssessment[[#This Row],[P2]]=1,IF(Table_RiskAssessment[[#This Row],[W2]]=1,\"a\",\"b\"),IF(Table_RiskAssessment[[#This Row],[W2]]=1,\"b\",\"c\"))),IF(Table_RiskAssessment[[#This Row],[F2]]=1,IF(Table_RiskAssessment[[#This Row],[P2]]=1,IF(Table_RiskAssessment[[#This Row],[W2]]=1,\"b\",\"c\"),IF(Table_RiskAssessment[[#This Row],[W2]]=1,\"c\",\"d\")),IF(Table_RiskAssessment[[#This Row],[P2]]=1,IF(Table_RiskAssessment[[#This Row],[W2]]=1,\"c\",\"d\"),IF(Table_RiskAssessment[[#This Row],[W2]]=1,\"d\",\"e\")))),\"?\")","v":"?"},null,null,null,"-"]
[null,null,null,"2006 / 42","4.1.",{"$f":"Sprache!A$214","v":"Allgemeines"},"x","x","x",null,null,null,null,null,null,null,null,null,null,null,null,null,null,null,null,null,null,null,null,null,null,null,null,{"$f":"IF((Table_RiskAssessment[[#This Row],[S]]* Table_RiskAssessment[[#This Row],[F]]* Table_RiskAssessment[[#This Row],[P]]>0),IF(Table_RiskAssessment[[#This Row],[S]]=1,IF(Table_RiskAssessment[[#This Row],[F]]=1,IF(Table_RiskAssessment[[#This Row],[P]]=1,\"a\",IF(Table_RiskAssessment[[#This Row],[W]]=1,\"a\",\"b\")),IF(Table_RiskAssessment[[#This Row],[P]]=1,IF(Table_RiskAssessment[[#This Row],[W]]=1,\"a\",\"b\"),IF(Table_RiskAssessment[[#This Row],[W]]=1,\"b\",\"c\"))),IF(Table_RiskAssessment[[#This Row],[F]]=1,IF(Table_RiskAssessment[[#This Row],[P]]=1,IF(Table_RiskAssessment[[#This Row],[W]]=1,\"b\",\"c\"),IF(Table_RiskAssessment[[#This Row],[W]]=1,\"c\",\"d\")),IF(Table_RiskAssessment[[#This Row],[P]]=1,IF(Table_RiskAssessment[[#This Row],[W]]=1,\"c\",\"d\"),IF(Table_RiskAssessment[[#This Row],[W]]=1,\"d\",\"e\")))),\"?\")","v":"?"},null,null,null,null,null,null,null,null,null,null,null,null,null,null,{"$f":"IF((Table_RiskAssessment[[#This Row],[S2]]* Table_RiskAssessment[[#This Row],[F2]]* Table_RiskAssessment[[#This Row],[P2]]>0),IF(Table_RiskAssessment[[#This Row],[S2]]=1,IF(Table_RiskAssessment[[#This Row],[F2]]=1,IF(Table_RiskAssessment[[#This Row],[P2]]=1,\"a\",IF(Table_RiskAssessment[[#This Row],[W2]]=1,\"a\",\"b\")),IF(Table_RiskAssessment[[#This Row],[P2]]=1,IF(Table_RiskAssessment[[#This Row],[W2]]=1,\"a\",\"b\"),IF(Table_RiskAssessment[[#This Row],[W2]]=1,\"b\",\"c\"))),IF(Table_RiskAssessment[[#This Row],[F2]]=1,IF(Table_RiskAssessment[[#This Row],[P2]]=1,IF(Table_RiskAssessment[[#This Row],[W2]]=1,\"b\",\"c\"),IF(Table_RiskAssessment[[#This Row],[W2]]=1,\"c\",\"d\")),IF(Table_RiskAssessment[[#This Row],[P2]]=1,IF(Table_RiskAssessment[[#This Row],[W2]]=1,\"c\",\"d\"),IF(Table_RiskAssessment[[#This Row],[W2]]=1,\"d\",\"e\")))),\"?\")","v":"?"},null,null,null,"-"]
[null,null,null,"2006 / 42","4.1.1.",{"$f":"Sprache!A$215","v":"Begriffsbestimmungen"},"x","","x",null,null,null,null,null,null,null,null,null,null,null,null,null,null,null,null,null,null,null,null,null,null,null,null,{"$f":"IF((Table_RiskAssessment[[#This Row],[S]]* Table_RiskAssessment[[#This Row],[F]]* Table_RiskAssessment[[#This Row],[P]]>0),IF(Table_RiskAssessment[[#This Row],[S]]=1,IF(Table_RiskAssessment[[#This Row],[F]]=1,IF(Table_RiskAssessment[[#This Row],[P]]=1,\"a\",IF(Table_RiskAssessment[[#This Row],[W]]=1,\"a\",\"b\")),IF(Table_RiskAssessment[[#This Row],[P]]=1,IF(Table_RiskAssessment[[#This Row],[W]]=1,\"a\",\"b\"),IF(Table_RiskAssessment[[#This Row],[W]]=1,\"b\",\"c\"))),IF(Table_RiskAssessment[[#This Row],[F]]=1,IF(Table_RiskAssessment[[#This Row],[P]]=1,IF(Table_RiskAssessment[[#This Row],[W]]=1,\"b\",\"c\"),IF(Table_RiskAssessment[[#This Row],[W]]=1,\"c\",\"d\")),IF(Table_RiskAssessment[[#This Row],[P]]=1,IF(Table_RiskAssessment[[#This Row],[W]]=1,\"c\",\"d\"),IF(Table_RiskAssessment[[#This Row],[W]]=1,\"d\",\"e\")))),\"?\")","v":"?"},null,null,null,null,null,null,null,null,null,null,null,null,null,null,{"$f":"IF((Table_RiskAssessment[[#This Row],[S2]]* Table_RiskAssessment[[#This Row],[F2]]* Table_RiskAssessment[[#This Row],[P2]]>0),IF(Table_RiskAssessment[[#This Row],[S2]]=1,IF(Table_RiskAssessment[[#This Row],[F2]]=1,IF(Table_RiskAssessment[[#This Row],[P2]]=1,\"a\",IF(Table_RiskAssessment[[#This Row],[W2]]=1,\"a\",\"b\")),IF(Table_RiskAssessment[[#This Row],[P2]]=1,IF(Table_RiskAssessment[[#This Row],[W2]]=1,\"a\",\"b\"),IF(Table_RiskAssessment[[#This Row],[W2]]=1,\"b\",\"c\"))),IF(Table_RiskAssessment[[#This Row],[F2]]=1,IF(Table_RiskAssessment[[#This Row],[P2]]=1,IF(Table_RiskAssessment[[#This Row],[W2]]=1,\"b\",\"c\"),IF(Table_RiskAssessment[[#This Row],[W2]]=1,\"c\",\"d\")),IF(Table_RiskAssessment[[#This Row],[P2]]=1,IF(Table_RiskAssessment[[#This Row],[W2]]=1,\"c\",\"d\"),IF(Table_RiskAssessment[[#This Row],[W2]]=1,\"d\",\"e\")))),\"?\")","v":"?"},null,null,null,"-"]
[null,null,null,"2006 / 42","4.1.2.",{"$f":"Sprache!A$216","v":"Schutzmaßnahmen gegen mechanische Gefährdungen"},"x","x","x",null,null,null,null,null,null,null,null,null,null,null,null,null,null,null,null,null,null,null,null,null,null,null,null,{"$f":"IF((Table_RiskAssessment[[#This Row],[S]]* Table_RiskAssessment[[#This Row],[F]]* Table_RiskAssessment[[#This Row],[P]]>0),IF(Table_RiskAssessment[[#This Row],[S]]=1,IF(Table_RiskAssessment[[#This Row],[F]]=1,IF(Table_RiskAssessment[[#This Row],[P]]=1,\"a\",IF(Table_RiskAssessment[[#This Row],[W]]=1,\"a\",\"b\")),IF(Table_RiskAssessment[[#This Row],[P]]=1,IF(Table_RiskAssessment[[#This Row],[W]]=1,\"a\",\"b\"),IF(Table_RiskAssessment[[#This Row],[W]]=1,\"b\",\"c\"))),IF(Table_RiskAssessment[[#This Row],[F]]=1,IF(Table_RiskAssessment[[#This Row],[P]]=1,IF(Table_RiskAssessment[[#This Row],[W]]=1,\"b\",\"c\"),IF(Table_RiskAssessment[[#This Row],[W]]=1,\"c\",\"d\")),IF(Table_RiskAssessment[[#This Row],[P]]=1,IF(Table_RiskAssessment[[#This Row],[W]]=1,\"c\",\"d\"),IF(Table_RiskAssessment[[#This Row],[W]]=1,\"d\",\"e\")))),\"?\")","v":"?"},null,null,null,null,null,null,null,null,null,null,null,null,null,null,{"$f":"IF((Table_RiskAssessment[[#This Row],[S2]]* Table_RiskAssessment[[#This Row],[F2]]* Table_RiskAssessment[[#This Row],[P2]]>0),IF(Table_RiskAssessment[[#This Row],[S2]]=1,IF(Table_RiskAssessment[[#This Row],[F2]]=1,IF(Table_RiskAssessment[[#This Row],[P2]]=1,\"a\",IF(Table_RiskAssessment[[#This Row],[W2]]=1,\"a\",\"b\")),IF(Table_RiskAssessment[[#This Row],[P2]]=1,IF(Table_RiskAssessment[[#This Row],[W2]]=1,\"a\",\"b\"),IF(Table_RiskAssessment[[#This Row],[W2]]=1,\"b\",\"c\"))),IF(Table_RiskAssessment[[#This Row],[F2]]=1,IF(Table_RiskAssessment[[#This Row],[P2]]=1,IF(Table_RiskAssessment[[#This Row],[W2]]=1,\"b\",\"c\"),IF(Table_RiskAssessment[[#This Row],[W2]]=1,\"c\",\"d\")),IF(Table_RiskAssessment[[#This Row],[P2]]=1,IF(Table_RiskAssessment[[#This Row],[W2]]=1,\"c\",\"d\"),IF(Table_RiskAssessment[[#This Row],[W2]]=1,\"d\",\"e\")))),\"?\")","v":"?"},null,null,null,"-"]
[null,null,null,"2006 / 42","4.1.2.1.",{"$f":"Sprache!A$217","v":"Risiken durch mangelnde Standsicherheit"},"x","","x",null,null,null,null,null,null,null,null,null,null,null,null,null,null,null,null,null,null,null,null,null,null,null,null,{"$f":"IF((Table_RiskAssessment[[#This Row],[S]]* Table_RiskAssessment[[#This Row],[F]]* Table_RiskAssessment[[#This Row],[P]]>0),IF(Table_RiskAssessment[[#This Row],[S]]=1,IF(Table_RiskAssessment[[#This Row],[F]]=1,IF(Table_RiskAssessment[[#This Row],[P]]=1,\"a\",IF(Table_RiskAssessment[[#This Row],[W]]=1,\"a\",\"b\")),IF(Table_RiskAssessment[[#This Row],[P]]=1,IF(Table_RiskAssessment[[#This Row],[W]]=1,\"a\",\"b\"),IF(Table_RiskAssessment[[#This Row],[W]]=1,\"b\",\"c\"))),IF(Table_RiskAssessment[[#This Row],[F]]=1,IF(Table_RiskAssessment[[#This Row],[P]]=1,IF(Table_RiskAssessment[[#This Row],[W]]=1,\"b\",\"c\"),IF(Table_RiskAssessment[[#This Row],[W]]=1,\"c\",\"d\")),IF(Table_RiskAssessment[[#This Row],[P]]=1,IF(Table_RiskAssessment[[#This Row],[W]]=1,\"c\",\"d\"),IF(Table_RiskAssessment[[#This Row],[W]]=1,\"d\",\"e\")))),\"?\")","v":"?"},null,null,null,null,null,null,null,null,null,null,null,null,null,null,{"$f":"IF((Table_RiskAssessment[[#This Row],[S2]]* Table_RiskAssessment[[#This Row],[F2]]* Table_RiskAssessment[[#This Row],[P2]]>0),IF(Table_RiskAssessment[[#This Row],[S2]]=1,IF(Table_RiskAssessment[[#This Row],[F2]]=1,IF(Table_RiskAssessment[[#This Row],[P2]]=1,\"a\",IF(Table_RiskAssessment[[#This Row],[W2]]=1,\"a\",\"b\")),IF(Table_RiskAssessment[[#This Row],[P2]]=1,IF(Table_RiskAssessment[[#This Row],[W2]]=1,\"a\",\"b\"),IF(Table_RiskAssessment[[#This Row],[W2]]=1,\"b\",\"c\"))),IF(Table_RiskAssessment[[#This Row],[F2]]=1,IF(Table_RiskAssessment[[#This Row],[P2]]=1,IF(Table_RiskAssessment[[#This Row],[W2]]=1,\"b\",\"c\"),IF(Table_RiskAssessment[[#This Row],[W2]]=1,\"c\",\"d\")),IF(Table_RiskAssessment[[#This Row],[P2]]=1,IF(Table_RiskAssessment[[#This Row],[W2]]=1,\"c\",\"d\"),IF(Table_RiskAssessment[[#This Row],[W2]]=1,\"d\",\"e\")))),\"?\")","v":"?"},null,null,null,"-"]
[null,null,null,"2006 / 42","4.1.2.2.",{"$f":"Sprache!A$218","v":"An Führungen oder auf Laufbahnen fahrende Maschinen"},"x","","x",null,null,null,null,null,null,null,null,null,null,null,null,null,null,null,null,null,null,null,null,null,null,null,null,{"$f":"IF((Table_RiskAssessment[[#This Row],[S]]* Table_RiskAssessment[[#This Row],[F]]* Table_RiskAssessment[[#This Row],[P]]>0),IF(Table_RiskAssessment[[#This Row],[S]]=1,IF(Table_RiskAssessment[[#This Row],[F]]=1,IF(Table_RiskAssessment[[#This Row],[P]]=1,\"a\",IF(Table_RiskAssessment[[#This Row],[W]]=1,\"a\",\"b\")),IF(Table_RiskAssessment[[#This Row],[P]]=1,IF(Table_RiskAssessment[[#This Row],[W]]=1,\"a\",\"b\"),IF(Table_RiskAssessment[[#This Row],[W]]=1,\"b\",\"c\"))),IF(Table_RiskAssessment[[#This Row],[F]]=1,IF(Table_RiskAssessment[[#This Row],[P]]=1,IF(Table_RiskAssessment[[#This Row],[W]]=1,\"b\",\"c\"),IF(Table_RiskAssessment[[#This Row],[W]]=1,\"c\",\"d\")),IF(Table_RiskAssessment[[#This Row],[P]]=1,IF(Table_RiskAssessment[[#This Row],[W]]=1,\"c\",\"d\"),IF(Table_RiskAssessment[[#This Row],[W]]=1,\"d\",\"e\")))),\"?\")","v":"?"},null,null,null,null,null,null,null,null,null,null,null,null,null,null,{"$f":"IF((Table_RiskAssessment[[#This Row],[S2]]* Table_RiskAssessment[[#This Row],[F2]]* Table_RiskAssessment[[#This Row],[P2]]>0),IF(Table_RiskAssessment[[#This Row],[S2]]=1,IF(Table_RiskAssessment[[#This Row],[F2]]=1,IF(Table_RiskAssessment[[#This Row],[P2]]=1,\"a\",IF(Table_RiskAssessment[[#This Row],[W2]]=1,\"a\",\"b\")),IF(Table_RiskAssessment[[#This Row],[P2]]=1,IF(Table_RiskAssessment[[#This Row],[W2]]=1,\"a\",\"b\"),IF(Table_RiskAssessment[[#This Row],[W2]]=1,\"b\",\"c\"))),IF(Table_RiskAssessment[[#This Row],[F2]]=1,IF(Table_RiskAssessment[[#This Row],[P2]]=1,IF(Table_RiskAssessment[[#This Row],[W2]]=1,\"b\",\"c\"),IF(Table_RiskAssessment[[#This Row],[W2]]=1,\"c\",\"d\")),IF(Table_RiskAssessment[[#This Row],[P2]]=1,IF(Table_RiskAssessment[[#This Row],[W2]]=1,\"c\",\"d\"),IF(Table_RiskAssessment[[#This Row],[W2]]=1,\"d\",\"e\")))),\"?\")","v":"?"},null,null,null,"-"]
[null,null,null,"2006 / 42","4.1.2.3.",{"$f":"Sprache!A$219","v":"Festigkeit"},"x","","x",null,null,null,null,null,null,null,null,null,null,null,null,null,null,null,null,null,null,null,null,null,null,null,null,{"$f":"IF((Table_RiskAssessment[[#This Row],[S]]* Table_RiskAssessment[[#This Row],[F]]* Table_RiskAssessment[[#This Row],[P]]>0),IF(Table_RiskAssessment[[#This Row],[S]]=1,IF(Table_RiskAssessment[[#This Row],[F]]=1,IF(Table_RiskAssessment[[#This Row],[P]]=1,\"a\",IF(Table_RiskAssessment[[#This Row],[W]]=1,\"a\",\"b\")),IF(Table_RiskAssessment[[#This Row],[P]]=1,IF(Table_RiskAssessment[[#This Row],[W]]=1,\"a\",\"b\"),IF(Table_RiskAssessment[[#This Row],[W]]=1,\"b\",\"c\"))),IF(Table_RiskAssessment[[#This Row],[F]]=1,IF(Table_RiskAssessment[[#This Row],[P]]=1,IF(Table_RiskAssessment[[#This Row],[W]]=1,\"b\",\"c\"),IF(Table_RiskAssessment[[#This Row],[W]]=1,\"c\",\"d\")),IF(Table_RiskAssessment[[#This Row],[P]]=1,IF(Table_RiskAssessment[[#This Row],[W]]=1,\"c\",\"d\"),IF(Table_RiskAssessment[[#This Row],[W]]=1,\"d\",\"e\")))),\"?\")","v":"?"},null,null,null,null,null,null,null,null,null,null,null,null,null,null,{"$f":"IF((Table_RiskAssessment[[#This Row],[S2]]* Table_RiskAssessment[[#This Row],[F2]]* Table_RiskAssessment[[#This Row],[P2]]>0),IF(Table_RiskAssessment[[#This Row],[S2]]=1,IF(Table_RiskAssessment[[#This Row],[F2]]=1,IF(Table_RiskAssessment[[#This Row],[P2]]=1,\"a\",IF(Table_RiskAssessment[[#This Row],[W2]]=1,\"a\",\"b\")),IF(Table_RiskAssessment[[#This Row],[P2]]=1,IF(Table_RiskAssessment[[#This Row],[W2]]=1,\"a\",\"b\"),IF(Table_RiskAssessment[[#This Row],[W2]]=1,\"b\",\"c\"))),IF(Table_RiskAssessment[[#This Row],[F2]]=1,IF(Table_RiskAssessment[[#This Row],[P2]]=1,IF(Table_RiskAssessment[[#This Row],[W2]]=1,\"b\",\"c\"),IF(Table_RiskAssessment[[#This Row],[W2]]=1,\"c\",\"d\")),IF(Table_RiskAssessment[[#This Row],[P2]]=1,IF(Table_RiskAssessment[[#This Row],[W2]]=1,\"c\",\"d\"),IF(Table_RiskAssessment[[#This Row],[W2]]=1,\"d\",\"e\")))),\"?\")","v":"?"},null,null,null,"-"]
[null,null,null,"2006 / 42","4.1.2.4.",{"$f":"Sprache!A$220","v":"Rollen, Trommeln, Scheiben, Seile und Ketten"},"x","","x",null,null,null,null,null,null,null,null,null,null,null,null,null,null,null,null,null,null,null,null,null,null,null,null,{"$f":"IF((Table_RiskAssessment[[#This Row],[S]]* Table_RiskAssessment[[#This Row],[F]]* Table_RiskAssessment[[#This Row],[P]]>0),IF(Table_RiskAssessment[[#This Row],[S]]=1,IF(Table_RiskAssessment[[#This Row],[F]]=1,IF(Table_RiskAssessment[[#This Row],[P]]=1,\"a\",IF(Table_RiskAssessment[[#This Row],[W]]=1,\"a\",\"b\")),IF(Table_RiskAssessment[[#This Row],[P]]=1,IF(Table_RiskAssessment[[#This Row],[W]]=1,\"a\",\"b\"),IF(Table_RiskAssessment[[#This Row],[W]]=1,\"b\",\"c\"))),IF(Table_RiskAssessment[[#This Row],[F]]=1,IF(Table_RiskAssessment[[#This Row],[P]]=1,IF(Table_RiskAssessment[[#This Row],[W]]=1,\"b\",\"c\"),IF(Table_RiskAssessment[[#This Row],[W]]=1,\"c\",\"d\")),IF(Table_RiskAssessment[[#This Row],[P]]=1,IF(Table_RiskAssessment[[#This Row],[W]]=1,\"c\",\"d\"),IF(Table_RiskAssessment[[#This Row],[W]]=1,\"d\",\"e\")))),\"?\")","v":"?"},null,null,null,null,null,null,null,null,null,null,null,null,null,null,{"$f":"IF((Table_RiskAssessment[[#This Row],[S2]]* Table_RiskAssessment[[#This Row],[F2]]* Table_RiskAssessment[[#This Row],[P2]]>0),IF(Table_RiskAssessment[[#This Row],[S2]]=1,IF(Table_RiskAssessment[[#This Row],[F2]]=1,IF(Table_RiskAssessment[[#This Row],[P2]]=1,\"a\",IF(Table_RiskAssessment[[#This Row],[W2]]=1,\"a\",\"b\")),IF(Table_RiskAssessment[[#This Row],[P2]]=1,IF(Table_RiskAssessment[[#This Row],[W2]]=1,\"a\",\"b\"),IF(Table_RiskAssessment[[#This Row],[W2]]=1,\"b\",\"c\"))),IF(Table_RiskAssessment[[#This Row],[F2]]=1,IF(Table_RiskAssessment[[#This Row],[P2]]=1,IF(Table_RiskAssessment[[#This Row],[W2]]=1,\"b\",\"c\"),IF(Table_RiskAssessment[[#This Row],[W2]]=1,\"c\",\"d\")),IF(Table_RiskAssessment[[#This Row],[P2]]=1,IF(Table_RiskAssessment[[#This Row],[W2]]=1,\"c\",\"d\"),IF(Table_RiskAssessment[[#This Row],[W2]]=1,\"d\",\"e\")))),\"?\")","v":"?"},null,null,null,"-"]
[null,null,null,"2006 / 42","4.1.2.5.",{"$f":"Sprache!A$221","v":"Lastaufnahmemittel und ihre Bauteile"},"x","","x",null,null,null,null,null,null,null,null,null,null,null,null,null,null,null,null,null,null,null,null,null,null,null,null,{"$f":"IF((Table_RiskAssessment[[#This Row],[S]]* Table_RiskAssessment[[#This Row],[F]]* Table_RiskAssessment[[#This Row],[P]]>0),IF(Table_RiskAssessment[[#This Row],[S]]=1,IF(Table_RiskAssessment[[#This Row],[F]]=1,IF(Table_RiskAssessment[[#This Row],[P]]=1,\"a\",IF(Table_RiskAssessment[[#This Row],[W]]=1,\"a\",\"b\")),IF(Table_RiskAssessment[[#This Row],[P]]=1,IF(Table_RiskAssessment[[#This Row],[W]]=1,\"a\",\"b\"),IF(Table_RiskAssessment[[#This Row],[W]]=1,\"b\",\"c\"))),IF(Table_RiskAssessment[[#This Row],[F]]=1,IF(Table_RiskAssessment[[#This Row],[P]]=1,IF(Table_RiskAssessment[[#This Row],[W]]=1,\"b\",\"c\"),IF(Table_RiskAssessment[[#This Row],[W]]=1,\"c\",\"d\")),IF(Table_RiskAssessment[[#This Row],[P]]=1,IF(Table_RiskAssessment[[#This Row],[W]]=1,\"c\",\"d\"),IF(Table_RiskAssessment[[#This Row],[W]]=1,\"d\",\"e\")))),\"?\")","v":"?"},null,null,null,null,null,null,null,null,null,null,null,null,null,null,{"$f":"IF((Table_RiskAssessment[[#This Row],[S2]]* Table_RiskAssessment[[#This Row],[F2]]* Table_RiskAssessment[[#This Row],[P2]]>0),IF(Table_RiskAssessment[[#This Row],[S2]]=1,IF(Table_RiskAssessment[[#This Row],[F2]]=1,IF(Table_RiskAssessment[[#This Row],[P2]]=1,\"a\",IF(Table_RiskAssessment[[#This Row],[W2]]=1,\"a\",\"b\")),IF(Table_RiskAssessment[[#This Row],[P2]]=1,IF(Table_RiskAssessment[[#This Row],[W2]]=1,\"a\",\"b\"),IF(Table_RiskAssessment[[#This Row],[W2]]=1,\"b\",\"c\"))),IF(Table_RiskAssessment[[#This Row],[F2]]=1,IF(Table_RiskAssessment[[#This Row],[P2]]=1,IF(Table_RiskAssessment[[#This Row],[W2]]=1,\"b\",\"c\"),IF(Table_RiskAssessment[[#This Row],[W2]]=1,\"c\",\"d\")),IF(Table_RiskAssessment[[#This Row],[P2]]=1,IF(Table_RiskAssessment[[#This Row],[W2]]=1,\"c\",\"d\"),IF(Table_RiskAssessment[[#This Row],[W2]]=1,\"d\",\"e\")))),\"?\")","v":"?"},null,null,null,"-"]
[null,null,null,"2006 / 42","4.1.2.6.",{"$f":"Sprache!A$222","v":"Bewegungsbegrenzung"},"x","","x",null,null,null,null,null,null,null,null,null,null,null,null,null,null,null,null,null,null,null,null,null,null,null,null,{"$f":"IF((Table_RiskAssessment[[#This Row],[S]]* Table_RiskAssessment[[#This Row],[F]]* Table_RiskAssessment[[#This Row],[P]]>0),IF(Table_RiskAssessment[[#This Row],[S]]=1,IF(Table_RiskAssessment[[#This Row],[F]]=1,IF(Table_RiskAssessment[[#This Row],[P]]=1,\"a\",IF(Table_RiskAssessment[[#This Row],[W]]=1,\"a\",\"b\")),IF(Table_RiskAssessment[[#This Row],[P]]=1,IF(Table_RiskAssessment[[#This Row],[W]]=1,\"a\",\"b\"),IF(Table_RiskAssessment[[#This Row],[W]]=1,\"b\",\"c\"))),IF(Table_RiskAssessment[[#This Row],[F]]=1,IF(Table_RiskAssessment[[#This Row],[P]]=1,IF(Table_RiskAssessment[[#This Row],[W]]=1,\"b\",\"c\"),IF(Table_RiskAssessment[[#This Row],[W]]=1,\"c\",\"d\")),IF(Table_RiskAssessment[[#This Row],[P]]=1,IF(Table_RiskAssessment[[#This Row],[W]]=1,\"c\",\"d\"),IF(Table_RiskAssessment[[#This Row],[W]]=1,\"d\",\"e\")))),\"?\")","v":"?"},null,null,null,null,null,null,null,null,null,null,null,null,null,null,{"$f":"IF((Table_RiskAssessment[[#This Row],[S2]]* Table_RiskAssessment[[#This Row],[F2]]* Table_RiskAssessment[[#This Row],[P2]]>0),IF(Table_RiskAssessment[[#This Row],[S2]]=1,IF(Table_RiskAssessment[[#This Row],[F2]]=1,IF(Table_RiskAssessment[[#This Row],[P2]]=1,\"a\",IF(Table_RiskAssessment[[#This Row],[W2]]=1,\"a\",\"b\")),IF(Table_RiskAssessment[[#This Row],[P2]]=1,IF(Table_RiskAssessment[[#This Row],[W2]]=1,\"a\",\"b\"),IF(Table_RiskAssessment[[#This Row],[W2]]=1,\"b\",\"c\"))),IF(Table_RiskAssessment[[#This Row],[F2]]=1,IF(Table_RiskAssessment[[#This Row],[P2]]=1,IF(Table_RiskAssessment[[#This Row],[W2]]=1,\"b\",\"c\"),IF(Table_RiskAssessment[[#This Row],[W2]]=1,\"c\",\"d\")),IF(Table_RiskAssessment[[#This Row],[P2]]=1,IF(Table_RiskAssessment[[#This Row],[W2]]=1,\"c\",\"d\"),IF(Table_RiskAssessment[[#This Row],[W2]]=1,\"d\",\"e\")))),\"?\")","v":"?"},null,null,null,"-"]
[null,null,null,"2006 / 42","4.1.2.7.",{"$f":"Sprache!A$223","v":"Bewegungen von Lasten während der Benutzung"},"x","","x",null,null,null,null,null,null,null,null,null,null,null,null,null,null,null,null,null,null,null,null,null,null,null,null,{"$f":"IF((Table_RiskAssessment[[#This Row],[S]]* Table_RiskAssessment[[#This Row],[F]]* Table_RiskAssessment[[#This Row],[P]]>0),IF(Table_RiskAssessment[[#This Row],[S]]=1,IF(Table_RiskAssessment[[#This Row],[F]]=1,IF(Table_RiskAssessment[[#This Row],[P]]=1,\"a\",IF(Table_RiskAssessment[[#This Row],[W]]=1,\"a\",\"b\")),IF(Table_RiskAssessment[[#This Row],[P]]=1,IF(Table_RiskAssessment[[#This Row],[W]]=1,\"a\",\"b\"),IF(Table_RiskAssessment[[#This Row],[W]]=1,\"b\",\"c\"))),IF(Table_RiskAssessment[[#This Row],[F]]=1,IF(Table_RiskAssessment[[#This Row],[P]]=1,IF(Table_RiskAssessment[[#This Row],[W]]=1,\"b\",\"c\"),IF(Table_RiskAssessment[[#This Row],[W]]=1,\"c\",\"d\")),IF(Table_RiskAssessment[[#This Row],[P]]=1,IF(Table_RiskAssessment[[#This Row],[W]]=1,\"c\",\"d\"),IF(Table_RiskAssessment[[#This Row],[W]]=1,\"d\",\"e\")))),\"?\")","v":"?"},null,null,null,null,null,null,null,null,null,null,null,null,null,null,{"$f":"IF((Table_RiskAssessment[[#This Row],[S2]]* Table_RiskAssessment[[#This Row],[F2]]* Table_RiskAssessment[[#This Row],[P2]]>0),IF(Table_RiskAssessment[[#This Row],[S2]]=1,IF(Table_RiskAssessment[[#This Row],[F2]]=1,IF(Table_RiskAssessment[[#This Row],[P2]]=1,\"a\",IF(Table_RiskAssessment[[#This Row],[W2]]=1,\"a\",\"b\")),IF(Table_RiskAssessment[[#This Row],[P2]]=1,IF(Table_RiskAssessment[[#This Row],[W2]]=1,\"a\",\"b\"),IF(Table_RiskAssessment[[#This Row],[W2]]=1,\"b\",\"c\"))),IF(Table_RiskAssessment[[#This Row],[F2]]=1,IF(Table_RiskAssessment[[#This Row],[P2]]=1,IF(Table_RiskAssessment[[#This Row],[W2]]=1,\"b\",\"c\"),IF(Table_RiskAssessment[[#This Row],[W2]]=1,\"c\",\"d\")),IF(Table_RiskAssessment[[#This Row],[P2]]=1,IF(Table_RiskAssessment[[#This Row],[W2]]=1,\"c\",\"d\"),IF(Table_RiskAssessment[[#This Row],[W2]]=1,\"d\",\"e\")))),\"?\")","v":"?"},null,null,null,"-"]
[null,null,null,"2006 / 42","4.1.2.8.",{"$f":"Sprache!A$224","v":"Maschinen, die feste Ladestellen anfahren"},"x","x","x",null,null,null,null,null,null,null,null,null,null,null,null,null,null,null,null,null,null,null,null,null,null,null,null,{"$f":"IF((Table_RiskAssessment[[#This Row],[S]]* Table_RiskAssessment[[#This Row],[F]]* Table_RiskAssessment[[#This Row],[P]]>0),IF(Table_RiskAssessment[[#This Row],[S]]=1,IF(Table_RiskAssessment[[#This Row],[F]]=1,IF(Table_RiskAssessment[[#This Row],[P]]=1,\"a\",IF(Table_RiskAssessment[[#This Row],[W]]=1,\"a\",\"b\")),IF(Table_RiskAssessment[[#This Row],[P]]=1,IF(Table_RiskAssessment[[#This Row],[W]]=1,\"a\",\"b\"),IF(Table_RiskAssessment[[#This Row],[W]]=1,\"b\",\"c\"))),IF(Table_RiskAssessment[[#This Row],[F]]=1,IF(Table_RiskAssessment[[#This Row],[P]]=1,IF(Table_RiskAssessment[[#This Row],[W]]=1,\"b\",\"c\"),IF(Table_RiskAssessment[[#This Row],[W]]=1,\"c\",\"d\")),IF(Table_RiskAssessment[[#This Row],[P]]=1,IF(Table_RiskAssessment[[#This Row],[W]]=1,\"c\",\"d\"),IF(Table_RiskAssessment[[#This Row],[W]]=1,\"d\",\"e\")))),\"?\")","v":"?"},null,null,null,null,null,null,null,null,null,null,null,null,null,null,{"$f":"IF((Table_RiskAssessment[[#This Row],[S2]]* Table_RiskAssessment[[#This Row],[F2]]* Table_RiskAssessment[[#This Row],[P2]]>0),IF(Table_RiskAssessment[[#This Row],[S2]]=1,IF(Table_RiskAssessment[[#This Row],[F2]]=1,IF(Table_RiskAssessment[[#This Row],[P2]]=1,\"a\",IF(Table_RiskAssessment[[#This Row],[W2]]=1,\"a\",\"b\")),IF(Table_RiskAssessment[[#This Row],[P2]]=1,IF(Table_RiskAssessment[[#This Row],[W2]]=1,\"a\",\"b\"),IF(Table_RiskAssessment[[#This Row],[W2]]=1,\"b\",\"c\"))),IF(Table_RiskAssessment[[#This Row],[F2]]=1,IF(Table_RiskAssessment[[#This Row],[P2]]=1,IF(Table_RiskAssessment[[#This Row],[W2]]=1,\"b\",\"c\"),IF(Table_RiskAssessment[[#This Row],[W2]]=1,\"c\",\"d\")),IF(Table_RiskAssessment[[#This Row],[P2]]=1,IF(Table_RiskAssessment[[#This Row],[W2]]=1,\"c\",\"d\"),IF(Table_RiskAssessment[[#This Row],[W2]]=1,\"d\",\"e\")))),\"?\")","v":"?"},null,null,null,"-"]
[null,null,null,"2006 / 42","4.1.2.8.1.",{"$f":"Sprache!A$225","v":"Bewegungen des Lastträgers"},"x","","x",null,null,null,null,null,null,null,null,null,null,null,null,null,null,null,null,null,null,null,null,null,null,null,null,{"$f":"IF((Table_RiskAssessment[[#This Row],[S]]* Table_RiskAssessment[[#This Row],[F]]* Table_RiskAssessment[[#This Row],[P]]>0),IF(Table_RiskAssessment[[#This Row],[S]]=1,IF(Table_RiskAssessment[[#This Row],[F]]=1,IF(Table_RiskAssessment[[#This Row],[P]]=1,\"a\",IF(Table_RiskAssessment[[#This Row],[W]]=1,\"a\",\"b\")),IF(Table_RiskAssessment[[#This Row],[P]]=1,IF(Table_RiskAssessment[[#This Row],[W]]=1,\"a\",\"b\"),IF(Table_RiskAssessment[[#This Row],[W]]=1,\"b\",\"c\"))),IF(Table_RiskAssessment[[#This Row],[F]]=1,IF(Table_RiskAssessment[[#This Row],[P]]=1,IF(Table_RiskAssessment[[#This Row],[W]]=1,\"b\",\"c\"),IF(Table_RiskAssessment[[#This Row],[W]]=1,\"c\",\"d\")),IF(Table_RiskAssessment[[#This Row],[P]]=1,IF(Table_RiskAssessment[[#This Row],[W]]=1,\"c\",\"d\"),IF(Table_RiskAssessment[[#This Row],[W]]=1,\"d\",\"e\")))),\"?\")","v":"?"},null,null,null,null,null,null,null,null,null,null,null,null,null,null,{"$f":"IF((Table_RiskAssessment[[#This Row],[S2]]* Table_RiskAssessment[[#This Row],[F2]]* Table_RiskAssessment[[#This Row],[P2]]>0),IF(Table_RiskAssessment[[#This Row],[S2]]=1,IF(Table_RiskAssessment[[#This Row],[F2]]=1,IF(Table_RiskAssessment[[#This Row],[P2]]=1,\"a\",IF(Table_RiskAssessment[[#This Row],[W2]]=1,\"a\",\"b\")),IF(Table_RiskAssessment[[#This Row],[P2]]=1,IF(Table_RiskAssessment[[#This Row],[W2]]=1,\"a\",\"b\"),IF(Table_RiskAssessment[[#This Row],[W2]]=1,\"b\",\"c\"))),IF(Table_RiskAssessment[[#This Row],[F2]]=1,IF(Table_RiskAssessment[[#This Row],[P2]]=1,IF(Table_RiskAssessment[[#This Row],[W2]]=1,\"b\",\"c\"),IF(Table_RiskAssessment[[#This Row],[W2]]=1,\"c\",\"d\")),IF(Table_RiskAssessment[[#This Row],[P2]]=1,IF(Table_RiskAssessment[[#This Row],[W2]]=1,\"c\",\"d\"),IF(Table_RiskAssessment[[#This Row],[W2]]=1,\"d\",\"e\")))),\"?\")","v":"?"},null,null,null,"-"]
[null,null,null,"2006 / 42","4.1.2.8.2.",{"$f":"Sprache!A$226","v":"Zugang zum Lastträger"},"x","","x",null,null,null,null,null,null,null,null,null,null,null,null,null,null,null,null,null,null,null,null,null,null,null,null,{"$f":"IF((Table_RiskAssessment[[#This Row],[S]]* Table_RiskAssessment[[#This Row],[F]]* Table_RiskAssessment[[#This Row],[P]]>0),IF(Table_RiskAssessment[[#This Row],[S]]=1,IF(Table_RiskAssessment[[#This Row],[F]]=1,IF(Table_RiskAssessment[[#This Row],[P]]=1,\"a\",IF(Table_RiskAssessment[[#This Row],[W]]=1,\"a\",\"b\")),IF(Table_RiskAssessment[[#This Row],[P]]=1,IF(Table_RiskAssessment[[#This Row],[W]]=1,\"a\",\"b\"),IF(Table_RiskAssessment[[#This Row],[W]]=1,\"b\",\"c\"))),IF(Table_RiskAssessment[[#This Row],[F]]=1,IF(Table_RiskAssessment[[#This Row],[P]]=1,IF(Table_RiskAssessment[[#This Row],[W]]=1,\"b\",\"c\"),IF(Table_RiskAssessment[[#This Row],[W]]=1,\"c\",\"d\")),IF(Table_RiskAssessment[[#This Row],[P]]=1,IF(Table_RiskAssessment[[#This Row],[W]]=1,\"c\",\"d\"),IF(Table_RiskAssessment[[#This Row],[W]]=1,\"d\",\"e\")))),\"?\")","v":"?"},null,null,null,null,null,null,null,null,null,null,null,null,null,null,{"$f":"IF((Table_RiskAssessment[[#This Row],[S2]]* Table_RiskAssessment[[#This Row],[F2]]* Table_RiskAssessment[[#This Row],[P2]]>0),IF(Table_RiskAssessment[[#This Row],[S2]]=1,IF(Table_RiskAssessment[[#This Row],[F2]]=1,IF(Table_RiskAssessment[[#This Row],[P2]]=1,\"a\",IF(Table_RiskAssessment[[#This Row],[W2]]=1,\"a\",\"b\")),IF(Table_RiskAssessment[[#This Row],[P2]]=1,IF(Table_RiskAssessment[[#This Row],[W2]]=1,\"a\",\"b\"),IF(Table_RiskAssessment[[#This Row],[W2]]=1,\"b\",\"c\"))),IF(Table_RiskAssessment[[#This Row],[F2]]=1,IF(Table_RiskAssessment[[#This Row],[P2]]=1,IF(Table_RiskAssessment[[#This Row],[W2]]=1,\"b\",\"c\"),IF(Table_RiskAssessment[[#This Row],[W2]]=1,\"c\",\"d\")),IF(Table_RiskAssessment[[#This Row],[P2]]=1,IF(Table_RiskAssessment[[#This Row],[W2]]=1,\"c\",\"d\"),IF(Table_RiskAssessment[[#This Row],[W2]]=1,\"d\",\"e\")))),\"?\")","v":"?"},null,null,null,"-"]
[null,null,null,"2006 / 42","4.1.2.8.3.",{"$f":"Sprache!A$227","v":"Risiken durch Kontakt mit dem bewegten Lastträger"},"x","","x",null,null,null,null,null,null,null,null,null,null,null,null,null,null,null,null,null,null,null,null,null,null,null,null,{"$f":"IF((Table_RiskAssessment[[#This Row],[S]]* Table_RiskAssessment[[#This Row],[F]]* Table_RiskAssessment[[#This Row],[P]]>0),IF(Table_RiskAssessment[[#This Row],[S]]=1,IF(Table_RiskAssessment[[#This Row],[F]]=1,IF(Table_RiskAssessment[[#This Row],[P]]=1,\"a\",IF(Table_RiskAssessment[[#This Row],[W]]=1,\"a\",\"b\")),IF(Table_RiskAssessment[[#This Row],[P]]=1,IF(Table_RiskAssessment[[#This Row],[W]]=1,\"a\",\"b\"),IF(Table_RiskAssessment[[#This Row],[W]]=1,\"b\",\"c\"))),IF(Table_RiskAssessment[[#This Row],[F]]=1,IF(Table_RiskAssessment[[#This Row],[P]]=1,IF(Table_RiskAssessment[[#This Row],[W]]=1,\"b\",\"c\"),IF(Table_RiskAssessment[[#This Row],[W]]=1,\"c\",\"d\")),IF(Table_RiskAssessment[[#This Row],[P]]=1,IF(Table_RiskAssessment[[#This Row],[W]]=1,\"c\",\"d\"),IF(Table_RiskAssessment[[#This Row],[W]]=1,\"d\",\"e\")))),\"?\")","v":"?"},null,null,null,null,null,null,null,null,null,null,null,null,null,null,{"$f":"IF((Table_RiskAssessment[[#This Row],[S2]]* Table_RiskAssessment[[#This Row],[F2]]* Table_RiskAssessment[[#This Row],[P2]]>0),IF(Table_RiskAssessment[[#This Row],[S2]]=1,IF(Table_RiskAssessment[[#This Row],[F2]]=1,IF(Table_RiskAssessment[[#This Row],[P2]]=1,\"a\",IF(Table_RiskAssessment[[#This Row],[W2]]=1,\"a\",\"b\")),IF(Table_RiskAssessment[[#This Row],[P2]]=1,IF(Table_RiskAssessment[[#This Row],[W2]]=1,\"a\",\"b\"),IF(Table_RiskAssessment[[#This Row],[W2]]=1,\"b\",\"c\"))),IF(Table_RiskAssessment[[#This Row],[F2]]=1,IF(Table_RiskAssessment[[#This Row],[P2]]=1,IF(Table_RiskAssessment[[#This Row],[W2]]=1,\"b\",\"c\"),IF(Table_RiskAssessment[[#This Row],[W2]]=1,\"c\",\"d\")),IF(Table_RiskAssessment[[#This Row],[P2]]=1,IF(Table_RiskAssessment[[#This Row],[W2]]=1,\"c\",\"d\"),IF(Table_RiskAssessment[[#This Row],[W2]]=1,\"d\",\"e\")))),\"?\")","v":"?"},null,null,null,"-"]
[null,null,null,"2006 / 42","4.1.2.8.4.",{"$f":"Sprache!A$228","v":"Risiken durch vom Lastträger herabstürzende Lasten"},"x","","x",null,null,null,null,null,null,null,null,null,null,null,null,null,null,null,null,null,null,null,null,null,null,null,null,{"$f":"IF((Table_RiskAssessment[[#This Row],[S]]* Table_RiskAssessment[[#This Row],[F]]* Table_RiskAssessment[[#This Row],[P]]>0),IF(Table_RiskAssessment[[#This Row],[S]]=1,IF(Table_RiskAssessment[[#This Row],[F]]=1,IF(Table_RiskAssessment[[#This Row],[P]]=1,\"a\",IF(Table_RiskAssessment[[#This Row],[W]]=1,\"a\",\"b\")),IF(Table_RiskAssessment[[#This Row],[P]]=1,IF(Table_RiskAssessment[[#This Row],[W]]=1,\"a\",\"b\"),IF(Table_RiskAssessment[[#This Row],[W]]=1,\"b\",\"c\"))),IF(Table_RiskAssessment[[#This Row],[F]]=1,IF(Table_RiskAssessment[[#This Row],[P]]=1,IF(Table_RiskAssessment[[#This Row],[W]]=1,\"b\",\"c\"),IF(Table_RiskAssessment[[#This Row],[W]]=1,\"c\",\"d\")),IF(Table_RiskAssessment[[#This Row],[P]]=1,IF(Table_RiskAssessment[[#This Row],[W]]=1,\"c\",\"d\"),IF(Table_RiskAssessment[[#This Row],[W]]=1,\"d\",\"e\")))),\"?\")","v":"?"},null,null,null,null,null,null,null,null,null,null,null,null,null,null,{"$f":"IF((Table_RiskAssessment[[#This Row],[S2]]* Table_RiskAssessment[[#This Row],[F2]]* Table_RiskAssessment[[#This Row],[P2]]>0),IF(Table_RiskAssessment[[#This Row],[S2]]=1,IF(Table_RiskAssessment[[#This Row],[F2]]=1,IF(Table_RiskAssessment[[#This Row],[P2]]=1,\"a\",IF(Table_RiskAssessment[[#This Row],[W2]]=1,\"a\",\"b\")),IF(Table_RiskAssessment[[#This Row],[P2]]=1,IF(Table_RiskAssessment[[#This Row],[W2]]=1,\"a\",\"b\"),IF(Table_RiskAssessment[[#This Row],[W2]]=1,\"b\",\"c\"))),IF(Table_RiskAssessment[[#This Row],[F2]]=1,IF(Table_RiskAssessment[[#This Row],[P2]]=1,IF(Table_RiskAssessment[[#This Row],[W2]]=1,\"b\",\"c\"),IF(Table_RiskAssessment[[#This Row],[W2]]=1,\"c\",\"d\")),IF(Table_RiskAssessment[[#This Row],[P2]]=1,IF(Table_RiskAssessment[[#This Row],[W2]]=1,\"c\",\"d\"),IF(Table_RiskAssessment[[#This Row],[W2]]=1,\"d\",\"e\")))),\"?\")","v":"?"},null,null,null,"-"]
[null,null,null,"2006 / 42","4.1.2.8.5.",{"$f":"Sprache!A$229","v":"Ladestellen"},"x","","x",null,null,null,null,null,null,null,null,null,null,null,null,null,null,null,null,null,null,null,null,null,null,null,null,{"$f":"IF((Table_RiskAssessment[[#This Row],[S]]* Table_RiskAssessment[[#This Row],[F]]* Table_RiskAssessment[[#This Row],[P]]>0),IF(Table_RiskAssessment[[#This Row],[S]]=1,IF(Table_RiskAssessment[[#This Row],[F]]=1,IF(Table_RiskAssessment[[#This Row],[P]]=1,\"a\",IF(Table_RiskAssessment[[#This Row],[W]]=1,\"a\",\"b\")),IF(Table_RiskAssessment[[#This Row],[P]]=1,IF(Table_RiskAssessment[[#This Row],[W]]=1,\"a\",\"b\"),IF(Table_RiskAssessment[[#This Row],[W]]=1,\"b\",\"c\"))),IF(Table_RiskAssessment[[#This Row],[F]]=1,IF(Table_RiskAssessment[[#This Row],[P]]=1,IF(Table_RiskAssessment[[#This Row],[W]]=1,\"b\",\"c\"),IF(Table_RiskAssessment[[#This Row],[W]]=1,\"c\",\"d\")),IF(Table_RiskAssessment[[#This Row],[P]]=1,IF(Table_RiskAssessment[[#This Row],[W]]=1,\"c\",\"d\"),IF(Table_RiskAssessment[[#This Row],[W]]=1,\"d\",\"e\")))),\"?\")","v":"?"},null,null,null,null,null,null,null,null,null,null,null,null,null,null,{"$f":"IF((Table_RiskAssessment[[#This Row],[S2]]* Table_RiskAssessment[[#This Row],[F2]]* Table_RiskAssessment[[#This Row],[P2]]>0),IF(Table_RiskAssessment[[#This Row],[S2]]=1,IF(Table_RiskAssessment[[#This Row],[F2]]=1,IF(Table_RiskAssessment[[#This Row],[P2]]=1,\"a\",IF(Table_RiskAssessment[[#This Row],[W2]]=1,\"a\",\"b\")),IF(Table_RiskAssessment[[#This Row],[P2]]=1,IF(Table_RiskAssessment[[#This Row],[W2]]=1,\"a\",\"b\"),IF(Table_RiskAssessment[[#This Row],[W2]]=1,\"b\",\"c\"))),IF(Table_RiskAssessment[[#This Row],[F2]]=1,IF(Table_RiskAssessment[[#This Row],[P2]]=1,IF(Table_RiskAssessment[[#This Row],[W2]]=1,\"b\",\"c\"),IF(Table_RiskAssessment[[#This Row],[W2]]=1,\"c\",\"d\")),IF(Table_RiskAssessment[[#This Row],[P2]]=1,IF(Table_RiskAssessment[[#This Row],[W2]]=1,\"c\",\"d\"),IF(Table_RiskAssessment[[#This Row],[W2]]=1,\"d\",\"e\")))),\"?\")","v":"?"},null,null,null,"-"]
[null,null,null,"2006 / 42","4.1.3.",{"$f":"Sprache!A$230","v":"Zwecktauglichkeit"},"x","","x",null,null,null,null,null,null,null,null,null,null,null,null,null,null,null,null,null,null,null,null,null,null,null,null,{"$f":"IF((Table_RiskAssessment[[#This Row],[S]]* Table_RiskAssessment[[#This Row],[F]]* Table_RiskAssessment[[#This Row],[P]]>0),IF(Table_RiskAssessment[[#This Row],[S]]=1,IF(Table_RiskAssessment[[#This Row],[F]]=1,IF(Table_RiskAssessment[[#This Row],[P]]=1,\"a\",IF(Table_RiskAssessment[[#This Row],[W]]=1,\"a\",\"b\")),IF(Table_RiskAssessment[[#This Row],[P]]=1,IF(Table_RiskAssessment[[#This Row],[W]]=1,\"a\",\"b\"),IF(Table_RiskAssessment[[#This Row],[W]]=1,\"b\",\"c\"))),IF(Table_RiskAssessment[[#This Row],[F]]=1,IF(Table_RiskAssessment[[#This Row],[P]]=1,IF(Table_RiskAssessment[[#This Row],[W]]=1,\"b\",\"c\"),IF(Table_RiskAssessment[[#This Row],[W]]=1,\"c\",\"d\")),IF(Table_RiskAssessment[[#This Row],[P]]=1,IF(Table_RiskAssessment[[#This Row],[W]]=1,\"c\",\"d\"),IF(Table_RiskAssessment[[#This Row],[W]]=1,\"d\",\"e\")))),\"?\")","v":"?"},null,null,null,null,null,null,null,null,null,null,null,null,null,null,{"$f":"IF((Table_RiskAssessment[[#This Row],[S2]]* Table_RiskAssessment[[#This Row],[F2]]* Table_RiskAssessment[[#This Row],[P2]]>0),IF(Table_RiskAssessment[[#This Row],[S2]]=1,IF(Table_RiskAssessment[[#This Row],[F2]]=1,IF(Table_RiskAssessment[[#This Row],[P2]]=1,\"a\",IF(Table_RiskAssessment[[#This Row],[W2]]=1,\"a\",\"b\")),IF(Table_RiskAssessment[[#This Row],[P2]]=1,IF(Table_RiskAssessment[[#This Row],[W2]]=1,\"a\",\"b\"),IF(Table_RiskAssessment[[#This Row],[W2]]=1,\"b\",\"c\"))),IF(Table_RiskAssessment[[#This Row],[F2]]=1,IF(Table_RiskAssessment[[#This Row],[P2]]=1,IF(Table_RiskAssessment[[#This Row],[W2]]=1,\"b\",\"c\"),IF(Table_RiskAssessment[[#This Row],[W2]]=1,\"c\",\"d\")),IF(Table_RiskAssessment[[#This Row],[P2]]=1,IF(Table_RiskAssessment[[#This Row],[W2]]=1,\"c\",\"d\"),IF(Table_RiskAssessment[[#This Row],[W2]]=1,\"d\",\"e\")))),\"?\")","v":"?"},null,null,null,"-"]
[null,null,null,"2006 / 42","4.2.",{"$f":"Sprache!A$231","v":"Anforderungen an Maschinen, die nicht durch menschliche Kraft angetrieben werden"},"x","x","x",null,null,null,null,null,null,null,null,null,null,null,null,null,null,null,null,null,null,null,null,null,null,null,null,{"$f":"IF((Table_RiskAssessment[[#This Row],[S]]* Table_RiskAssessment[[#This Row],[F]]* Table_RiskAssessment[[#This Row],[P]]>0),IF(Table_RiskAssessment[[#This Row],[S]]=1,IF(Table_RiskAssessment[[#This Row],[F]]=1,IF(Table_RiskAssessment[[#This Row],[P]]=1,\"a\",IF(Table_RiskAssessment[[#This Row],[W]]=1,\"a\",\"b\")),IF(Table_RiskAssessment[[#This Row],[P]]=1,IF(Table_RiskAssessment[[#This Row],[W]]=1,\"a\",\"b\"),IF(Table_RiskAssessment[[#This Row],[W]]=1,\"b\",\"c\"))),IF(Table_RiskAssessment[[#This Row],[F]]=1,IF(Table_RiskAssessment[[#This Row],[P]]=1,IF(Table_RiskAssessment[[#This Row],[W]]=1,\"b\",\"c\"),IF(Table_RiskAssessment[[#This Row],[W]]=1,\"c\",\"d\")),IF(Table_RiskAssessment[[#This Row],[P]]=1,IF(Table_RiskAssessment[[#This Row],[W]]=1,\"c\",\"d\"),IF(Table_RiskAssessment[[#This Row],[W]]=1,\"d\",\"e\")))),\"?\")","v":"?"},null,null,null,null,null,null,null,null,null,null,null,null,null,null,{"$f":"IF((Table_RiskAssessment[[#This Row],[S2]]* Table_RiskAssessment[[#This Row],[F2]]* Table_RiskAssessment[[#This Row],[P2]]>0),IF(Table_RiskAssessment[[#This Row],[S2]]=1,IF(Table_RiskAssessment[[#This Row],[F2]]=1,IF(Table_RiskAssessment[[#This Row],[P2]]=1,\"a\",IF(Table_RiskAssessment[[#This Row],[W2]]=1,\"a\",\"b\")),IF(Table_RiskAssessment[[#This Row],[P2]]=1,IF(Table_RiskAssessment[[#This Row],[W2]]=1,\"a\",\"b\"),IF(Table_RiskAssessment[[#This Row],[W2]]=1,\"b\",\"c\"))),IF(Table_RiskAssessment[[#This Row],[F2]]=1,IF(Table_RiskAssessment[[#This Row],[P2]]=1,IF(Table_RiskAssessment[[#This Row],[W2]]=1,\"b\",\"c\"),IF(Table_RiskAssessment[[#This Row],[W2]]=1,\"c\",\"d\")),IF(Table_RiskAssessment[[#This Row],[P2]]=1,IF(Table_RiskAssessment[[#This Row],[W2]]=1,\"c\",\"d\"),IF(Table_RiskAssessment[[#This Row],[W2]]=1,\"d\",\"e\")))),\"?\")","v":"?"},null,null,null,"-"]
[null,null,null,"2006 / 42","4.2.1.",{"$f":"Sprache!A$232","v":"Bewegungssteuerung"},"x","","x",null,null,null,null,null,null,null,null,null,null,null,null,null,null,null,null,null,null,null,null,null,null,null,null,{"$f":"IF((Table_RiskAssessment[[#This Row],[S]]* Table_RiskAssessment[[#This Row],[F]]* Table_RiskAssessment[[#This Row],[P]]>0),IF(Table_RiskAssessment[[#This Row],[S]]=1,IF(Table_RiskAssessment[[#This Row],[F]]=1,IF(Table_RiskAssessment[[#This Row],[P]]=1,\"a\",IF(Table_RiskAssessment[[#This Row],[W]]=1,\"a\",\"b\")),IF(Table_RiskAssessment[[#This Row],[P]]=1,IF(Table_RiskAssessment[[#This Row],[W]]=1,\"a\",\"b\"),IF(Table_RiskAssessment[[#This Row],[W]]=1,\"b\",\"c\"))),IF(Table_RiskAssessment[[#This Row],[F]]=1,IF(Table_RiskAssessment[[#This Row],[P]]=1,IF(Table_RiskAssessment[[#This Row],[W]]=1,\"b\",\"c\"),IF(Table_RiskAssessment[[#This Row],[W]]=1,\"c\",\"d\")),IF(Table_RiskAssessment[[#This Row],[P]]=1,IF(Table_RiskAssessment[[#This Row],[W]]=1,\"c\",\"d\"),IF(Table_RiskAssessment[[#This Row],[W]]=1,\"d\",\"e\")))),\"?\")","v":"?"},null,null,null,null,null,null,null,null,null,null,null,null,null,null,{"$f":"IF((Table_RiskAssessment[[#This Row],[S2]]* Table_RiskAssessment[[#This Row],[F2]]* Table_RiskAssessment[[#This Row],[P2]]>0),IF(Table_RiskAssessment[[#This Row],[S2]]=1,IF(Table_RiskAssessment[[#This Row],[F2]]=1,IF(Table_RiskAssessment[[#This Row],[P2]]=1,\"a\",IF(Table_RiskAssessment[[#This Row],[W2]]=1,\"a\",\"b\")),IF(Table_RiskAssessment[[#This Row],[P2]]=1,IF(Table_RiskAssessment[[#This Row],[W2]]=1,\"a\",\"b\"),IF(Table_RiskAssessment[[#This Row],[W2]]=1,\"b\",\"c\"))),IF(Table_RiskAssessment[[#This Row],[F2]]=1,IF(Table_RiskAssessment[[#This Row],[P2]]=1,IF(Table_RiskAssessment[[#This Row],[W2]]=1,\"b\",\"c\"),IF(Table_RiskAssessment[[#This Row],[W2]]=1,\"c\",\"d\")),IF(Table_RiskAssessment[[#This Row],[P2]]=1,IF(Table_RiskAssessment[[#This Row],[W2]]=1,\"c\",\"d\"),IF(Table_RiskAssessment[[#This Row],[W2]]=1,\"d\",\"e\")))),\"?\")","v":"?"},null,null,null,"-"]
[null,null,null,"2006 / 42","4.2.2.",{"$f":"Sprache!A$233","v":"Belastungsbegrenzung"},"x","","x",null,null,null,null,null,null,null,null,null,null,null,null,null,null,null,null,null,null,null,null,null,null,null,null,{"$f":"IF((Table_RiskAssessment[[#This Row],[S]]* Table_RiskAssessment[[#This Row],[F]]* Table_RiskAssessment[[#This Row],[P]]>0),IF(Table_RiskAssessment[[#This Row],[S]]=1,IF(Table_RiskAssessment[[#This Row],[F]]=1,IF(Table_RiskAssessment[[#This Row],[P]]=1,\"a\",IF(Table_RiskAssessment[[#This Row],[W]]=1,\"a\",\"b\")),IF(Table_RiskAssessment[[#This Row],[P]]=1,IF(Table_RiskAssessment[[#This Row],[W]]=1,\"a\",\"b\"),IF(Table_RiskAssessment[[#This Row],[W]]=1,\"b\",\"c\"))),IF(Table_RiskAssessment[[#This Row],[F]]=1,IF(Table_RiskAssessment[[#This Row],[P]]=1,IF(Table_RiskAssessment[[#This Row],[W]]=1,\"b\",\"c\"),IF(Table_RiskAssessment[[#This Row],[W]]=1,\"c\",\"d\")),IF(Table_RiskAssessment[[#This Row],[P]]=1,IF(Table_RiskAssessment[[#This Row],[W]]=1,\"c\",\"d\"),IF(Table_RiskAssessment[[#This Row],[W]]=1,\"d\",\"e\")))),\"?\")","v":"?"},null,null,null,null,null,null,null,null,null,null,null,null,null,null,{"$f":"IF((Table_RiskAssessment[[#This Row],[S2]]* Table_RiskAssessment[[#This Row],[F2]]* Table_RiskAssessment[[#This Row],[P2]]>0),IF(Table_RiskAssessment[[#This Row],[S2]]=1,IF(Table_RiskAssessment[[#This Row],[F2]]=1,IF(Table_RiskAssessment[[#This Row],[P2]]=1,\"a\",IF(Table_RiskAssessment[[#This Row],[W2]]=1,\"a\",\"b\")),IF(Table_RiskAssessment[[#This Row],[P2]]=1,IF(Table_RiskAssessment[[#This Row],[W2]]=1,\"a\",\"b\"),IF(Table_RiskAssessment[[#This Row],[W2]]=1,\"b\",\"c\"))),IF(Table_RiskAssessment[[#This Row],[F2]]=1,IF(Table_RiskAssessment[[#This Row],[P2]]=1,IF(Table_RiskAssessment[[#This Row],[W2]]=1,\"b\",\"c\"),IF(Table_RiskAssessment[[#This Row],[W2]]=1,\"c\",\"d\")),IF(Table_RiskAssessment[[#This Row],[P2]]=1,IF(Table_RiskAssessment[[#This Row],[W2]]=1,\"c\",\"d\"),IF(Table_RiskAssessment[[#This Row],[W2]]=1,\"d\",\"e\")))),\"?\")","v":"?"},null,null,null,"-"]
[null,null,null,"2006 / 42","4.2.3.",{"$f":"Sprache!A$234","v":"Seilgeführte Einrichtungen"},"x","","x",null,null,null,null,null,null,null,null,null,null,null,null,null,null,null,null,null,null,null,null,null,null,null,null,{"$f":"IF((Table_RiskAssessment[[#This Row],[S]]* Table_RiskAssessment[[#This Row],[F]]* Table_RiskAssessment[[#This Row],[P]]>0),IF(Table_RiskAssessment[[#This Row],[S]]=1,IF(Table_RiskAssessment[[#This Row],[F]]=1,IF(Table_RiskAssessment[[#This Row],[P]]=1,\"a\",IF(Table_RiskAssessment[[#This Row],[W]]=1,\"a\",\"b\")),IF(Table_RiskAssessment[[#This Row],[P]]=1,IF(Table_RiskAssessment[[#This Row],[W]]=1,\"a\",\"b\"),IF(Table_RiskAssessment[[#This Row],[W]]=1,\"b\",\"c\"))),IF(Table_RiskAssessment[[#This Row],[F]]=1,IF(Table_RiskAssessment[[#This Row],[P]]=1,IF(Table_RiskAssessment[[#This Row],[W]]=1,\"b\",\"c\"),IF(Table_RiskAssessment[[#This Row],[W]]=1,\"c\",\"d\")),IF(Table_RiskAssessment[[#This Row],[P]]=1,IF(Table_RiskAssessment[[#This Row],[W]]=1,\"c\",\"d\"),IF(Table_RiskAssessment[[#This Row],[W]]=1,\"d\",\"e\")))),\"?\")","v":"?"},null,null,null,null,null,null,null,null,null,null,null,null,null,null,{"$f":"IF((Table_RiskAssessment[[#This Row],[S2]]* Table_RiskAssessment[[#This Row],[F2]]* Table_RiskAssessment[[#This Row],[P2]]>0),IF(Table_RiskAssessment[[#This Row],[S2]]=1,IF(Table_RiskAssessment[[#This Row],[F2]]=1,IF(Table_RiskAssessment[[#This Row],[P2]]=1,\"a\",IF(Table_RiskAssessment[[#This Row],[W2]]=1,\"a\",\"b\")),IF(Table_RiskAssessment[[#This Row],[P2]]=1,IF(Table_RiskAssessment[[#This Row],[W2]]=1,\"a\",\"b\"),IF(Table_RiskAssessment[[#This Row],[W2]]=1,\"b\",\"c\"))),IF(Table_RiskAssessment[[#This Row],[F2]]=1,IF(Table_RiskAssessment[[#This Row],[P2]]=1,IF(Table_RiskAssessment[[#This Row],[W2]]=1,\"b\",\"c\"),IF(Table_RiskAssessment[[#This Row],[W2]]=1,\"c\",\"d\")),IF(Table_RiskAssessment[[#This Row],[P2]]=1,IF(Table_RiskAssessment[[#This Row],[W2]]=1,\"c\",\"d\"),IF(Table_RiskAssessment[[#This Row],[W2]]=1,\"d\",\"e\")))),\"?\")","v":"?"},null,null,null,"-"]
[null,null,null,"2006 / 42","4.3.",{"$f":"Sprache!A$235","v":"Informationen und Kennzeichnung"},"x","x","x",null,null,null,null,null,null,null,null,null,null,null,null,null,null,null,null,null,null,null,null,null,null,null,null,{"$f":"IF((Table_RiskAssessment[[#This Row],[S]]* Table_RiskAssessment[[#This Row],[F]]* Table_RiskAssessment[[#This Row],[P]]>0),IF(Table_RiskAssessment[[#This Row],[S]]=1,IF(Table_RiskAssessment[[#This Row],[F]]=1,IF(Table_RiskAssessment[[#This Row],[P]]=1,\"a\",IF(Table_RiskAssessment[[#This Row],[W]]=1,\"a\",\"b\")),IF(Table_RiskAssessment[[#This Row],[P]]=1,IF(Table_RiskAssessment[[#This Row],[W]]=1,\"a\",\"b\"),IF(Table_RiskAssessment[[#This Row],[W]]=1,\"b\",\"c\"))),IF(Table_RiskAssessment[[#This Row],[F]]=1,IF(Table_RiskAssessment[[#This Row],[P]]=1,IF(Table_RiskAssessment[[#This Row],[W]]=1,\"b\",\"c\"),IF(Table_RiskAssessment[[#This Row],[W]]=1,\"c\",\"d\")),IF(Table_RiskAssessment[[#This Row],[P]]=1,IF(Table_RiskAssessment[[#This Row],[W]]=1,\"c\",\"d\"),IF(Table_RiskAssessment[[#This Row],[W]]=1,\"d\",\"e\")))),\"?\")","v":"?"},null,null,null,null,null,null,null,null,null,null,null,null,null,null,{"$f":"IF((Table_RiskAssessment[[#This Row],[S2]]* Table_RiskAssessment[[#This Row],[F2]]* Table_RiskAssessment[[#This Row],[P2]]>0),IF(Table_RiskAssessment[[#This Row],[S2]]=1,IF(Table_RiskAssessment[[#This Row],[F2]]=1,IF(Table_RiskAssessment[[#This Row],[P2]]=1,\"a\",IF(Table_RiskAssessment[[#This Row],[W2]]=1,\"a\",\"b\")),IF(Table_RiskAssessment[[#This Row],[P2]]=1,IF(Table_RiskAssessment[[#This Row],[W2]]=1,\"a\",\"b\"),IF(Table_RiskAssessment[[#This Row],[W2]]=1,\"b\",\"c\"))),IF(Table_RiskAssessment[[#This Row],[F2]]=1,IF(Table_RiskAssessment[[#This Row],[P2]]=1,IF(Table_RiskAssessment[[#This Row],[W2]]=1,\"b\",\"c\"),IF(Table_RiskAssessment[[#This Row],[W2]]=1,\"c\",\"d\")),IF(Table_RiskAssessment[[#This Row],[P2]]=1,IF(Table_RiskAssessment[[#This Row],[W2]]=1,\"c\",\"d\"),IF(Table_RiskAssessment[[#This Row],[W2]]=1,\"d\",\"e\")))),\"?\")","v":"?"},null,null,null,"-"]
[null,null,null,"2006 / 42","4.3.1.",{"$f":"Sprache!A$236","v":"Ketten, Seile und Gurte"},"x","","x",null,null,null,null,null,null,null,null,null,null,null,null,null,null,null,null,null,null,null,null,null,null,null,null,{"$f":"IF((Table_RiskAssessment[[#This Row],[S]]* Table_RiskAssessment[[#This Row],[F]]* Table_RiskAssessment[[#This Row],[P]]>0),IF(Table_RiskAssessment[[#This Row],[S]]=1,IF(Table_RiskAssessment[[#This Row],[F]]=1,IF(Table_RiskAssessment[[#This Row],[P]]=1,\"a\",IF(Table_RiskAssessment[[#This Row],[W]]=1,\"a\",\"b\")),IF(Table_RiskAssessment[[#This Row],[P]]=1,IF(Table_RiskAssessment[[#This Row],[W]]=1,\"a\",\"b\"),IF(Table_RiskAssessment[[#This Row],[W]]=1,\"b\",\"c\"))),IF(Table_RiskAssessment[[#This Row],[F]]=1,IF(Table_RiskAssessment[[#This Row],[P]]=1,IF(Table_RiskAssessment[[#This Row],[W]]=1,\"b\",\"c\"),IF(Table_RiskAssessment[[#This Row],[W]]=1,\"c\",\"d\")),IF(Table_RiskAssessment[[#This Row],[P]]=1,IF(Table_RiskAssessment[[#This Row],[W]]=1,\"c\",\"d\"),IF(Table_RiskAssessment[[#This Row],[W]]=1,\"d\",\"e\")))),\"?\")","v":"?"},null,null,null,null,null,null,null,null,null,null,null,null,null,null,{"$f":"IF((Table_RiskAssessment[[#This Row],[S2]]* Table_RiskAssessment[[#This Row],[F2]]* Table_RiskAssessment[[#This Row],[P2]]>0),IF(Table_RiskAssessment[[#This Row],[S2]]=1,IF(Table_RiskAssessment[[#This Row],[F2]]=1,IF(Table_RiskAssessment[[#This Row],[P2]]=1,\"a\",IF(Table_RiskAssessment[[#This Row],[W2]]=1,\"a\",\"b\")),IF(Table_RiskAssessment[[#This Row],[P2]]=1,IF(Table_RiskAssessment[[#This Row],[W2]]=1,\"a\",\"b\"),IF(Table_RiskAssessment[[#This Row],[W2]]=1,\"b\",\"c\"))),IF(Table_RiskAssessment[[#This Row],[F2]]=1,IF(Table_RiskAssessment[[#This Row],[P2]]=1,IF(Table_RiskAssessment[[#This Row],[W2]]=1,\"b\",\"c\"),IF(Table_RiskAssessment[[#This Row],[W2]]=1,\"c\",\"d\")),IF(Table_RiskAssessment[[#This Row],[P2]]=1,IF(Table_RiskAssessment[[#This Row],[W2]]=1,\"c\",\"d\"),IF(Table_RiskAssessment[[#This Row],[W2]]=1,\"d\",\"e\")))),\"?\")","v":"?"},null,null,null,"-"]
[null,null,null,"2006 / 42","4.3.2.",{"$f":"Sprache!A$237","v":"Lastaufnahmemittel"},"x","","x",null,null,null,null,null,null,null,null,null,null,null,null,null,null,null,null,null,null,null,null,null,null,null,null,{"$f":"IF((Table_RiskAssessment[[#This Row],[S]]* Table_RiskAssessment[[#This Row],[F]]* Table_RiskAssessment[[#This Row],[P]]>0),IF(Table_RiskAssessment[[#This Row],[S]]=1,IF(Table_RiskAssessment[[#This Row],[F]]=1,IF(Table_RiskAssessment[[#This Row],[P]]=1,\"a\",IF(Table_RiskAssessment[[#This Row],[W]]=1,\"a\",\"b\")),IF(Table_RiskAssessment[[#This Row],[P]]=1,IF(Table_RiskAssessment[[#This Row],[W]]=1,\"a\",\"b\"),IF(Table_RiskAssessment[[#This Row],[W]]=1,\"b\",\"c\"))),IF(Table_RiskAssessment[[#This Row],[F]]=1,IF(Table_RiskAssessment[[#This Row],[P]]=1,IF(Table_RiskAssessment[[#This Row],[W]]=1,\"b\",\"c\"),IF(Table_RiskAssessment[[#This Row],[W]]=1,\"c\",\"d\")),IF(Table_RiskAssessment[[#This Row],[P]]=1,IF(Table_RiskAssessment[[#This Row],[W]]=1,\"c\",\"d\"),IF(Table_RiskAssessment[[#This Row],[W]]=1,\"d\",\"e\")))),\"?\")","v":"?"},null,null,null,null,null,null,null,null,null,null,null,null,null,null,{"$f":"IF((Table_RiskAssessment[[#This Row],[S2]]* Table_RiskAssessment[[#This Row],[F2]]* Table_RiskAssessment[[#This Row],[P2]]>0),IF(Table_RiskAssessment[[#This Row],[S2]]=1,IF(Table_RiskAssessment[[#This Row],[F2]]=1,IF(Table_RiskAssessment[[#This Row],[P2]]=1,\"a\",IF(Table_RiskAssessment[[#This Row],[W2]]=1,\"a\",\"b\")),IF(Table_RiskAssessment[[#This Row],[P2]]=1,IF(Table_RiskAssessment[[#This Row],[W2]]=1,\"a\",\"b\"),IF(Table_RiskAssessment[[#This Row],[W2]]=1,\"b\",\"c\"))),IF(Table_RiskAssessment[[#This Row],[F2]]=1,IF(Table_RiskAssessment[[#This Row],[P2]]=1,IF(Table_RiskAssessment[[#This Row],[W2]]=1,\"b\",\"c\"),IF(Table_RiskAssessment[[#This Row],[W2]]=1,\"c\",\"d\")),IF(Table_RiskAssessment[[#This Row],[P2]]=1,IF(Table_RiskAssessment[[#This Row],[W2]]=1,\"c\",\"d\"),IF(Table_RiskAssessment[[#This Row],[W2]]=1,\"d\",\"e\")))),\"?\")","v":"?"},null,null,null,"-"]
[null,null,null,"2006 / 42","4.3.3.",{"$f":"Sprache!A$238","v":"Maschinen zum Heben von Lasten"},"x","","x",null,null,null,null,null,null,null,null,null,null,null,null,null,null,null,null,null,null,null,null,null,null,null,null,{"$f":"IF((Table_RiskAssessment[[#This Row],[S]]* Table_RiskAssessment[[#This Row],[F]]* Table_RiskAssessment[[#This Row],[P]]>0),IF(Table_RiskAssessment[[#This Row],[S]]=1,IF(Table_RiskAssessment[[#This Row],[F]]=1,IF(Table_RiskAssessment[[#This Row],[P]]=1,\"a\",IF(Table_RiskAssessment[[#This Row],[W]]=1,\"a\",\"b\")),IF(Table_RiskAssessment[[#This Row],[P]]=1,IF(Table_RiskAssessment[[#This Row],[W]]=1,\"a\",\"b\"),IF(Table_RiskAssessment[[#This Row],[W]]=1,\"b\",\"c\"))),IF(Table_RiskAssessment[[#This Row],[F]]=1,IF(Table_RiskAssessment[[#This Row],[P]]=1,IF(Table_RiskAssessment[[#This Row],[W]]=1,\"b\",\"c\"),IF(Table_RiskAssessment[[#This Row],[W]]=1,\"c\",\"d\")),IF(Table_RiskAssessment[[#This Row],[P]]=1,IF(Table_RiskAssessment[[#This Row],[W]]=1,\"c\",\"d\"),IF(Table_RiskAssessment[[#This Row],[W]]=1,\"d\",\"e\")))),\"?\")","v":"?"},null,null,null,null,null,null,null,null,null,null,null,null,null,null,{"$f":"IF((Table_RiskAssessment[[#This Row],[S2]]* Table_RiskAssessment[[#This Row],[F2]]* Table_RiskAssessment[[#This Row],[P2]]>0),IF(Table_RiskAssessment[[#This Row],[S2]]=1,IF(Table_RiskAssessment[[#This Row],[F2]]=1,IF(Table_RiskAssessment[[#This Row],[P2]]=1,\"a\",IF(Table_RiskAssessment[[#This Row],[W2]]=1,\"a\",\"b\")),IF(Table_RiskAssessment[[#This Row],[P2]]=1,IF(Table_RiskAssessment[[#This Row],[W2]]=1,\"a\",\"b\"),IF(Table_RiskAssessment[[#This Row],[W2]]=1,\"b\",\"c\"))),IF(Table_RiskAssessment[[#This Row],[F2]]=1,IF(Table_RiskAssessment[[#This Row],[P2]]=1,IF(Table_RiskAssessment[[#This Row],[W2]]=1,\"b\",\"c\"),IF(Table_RiskAssessment[[#This Row],[W2]]=1,\"c\",\"d\")),IF(Table_RiskAssessment[[#This Row],[P2]]=1,IF(Table_RiskAssessment[[#This Row],[W2]]=1,\"c\",\"d\"),IF(Table_RiskAssessment[[#This Row],[W2]]=1,\"d\",\"e\")))),\"?\")","v":"?"},null,null,null,"-"]
[null,null,null,"2006 / 42","4.4.",{"$f":"Sprache!A$239","v":"Betriebsanleitung"},"x","x","x",null,null,null,null,null,null,null,null,null,null,null,null,null,null,null,null,null,null,null,null,null,null,null,null,{"$f":"IF((Table_RiskAssessment[[#This Row],[S]]* Table_RiskAssessment[[#This Row],[F]]* Table_RiskAssessment[[#This Row],[P]]>0),IF(Table_RiskAssessment[[#This Row],[S]]=1,IF(Table_RiskAssessment[[#This Row],[F]]=1,IF(Table_RiskAssessment[[#This Row],[P]]=1,\"a\",IF(Table_RiskAssessment[[#This Row],[W]]=1,\"a\",\"b\")),IF(Table_RiskAssessment[[#This Row],[P]]=1,IF(Table_RiskAssessment[[#This Row],[W]]=1,\"a\",\"b\"),IF(Table_RiskAssessment[[#This Row],[W]]=1,\"b\",\"c\"))),IF(Table_RiskAssessment[[#This Row],[F]]=1,IF(Table_RiskAssessment[[#This Row],[P]]=1,IF(Table_RiskAssessment[[#This Row],[W]]=1,\"b\",\"c\"),IF(Table_RiskAssessment[[#This Row],[W]]=1,\"c\",\"d\")),IF(Table_RiskAssessment[[#This Row],[P]]=1,IF(Table_RiskAssessment[[#This Row],[W]]=1,\"c\",\"d\"),IF(Table_RiskAssessment[[#This Row],[W]]=1,\"d\",\"e\")))),\"?\")","v":"?"},null,null,null,null,null,null,null,null,null,null,null,null,null,null,{"$f":"IF((Table_RiskAssessment[[#This Row],[S2]]* Table_RiskAssessment[[#This Row],[F2]]* Table_RiskAssessment[[#This Row],[P2]]>0),IF(Table_RiskAssessment[[#This Row],[S2]]=1,IF(Table_RiskAssessment[[#This Row],[F2]]=1,IF(Table_RiskAssessment[[#This Row],[P2]]=1,\"a\",IF(Table_RiskAssessment[[#This Row],[W2]]=1,\"a\",\"b\")),IF(Table_RiskAssessment[[#This Row],[P2]]=1,IF(Table_RiskAssessment[[#This Row],[W2]]=1,\"a\",\"b\"),IF(Table_RiskAssessment[[#This Row],[W2]]=1,\"b\",\"c\"))),IF(Table_RiskAssessment[[#This Row],[F2]]=1,IF(Table_RiskAssessment[[#This Row],[P2]]=1,IF(Table_RiskAssessment[[#This Row],[W2]]=1,\"b\",\"c\"),IF(Table_RiskAssessment[[#This Row],[W2]]=1,\"c\",\"d\")),IF(Table_RiskAssessment[[#This Row],[P2]]=1,IF(Table_RiskAssessment[[#This Row],[W2]]=1,\"c\",\"d\"),IF(Table_RiskAssessment[[#This Row],[W2]]=1,\"d\",\"e\")))),\"?\")","v":"?"},null,null,null,"-"]
[null,null,null,"2006 / 42","4.4.1.",{"$f":"Sprache!A$240","v":"Lastaufnahmemittel"},"x","","x",null,null,null,null,null,null,null,null,null,null,null,null,null,null,null,null,null,null,null,null,null,null,null,null,{"$f":"IF((Table_RiskAssessment[[#This Row],[S]]* Table_RiskAssessment[[#This Row],[F]]* Table_RiskAssessment[[#This Row],[P]]>0),IF(Table_RiskAssessment[[#This Row],[S]]=1,IF(Table_RiskAssessment[[#This Row],[F]]=1,IF(Table_RiskAssessment[[#This Row],[P]]=1,\"a\",IF(Table_RiskAssessment[[#This Row],[W]]=1,\"a\",\"b\")),IF(Table_RiskAssessment[[#This Row],[P]]=1,IF(Table_RiskAssessment[[#This Row],[W]]=1,\"a\",\"b\"),IF(Table_RiskAssessment[[#This Row],[W]]=1,\"b\",\"c\"))),IF(Table_RiskAssessment[[#This Row],[F]]=1,IF(Table_RiskAssessment[[#This Row],[P]]=1,IF(Table_RiskAssessment[[#This Row],[W]]=1,\"b\",\"c\"),IF(Table_RiskAssessment[[#This Row],[W]]=1,\"c\",\"d\")),IF(Table_RiskAssessment[[#This Row],[P]]=1,IF(Table_RiskAssessment[[#This Row],[W]]=1,\"c\",\"d\"),IF(Table_RiskAssessment[[#This Row],[W]]=1,\"d\",\"e\")))),\"?\")","v":"?"},null,null,null,null,null,null,null,null,null,null,null,null,null,null,{"$f":"IF((Table_RiskAssessment[[#This Row],[S2]]* Table_RiskAssessment[[#This Row],[F2]]* Table_RiskAssessment[[#This Row],[P2]]>0),IF(Table_RiskAssessment[[#This Row],[S2]]=1,IF(Table_RiskAssessment[[#This Row],[F2]]=1,IF(Table_RiskAssessment[[#This Row],[P2]]=1,\"a\",IF(Table_RiskAssessment[[#This Row],[W2]]=1,\"a\",\"b\")),IF(Table_RiskAssessment[[#This Row],[P2]]=1,IF(Table_RiskAssessment[[#This Row],[W2]]=1,\"a\",\"b\"),IF(Table_RiskAssessment[[#This Row],[W2]]=1,\"b\",\"c\"))),IF(Table_RiskAssessment[[#This Row],[F2]]=1,IF(Table_RiskAssessment[[#This Row],[P2]]=1,IF(Table_RiskAssessment[[#This Row],[W2]]=1,\"b\",\"c\"),IF(Table_RiskAssessment[[#This Row],[W2]]=1,\"c\",\"d\")),IF(Table_RiskAssessment[[#This Row],[P2]]=1,IF(Table_RiskAssessment[[#This Row],[W2]]=1,\"c\",\"d\"),IF(Table_RiskAssessment[[#This Row],[W2]]=1,\"d\",\"e\")))),\"?\")","v":"?"},null,null,null,"-"]
[null,null,null,"2006 / 42","4.4.2.",{"$f":"Sprache!A$241","v":"Maschinen zum Heben von Lasten"},"x","","x",null,null,null,null,null,null,null,null,null,null,null,null,null,null,null,null,null,null,null,null,null,null,null,null,{"$f":"IF((Table_RiskAssessment[[#This Row],[S]]* Table_RiskAssessment[[#This Row],[F]]* Table_RiskAssessment[[#This Row],[P]]>0),IF(Table_RiskAssessment[[#This Row],[S]]=1,IF(Table_RiskAssessment[[#This Row],[F]]=1,IF(Table_RiskAssessment[[#This Row],[P]]=1,\"a\",IF(Table_RiskAssessment[[#This Row],[W]]=1,\"a\",\"b\")),IF(Table_RiskAssessment[[#This Row],[P]]=1,IF(Table_RiskAssessment[[#This Row],[W]]=1,\"a\",\"b\"),IF(Table_RiskAssessment[[#This Row],[W]]=1,\"b\",\"c\"))),IF(Table_RiskAssessment[[#This Row],[F]]=1,IF(Table_RiskAssessment[[#This Row],[P]]=1,IF(Table_RiskAssessment[[#This Row],[W]]=1,\"b\",\"c\"),IF(Table_RiskAssessment[[#This Row],[W]]=1,\"c\",\"d\")),IF(Table_RiskAssessment[[#This Row],[P]]=1,IF(Table_RiskAssessment[[#This Row],[W]]=1,\"c\",\"d\"),IF(Table_RiskAssessment[[#This Row],[W]]=1,\"d\",\"e\")))),\"?\")","v":"?"},null,null,null,null,null,null,null,null,null,null,null,null,null,null,{"$f":"IF((Table_RiskAssessment[[#This Row],[S2]]* Table_RiskAssessment[[#This Row],[F2]]* Table_RiskAssessment[[#This Row],[P2]]>0),IF(Table_RiskAssessment[[#This Row],[S2]]=1,IF(Table_RiskAssessment[[#This Row],[F2]]=1,IF(Table_RiskAssessment[[#This Row],[P2]]=1,\"a\",IF(Table_RiskAssessment[[#This Row],[W2]]=1,\"a\",\"b\")),IF(Table_RiskAssessment[[#This Row],[P2]]=1,IF(Table_RiskAssessment[[#This Row],[W2]]=1,\"a\",\"b\"),IF(Table_RiskAssessment[[#This Row],[W2]]=1,\"b\",\"c\"))),IF(Table_RiskAssessment[[#This Row],[F2]]=1,IF(Table_RiskAssessment[[#This Row],[P2]]=1,IF(Table_RiskAssessment[[#This Row],[W2]]=1,\"b\",\"c\"),IF(Table_RiskAssessment[[#This Row],[W2]]=1,\"c\",\"d\")),IF(Table_RiskAssessment[[#This Row],[P2]]=1,IF(Table_RiskAssessment[[#This Row],[W2]]=1,\"c\",\"d\"),IF(Table_RiskAssessment[[#This Row],[W2]]=1,\"d\",\"e\")))),\"?\")","v":"?"},null,null,null,"-"]
[null,null,null,"2006 / 42","5.",{"$f":"Sprache!A$242","v":"zum Einsatz unter Tage bestimmte Maschinen"},"x","x","x",null,null,null,null,null,null,null,null,null,null,null,null,null,null,null,null,null,null,null,null,null,null,null,null,{"$f":"IF((Table_RiskAssessment[[#This Row],[S]]* Table_RiskAssessment[[#This Row],[F]]* Table_RiskAssessment[[#This Row],[P]]>0),IF(Table_RiskAssessment[[#This Row],[S]]=1,IF(Table_RiskAssessment[[#This Row],[F]]=1,IF(Table_RiskAssessment[[#This Row],[P]]=1,\"a\",IF(Table_RiskAssessment[[#This Row],[W]]=1,\"a\",\"b\")),IF(Table_RiskAssessment[[#This Row],[P]]=1,IF(Table_RiskAssessment[[#This Row],[W]]=1,\"a\",\"b\"),IF(Table_RiskAssessment[[#This Row],[W]]=1,\"b\",\"c\"))),IF(Table_RiskAssessment[[#This Row],[F]]=1,IF(Table_RiskAssessment[[#This Row],[P]]=1,IF(Table_RiskAssessment[[#This Row],[W]]=1,\"b\",\"c\"),IF(Table_RiskAssessment[[#This Row],[W]]=1,\"c\",\"d\")),IF(Table_RiskAssessment[[#This Row],[P]]=1,IF(Table_RiskAssessment[[#This Row],[W]]=1,\"c\",\"d\"),IF(Table_RiskAssessment[[#This Row],[W]]=1,\"d\",\"e\")))),\"?\")","v":"?"},null,null,null,null,null,null,null,null,null,null,null,null,null,null,{"$f":"IF((Table_RiskAssessment[[#This Row],[S2]]* Table_RiskAssessment[[#This Row],[F2]]* Table_RiskAssessment[[#This Row],[P2]]>0),IF(Table_RiskAssessment[[#This Row],[S2]]=1,IF(Table_RiskAssessment[[#This Row],[F2]]=1,IF(Table_RiskAssessment[[#This Row],[P2]]=1,\"a\",IF(Table_RiskAssessment[[#This Row],[W2]]=1,\"a\",\"b\")),IF(Table_RiskAssessment[[#This Row],[P2]]=1,IF(Table_RiskAssessment[[#This Row],[W2]]=1,\"a\",\"b\"),IF(Table_RiskAssessment[[#This Row],[W2]]=1,\"b\",\"c\"))),IF(Table_RiskAssessment[[#This Row],[F2]]=1,IF(Table_RiskAssessment[[#This Row],[P2]]=1,IF(Table_RiskAssessment[[#This Row],[W2]]=1,\"b\",\"c\"),IF(Table_RiskAssessment[[#This Row],[W2]]=1,\"c\",\"d\")),IF(Table_RiskAssessment[[#This Row],[P2]]=1,IF(Table_RiskAssessment[[#This Row],[W2]]=1,\"c\",\"d\"),IF(Table_RiskAssessment[[#This Row],[W2]]=1,\"d\",\"e\")))),\"?\")","v":"?"},null,null,null,"-"]
[null,null,null,"2006 / 42","5.1.",{"$f":"Sprache!A$243","v":"Risiken durch mangelnde Standsicherheit"},"x","","x",null,null,null,null,null,null,null,null,null,null,null,null,null,null,null,null,null,null,null,null,null,null,null,null,{"$f":"IF((Table_RiskAssessment[[#This Row],[S]]* Table_RiskAssessment[[#This Row],[F]]* Table_RiskAssessment[[#This Row],[P]]>0),IF(Table_RiskAssessment[[#This Row],[S]]=1,IF(Table_RiskAssessment[[#This Row],[F]]=1,IF(Table_RiskAssessment[[#This Row],[P]]=1,\"a\",IF(Table_RiskAssessment[[#This Row],[W]]=1,\"a\",\"b\")),IF(Table_RiskAssessment[[#This Row],[P]]=1,IF(Table_RiskAssessment[[#This Row],[W]]=1,\"a\",\"b\"),IF(Table_RiskAssessment[[#This Row],[W]]=1,\"b\",\"c\"))),IF(Table_RiskAssessment[[#This Row],[F]]=1,IF(Table_RiskAssessment[[#This Row],[P]]=1,IF(Table_RiskAssessment[[#This Row],[W]]=1,\"b\",\"c\"),IF(Table_RiskAssessment[[#This Row],[W]]=1,\"c\",\"d\")),IF(Table_RiskAssessment[[#This Row],[P]]=1,IF(Table_RiskAssessment[[#This Row],[W]]=1,\"c\",\"d\"),IF(Table_RiskAssessment[[#This Row],[W]]=1,\"d\",\"e\")))),\"?\")","v":"?"},null,null,null,null,null,null,null,null,null,null,null,null,null,null,{"$f":"IF((Table_RiskAssessment[[#This Row],[S2]]* Table_RiskAssessment[[#This Row],[F2]]* Table_RiskAssessment[[#This Row],[P2]]>0),IF(Table_RiskAssessment[[#This Row],[S2]]=1,IF(Table_RiskAssessment[[#This Row],[F2]]=1,IF(Table_RiskAssessment[[#This Row],[P2]]=1,\"a\",IF(Table_RiskAssessment[[#This Row],[W2]]=1,\"a\",\"b\")),IF(Table_RiskAssessment[[#This Row],[P2]]=1,IF(Table_RiskAssessment[[#This Row],[W2]]=1,\"a\",\"b\"),IF(Table_RiskAssessment[[#This Row],[W2]]=1,\"b\",\"c\"))),IF(Table_RiskAssessment[[#This Row],[F2]]=1,IF(Table_RiskAssessment[[#This Row],[P2]]=1,IF(Table_RiskAssessment[[#This Row],[W2]]=1,\"b\",\"c\"),IF(Table_RiskAssessment[[#This Row],[W2]]=1,\"c\",\"d\")),IF(Table_RiskAssessment[[#This Row],[P2]]=1,IF(Table_RiskAssessment[[#This Row],[W2]]=1,\"c\",\"d\"),IF(Table_RiskAssessment[[#This Row],[W2]]=1,\"d\",\"e\")))),\"?\")","v":"?"},null,null,null,"-"]
[null,null,null,"2006 / 42","5.2.",{"$f":"Sprache!A$244","v":"Bewegungsfreiheit"},"x","","x",null,null,null,null,null,null,null,null,null,null,null,null,null,null,null,null,null,null,null,null,null,null,null,null,{"$f":"IF((Table_RiskAssessment[[#This Row],[S]]* Table_RiskAssessment[[#This Row],[F]]* Table_RiskAssessment[[#This Row],[P]]>0),IF(Table_RiskAssessment[[#This Row],[S]]=1,IF(Table_RiskAssessment[[#This Row],[F]]=1,IF(Table_RiskAssessment[[#This Row],[P]]=1,\"a\",IF(Table_RiskAssessment[[#This Row],[W]]=1,\"a\",\"b\")),IF(Table_RiskAssessment[[#This Row],[P]]=1,IF(Table_RiskAssessment[[#This Row],[W]]=1,\"a\",\"b\"),IF(Table_RiskAssessment[[#This Row],[W]]=1,\"b\",\"c\"))),IF(Table_RiskAssessment[[#This Row],[F]]=1,IF(Table_RiskAssessment[[#This Row],[P]]=1,IF(Table_RiskAssessment[[#This Row],[W]]=1,\"b\",\"c\"),IF(Table_RiskAssessment[[#This Row],[W]]=1,\"c\",\"d\")),IF(Table_RiskAssessment[[#This Row],[P]]=1,IF(Table_RiskAssessment[[#This Row],[W]]=1,\"c\",\"d\"),IF(Table_RiskAssessment[[#This Row],[W]]=1,\"d\",\"e\")))),\"?\")","v":"?"},null,null,null,null,null,null,null,null,null,null,null,null,null,null,{"$f":"IF((Table_RiskAssessment[[#This Row],[S2]]* Table_RiskAssessment[[#This Row],[F2]]* Table_RiskAssessment[[#This Row],[P2]]>0),IF(Table_RiskAssessment[[#This Row],[S2]]=1,IF(Table_RiskAssessment[[#This Row],[F2]]=1,IF(Table_RiskAssessment[[#This Row],[P2]]=1,\"a\",IF(Table_RiskAssessment[[#This Row],[W2]]=1,\"a\",\"b\")),IF(Table_RiskAssessment[[#This Row],[P2]]=1,IF(Table_RiskAssessment[[#This Row],[W2]]=1,\"a\",\"b\"),IF(Table_RiskAssessment[[#This Row],[W2]]=1,\"b\",\"c\"))),IF(Table_RiskAssessment[[#This Row],[F2]]=1,IF(Table_RiskAssessment[[#This Row],[P2]]=1,IF(Table_RiskAssessment[[#This Row],[W2]]=1,\"b\",\"c\"),IF(Table_RiskAssessment[[#This Row],[W2]]=1,\"c\",\"d\")),IF(Table_RiskAssessment[[#This Row],[P2]]=1,IF(Table_RiskAssessment[[#This Row],[W2]]=1,\"c\",\"d\"),IF(Table_RiskAssessment[[#This Row],[W2]]=1,\"d\",\"e\")))),\"?\")","v":"?"},null,null,null,"-"]
[null,null,null,"2006 / 42","5.3.",{"$f":"Sprache!A$245","v":"Stellteile"},"x","","x",null,null,null,null,null,null,null,null,null,null,null,null,null,null,null,null,null,null,null,null,null,null,null,null,{"$f":"IF((Table_RiskAssessment[[#This Row],[S]]* Table_RiskAssessment[[#This Row],[F]]* Table_RiskAssessment[[#This Row],[P]]>0),IF(Table_RiskAssessment[[#This Row],[S]]=1,IF(Table_RiskAssessment[[#This Row],[F]]=1,IF(Table_RiskAssessment[[#This Row],[P]]=1,\"a\",IF(Table_RiskAssessment[[#This Row],[W]]=1,\"a\",\"b\")),IF(Table_RiskAssessment[[#This Row],[P]]=1,IF(Table_RiskAssessment[[#This Row],[W]]=1,\"a\",\"b\"),IF(Table_RiskAssessment[[#This Row],[W]]=1,\"b\",\"c\"))),IF(Table_RiskAssessment[[#This Row],[F]]=1,IF(Table_RiskAssessment[[#This Row],[P]]=1,IF(Table_RiskAssessment[[#This Row],[W]]=1,\"b\",\"c\"),IF(Table_RiskAssessment[[#This Row],[W]]=1,\"c\",\"d\")),IF(Table_RiskAssessment[[#This Row],[P]]=1,IF(Table_RiskAssessment[[#This Row],[W]]=1,\"c\",\"d\"),IF(Table_RiskAssessment[[#This Row],[W]]=1,\"d\",\"e\")))),\"?\")","v":"?"},null,null,null,null,null,null,null,null,null,null,null,null,null,null,{"$f":"IF((Table_RiskAssessment[[#This Row],[S2]]* Table_RiskAssessment[[#This Row],[F2]]* Table_RiskAssessment[[#This Row],[P2]]>0),IF(Table_RiskAssessment[[#This Row],[S2]]=1,IF(Table_RiskAssessment[[#This Row],[F2]]=1,IF(Table_RiskAssessment[[#This Row],[P2]]=1,\"a\",IF(Table_RiskAssessment[[#This Row],[W2]]=1,\"a\",\"b\")),IF(Table_RiskAssessment[[#This Row],[P2]]=1,IF(Table_RiskAssessment[[#This Row],[W2]]=1,\"a\",\"b\"),IF(Table_RiskAssessment[[#This Row],[W2]]=1,\"b\",\"c\"))),IF(Table_RiskAssessment[[#This Row],[F2]]=1,IF(Table_RiskAssessment[[#This Row],[P2]]=1,IF(Table_RiskAssessment[[#This Row],[W2]]=1,\"b\",\"c\"),IF(Table_RiskAssessment[[#This Row],[W2]]=1,\"c\",\"d\")),IF(Table_RiskAssessment[[#This Row],[P2]]=1,IF(Table_RiskAssessment[[#This Row],[W2]]=1,\"c\",\"d\"),IF(Table_RiskAssessment[[#This Row],[W2]]=1,\"d\",\"e\")))),\"?\")","v":"?"},null,null,null,"-"]
[null,null,null,"2006 / 42","5.4.",{"$f":"Sprache!A$246","v":"Anhalten der Fahrbewegung"},"x","","x",null,null,null,null,null,null,null,null,null,null,null,null,null,null,null,null,null,null,null,null,null,null,null,null,{"$f":"IF((Table_RiskAssessment[[#This Row],[S]]* Table_RiskAssessment[[#This Row],[F]]* Table_RiskAssessment[[#This Row],[P]]>0),IF(Table_RiskAssessment[[#This Row],[S]]=1,IF(Table_RiskAssessment[[#This Row],[F]]=1,IF(Table_RiskAssessment[[#This Row],[P]]=1,\"a\",IF(Table_RiskAssessment[[#This Row],[W]]=1,\"a\",\"b\")),IF(Table_RiskAssessment[[#This Row],[P]]=1,IF(Table_RiskAssessment[[#This Row],[W]]=1,\"a\",\"b\"),IF(Table_RiskAssessment[[#This Row],[W]]=1,\"b\",\"c\"))),IF(Table_RiskAssessment[[#This Row],[F]]=1,IF(Table_RiskAssessment[[#This Row],[P]]=1,IF(Table_RiskAssessment[[#This Row],[W]]=1,\"b\",\"c\"),IF(Table_RiskAssessment[[#This Row],[W]]=1,\"c\",\"d\")),IF(Table_RiskAssessment[[#This Row],[P]]=1,IF(Table_RiskAssessment[[#This Row],[W]]=1,\"c\",\"d\"),IF(Table_RiskAssessment[[#This Row],[W]]=1,\"d\",\"e\")))),\"?\")","v":"?"},null,null,null,null,null,null,null,null,null,null,null,null,null,null,{"$f":"IF((Table_RiskAssessment[[#This Row],[S2]]* Table_RiskAssessment[[#This Row],[F2]]* Table_RiskAssessment[[#This Row],[P2]]>0),IF(Table_RiskAssessment[[#This Row],[S2]]=1,IF(Table_RiskAssessment[[#This Row],[F2]]=1,IF(Table_RiskAssessment[[#This Row],[P2]]=1,\"a\",IF(Table_RiskAssessment[[#This Row],[W2]]=1,\"a\",\"b\")),IF(Table_RiskAssessment[[#This Row],[P2]]=1,IF(Table_RiskAssessment[[#This Row],[W2]]=1,\"a\",\"b\"),IF(Table_RiskAssessment[[#This Row],[W2]]=1,\"b\",\"c\"))),IF(Table_RiskAssessment[[#This Row],[F2]]=1,IF(Table_RiskAssessment[[#This Row],[P2]]=1,IF(Table_RiskAssessment[[#This Row],[W2]]=1,\"b\",\"c\"),IF(Table_RiskAssessment[[#This Row],[W2]]=1,\"c\",\"d\")),IF(Table_RiskAssessment[[#This Row],[P2]]=1,IF(Table_RiskAssessment[[#This Row],[W2]]=1,\"c\",\"d\"),IF(Table_RiskAssessment[[#This Row],[W2]]=1,\"d\",\"e\")))),\"?\")","v":"?"},null,null,null,"-"]
[null,null,null,"2006 / 42","5.5.",{"$f":"Sprache!A$247","v":"Brand"},"x","","x",null,null,null,null,null,null,null,null,null,null,null,null,null,null,null,null,null,null,null,null,null,null,null,null,{"$f":"IF((Table_RiskAssessment[[#This Row],[S]]* Table_RiskAssessment[[#This Row],[F]]* Table_RiskAssessment[[#This Row],[P]]>0),IF(Table_RiskAssessment[[#This Row],[S]]=1,IF(Table_RiskAssessment[[#This Row],[F]]=1,IF(Table_RiskAssessment[[#This Row],[P]]=1,\"a\",IF(Table_RiskAssessment[[#This Row],[W]]=1,\"a\",\"b\")),IF(Table_RiskAssessment[[#This Row],[P]]=1,IF(Table_RiskAssessment[[#This Row],[W]]=1,\"a\",\"b\"),IF(Table_RiskAssessment[[#This Row],[W]]=1,\"b\",\"c\"))),IF(Table_RiskAssessment[[#This Row],[F]]=1,IF(Table_RiskAssessment[[#This Row],[P]]=1,IF(Table_RiskAssessment[[#This Row],[W]]=1,\"b\",\"c\"),IF(Table_RiskAssessment[[#This Row],[W]]=1,\"c\",\"d\")),IF(Table_RiskAssessment[[#This Row],[P]]=1,IF(Table_RiskAssessment[[#This Row],[W]]=1,\"c\",\"d\"),IF(Table_RiskAssessment[[#This Row],[W]]=1,\"d\",\"e\")))),\"?\")","v":"?"},null,null,null,null,null,null,null,null,null,null,null,null,null,null,{"$f":"IF((Table_RiskAssessment[[#This Row],[S2]]* Table_RiskAssessment[[#This Row],[F2]]* Table_RiskAssessment[[#This Row],[P2]]>0),IF(Table_RiskAssessment[[#This Row],[S2]]=1,IF(Table_RiskAssessment[[#This Row],[F2]]=1,IF(Table_RiskAssessment[[#This Row],[P2]]=1,\"a\",IF(Table_RiskAssessment[[#This Row],[W2]]=1,\"a\",\"b\")),IF(Table_RiskAssessment[[#This Row],[P2]]=1,IF(Table_RiskAssessment[[#This Row],[W2]]=1,\"a\",\"b\"),IF(Table_RiskAssessment[[#This Row],[W2]]=1,\"b\",\"c\"))),IF(Table_RiskAssessment[[#This Row],[F2]]=1,IF(Table_RiskAssessment[[#This Row],[P2]]=1,IF(Table_RiskAssessment[[#This Row],[W2]]=1,\"b\",\"c\"),IF(Table_RiskAssessment[[#This Row],[W2]]=1,\"c\",\"d\")),IF(Table_RiskAssessment[[#This Row],[P2]]=1,IF(Table_RiskAssessment[[#This Row],[W2]]=1,\"c\",\"d\"),IF(Table_RiskAssessment[[#This Row],[W2]]=1,\"d\",\"e\")))),\"?\")","v":"?"},null,null,null,"-"]
[null,null,null,"2006 / 42","5.6.",{"$f":"Sprache!A$248","v":"Emission von Abgasen"},"x","","x",null,null,null,null,null,null,null,null,null,null,null,null,null,null,null,null,null,null,null,null,null,null,null,null,{"$f":"IF((Table_RiskAssessment[[#This Row],[S]]* Table_RiskAssessment[[#This Row],[F]]* Table_RiskAssessment[[#This Row],[P]]>0),IF(Table_RiskAssessment[[#This Row],[S]]=1,IF(Table_RiskAssessment[[#This Row],[F]]=1,IF(Table_RiskAssessment[[#This Row],[P]]=1,\"a\",IF(Table_RiskAssessment[[#This Row],[W]]=1,\"a\",\"b\")),IF(Table_RiskAssessment[[#This Row],[P]]=1,IF(Table_RiskAssessment[[#This Row],[W]]=1,\"a\",\"b\"),IF(Table_RiskAssessment[[#This Row],[W]]=1,\"b\",\"c\"))),IF(Table_RiskAssessment[[#This Row],[F]]=1,IF(Table_RiskAssessment[[#This Row],[P]]=1,IF(Table_RiskAssessment[[#This Row],[W]]=1,\"b\",\"c\"),IF(Table_RiskAssessment[[#This Row],[W]]=1,\"c\",\"d\")),IF(Table_RiskAssessment[[#This Row],[P]]=1,IF(Table_RiskAssessment[[#This Row],[W]]=1,\"c\",\"d\"),IF(Table_RiskAssessment[[#This Row],[W]]=1,\"d\",\"e\")))),\"?\")","v":"?"},null,null,null,null,null,null,null,null,null,null,null,null,null,null,{"$f":"IF((Table_RiskAssessment[[#This Row],[S2]]* Table_RiskAssessment[[#This Row],[F2]]* Table_RiskAssessment[[#This Row],[P2]]>0),IF(Table_RiskAssessment[[#This Row],[S2]]=1,IF(Table_RiskAssessment[[#This Row],[F2]]=1,IF(Table_RiskAssessment[[#This Row],[P2]]=1,\"a\",IF(Table_RiskAssessment[[#This Row],[W2]]=1,\"a\",\"b\")),IF(Table_RiskAssessment[[#This Row],[P2]]=1,IF(Table_RiskAssessment[[#This Row],[W2]]=1,\"a\",\"b\"),IF(Table_RiskAssessment[[#This Row],[W2]]=1,\"b\",\"c\"))),IF(Table_RiskAssessment[[#This Row],[F2]]=1,IF(Table_RiskAssessment[[#This Row],[P2]]=1,IF(Table_RiskAssessment[[#This Row],[W2]]=1,\"b\",\"c\"),IF(Table_RiskAssessment[[#This Row],[W2]]=1,\"c\",\"d\")),IF(Table_RiskAssessment[[#This Row],[P2]]=1,IF(Table_RiskAssessment[[#This Row],[W2]]=1,\"c\",\"d\"),IF(Table_RiskAssessment[[#This Row],[W2]]=1,\"d\",\"e\")))),\"?\")","v":"?"},null,null,null,"-"]
[null,null,null,"2006 / 42","6.",{"$f":"Sprache!A$249","v":"durch das Heben von Personen bedingte Gefährdungen"},"x","x","x",null,null,null,null,null,null,null,null,null,null,null,null,null,null,null,null,null,null,null,null,null,null,null,null,{"$f":"IF((Table_RiskAssessment[[#This Row],[S]]* Table_RiskAssessment[[#This Row],[F]]* Table_RiskAssessment[[#This Row],[P]]>0),IF(Table_RiskAssessment[[#This Row],[S]]=1,IF(Table_RiskAssessment[[#This Row],[F]]=1,IF(Table_RiskAssessment[[#This Row],[P]]=1,\"a\",IF(Table_RiskAssessment[[#This Row],[W]]=1,\"a\",\"b\")),IF(Table_RiskAssessment[[#This Row],[P]]=1,IF(Table_RiskAssessment[[#This Row],[W]]=1,\"a\",\"b\"),IF(Table_RiskAssessment[[#This Row],[W]]=1,\"b\",\"c\"))),IF(Table_RiskAssessment[[#This Row],[F]]=1,IF(Table_RiskAssessment[[#This Row],[P]]=1,IF(Table_RiskAssessment[[#This Row],[W]]=1,\"b\",\"c\"),IF(Table_RiskAssessment[[#This Row],[W]]=1,\"c\",\"d\")),IF(Table_RiskAssessment[[#This Row],[P]]=1,IF(Table_RiskAssessment[[#This Row],[W]]=1,\"c\",\"d\"),IF(Table_RiskAssessment[[#This Row],[W]]=1,\"d\",\"e\")))),\"?\")","v":"?"},null,null,null,null,null,null,null,null,null,null,null,null,null,null,{"$f":"IF((Table_RiskAssessment[[#This Row],[S2]]* Table_RiskAssessment[[#This Row],[F2]]* Table_RiskAssessment[[#This Row],[P2]]>0),IF(Table_RiskAssessment[[#This Row],[S2]]=1,IF(Table_RiskAssessment[[#This Row],[F2]]=1,IF(Table_RiskAssessment[[#This Row],[P2]]=1,\"a\",IF(Table_RiskAssessment[[#This Row],[W2]]=1,\"a\",\"b\")),IF(Table_RiskAssessment[[#This Row],[P2]]=1,IF(Table_RiskAssessment[[#This Row],[W2]]=1,\"a\",\"b\"),IF(Table_RiskAssessment[[#This Row],[W2]]=1,\"b\",\"c\"))),IF(Table_RiskAssessment[[#This Row],[F2]]=1,IF(Table_RiskAssessment[[#This Row],[P2]]=1,IF(Table_RiskAssessment[[#This Row],[W2]]=1,\"b\",\"c\"),IF(Table_RiskAssessment[[#This Row],[W2]]=1,\"c\",\"d\")),IF(Table_RiskAssessment[[#This Row],[P2]]=1,IF(Table_RiskAssessment[[#This Row],[W2]]=1,\"c\",\"d\"),IF(Table_RiskAssessment[[#This Row],[W2]]=1,\"d\",\"e\")))),\"?\")","v":"?"},null,null,null,"-"]
[null,null,null,"2006 / 42","6.1.",{"$f":"Sprache!A$250","v":"Allgemeines"},"x","x","x",null,null,null,null,null,null,null,null,null,null,null,null,null,null,null,null,null,null,null,null,null,null,null,null,{"$f":"IF((Table_RiskAssessment[[#This Row],[S]]* Table_RiskAssessment[[#This Row],[F]]* Table_RiskAssessment[[#This Row],[P]]>0),IF(Table_RiskAssessment[[#This Row],[S]]=1,IF(Table_RiskAssessment[[#This Row],[F]]=1,IF(Table_RiskAssessment[[#This Row],[P]]=1,\"a\",IF(Table_RiskAssessment[[#This Row],[W]]=1,\"a\",\"b\")),IF(Table_RiskAssessment[[#This Row],[P]]=1,IF(Table_RiskAssessment[[#This Row],[W]]=1,\"a\",\"b\"),IF(Table_RiskAssessment[[#This Row],[W]]=1,\"b\",\"c\"))),IF(Table_RiskAssessment[[#This Row],[F]]=1,IF(Table_RiskAssessment[[#This Row],[P]]=1,IF(Table_RiskAssessment[[#This Row],[W]]=1,\"b\",\"c\"),IF(Table_RiskAssessment[[#This Row],[W]]=1,\"c\",\"d\")),IF(Table_RiskAssessment[[#This Row],[P]]=1,IF(Table_RiskAssessment[[#This Row],[W]]=1,\"c\",\"d\"),IF(Table_RiskAssessment[[#This Row],[W]]=1,\"d\",\"e\")))),\"?\")","v":"?"},null,null,null,null,null,null,null,null,null,null,null,null,null,null,{"$f":"IF((Table_RiskAssessment[[#This Row],[S2]]* Table_RiskAssessment[[#This Row],[F2]]* Table_RiskAssessment[[#This Row],[P2]]>0),IF(Table_RiskAssessment[[#This Row],[S2]]=1,IF(Table_RiskAssessment[[#This Row],[F2]]=1,IF(Table_RiskAssessment[[#This Row],[P2]]=1,\"a\",IF(Table_RiskAssessment[[#This Row],[W2]]=1,\"a\",\"b\")),IF(Table_RiskAssessment[[#This Row],[P2]]=1,IF(Table_RiskAssessment[[#This Row],[W2]]=1,\"a\",\"b\"),IF(Table_RiskAssessment[[#This Row],[W2]]=1,\"b\",\"c\"))),IF(Table_RiskAssessment[[#This Row],[F2]]=1,IF(Table_RiskAssessment[[#This Row],[P2]]=1,IF(Table_RiskAssessment[[#This Row],[W2]]=1,\"b\",\"c\"),IF(Table_RiskAssessment[[#This Row],[W2]]=1,\"c\",\"d\")),IF(Table_RiskAssessment[[#This Row],[P2]]=1,IF(Table_RiskAssessment[[#This Row],[W2]]=1,\"c\",\"d\"),IF(Table_RiskAssessment[[#This Row],[W2]]=1,\"d\",\"e\")))),\"?\")","v":"?"},null,null,null,"-"]
[null,null,null,"2006 / 42","6.1.1.",{"$f":"Sprache!A$251","v":"Festigkeit"},"x","","x",null,null,null,null,null,null,null,null,null,null,null,null,null,null,null,null,null,null,null,null,null,null,null,null,{"$f":"IF((Table_RiskAssessment[[#This Row],[S]]* Table_RiskAssessment[[#This Row],[F]]* Table_RiskAssessment[[#This Row],[P]]>0),IF(Table_RiskAssessment[[#This Row],[S]]=1,IF(Table_RiskAssessment[[#This Row],[F]]=1,IF(Table_RiskAssessment[[#This Row],[P]]=1,\"a\",IF(Table_RiskAssessment[[#This Row],[W]]=1,\"a\",\"b\")),IF(Table_RiskAssessment[[#This Row],[P]]=1,IF(Table_RiskAssessment[[#This Row],[W]]=1,\"a\",\"b\"),IF(Table_RiskAssessment[[#This Row],[W]]=1,\"b\",\"c\"))),IF(Table_RiskAssessment[[#This Row],[F]]=1,IF(Table_RiskAssessment[[#This Row],[P]]=1,IF(Table_RiskAssessment[[#This Row],[W]]=1,\"b\",\"c\"),IF(Table_RiskAssessment[[#This Row],[W]]=1,\"c\",\"d\")),IF(Table_RiskAssessment[[#This Row],[P]]=1,IF(Table_RiskAssessment[[#This Row],[W]]=1,\"c\",\"d\"),IF(Table_RiskAssessment[[#This Row],[W]]=1,\"d\",\"e\")))),\"?\")","v":"?"},null,null,null,null,null,null,null,null,null,null,null,null,null,null,{"$f":"IF((Table_RiskAssessment[[#This Row],[S2]]* Table_RiskAssessment[[#This Row],[F2]]* Table_RiskAssessment[[#This Row],[P2]]>0),IF(Table_RiskAssessment[[#This Row],[S2]]=1,IF(Table_RiskAssessment[[#This Row],[F2]]=1,IF(Table_RiskAssessment[[#This Row],[P2]]=1,\"a\",IF(Table_RiskAssessment[[#This Row],[W2]]=1,\"a\",\"b\")),IF(Table_RiskAssessment[[#This Row],[P2]]=1,IF(Table_RiskAssessment[[#This Row],[W2]]=1,\"a\",\"b\"),IF(Table_RiskAssessment[[#This Row],[W2]]=1,\"b\",\"c\"))),IF(Table_RiskAssessment[[#This Row],[F2]]=1,IF(Table_RiskAssessment[[#This Row],[P2]]=1,IF(Table_RiskAssessment[[#This Row],[W2]]=1,\"b\",\"c\"),IF(Table_RiskAssessment[[#This Row],[W2]]=1,\"c\",\"d\")),IF(Table_RiskAssessment[[#This Row],[P2]]=1,IF(Table_RiskAssessment[[#This Row],[W2]]=1,\"c\",\"d\"),IF(Table_RiskAssessment[[#This Row],[W2]]=1,\"d\",\"e\")))),\"?\")","v":"?"},null,null,null,"-"]
[null,null,null,"2006 / 42","6.1.2.",{"$f":"Sprache!A$252","v":"Belastungsbegrenzung bei nicht durch menschliche Kraft angetriebenen Maschinen"},"x","","x",null,null,null,null,null,null,null,null,null,null,null,null,null,null,null,null,null,null,null,null,null,null,null,null,{"$f":"IF((Table_RiskAssessment[[#This Row],[S]]* Table_RiskAssessment[[#This Row],[F]]* Table_RiskAssessment[[#This Row],[P]]>0),IF(Table_RiskAssessment[[#This Row],[S]]=1,IF(Table_RiskAssessment[[#This Row],[F]]=1,IF(Table_RiskAssessment[[#This Row],[P]]=1,\"a\",IF(Table_RiskAssessment[[#This Row],[W]]=1,\"a\",\"b\")),IF(Table_RiskAssessment[[#This Row],[P]]=1,IF(Table_RiskAssessment[[#This Row],[W]]=1,\"a\",\"b\"),IF(Table_RiskAssessment[[#This Row],[W]]=1,\"b\",\"c\"))),IF(Table_RiskAssessment[[#This Row],[F]]=1,IF(Table_RiskAssessment[[#This Row],[P]]=1,IF(Table_RiskAssessment[[#This Row],[W]]=1,\"b\",\"c\"),IF(Table_RiskAssessment[[#This Row],[W]]=1,\"c\",\"d\")),IF(Table_RiskAssessment[[#This Row],[P]]=1,IF(Table_RiskAssessment[[#This Row],[W]]=1,\"c\",\"d\"),IF(Table_RiskAssessment[[#This Row],[W]]=1,\"d\",\"e\")))),\"?\")","v":"?"},null,null,null,null,null,null,null,null,null,null,null,null,null,null,{"$f":"IF((Table_RiskAssessment[[#This Row],[S2]]* Table_RiskAssessment[[#This Row],[F2]]* Table_RiskAssessment[[#This Row],[P2]]>0),IF(Table_RiskAssessment[[#This Row],[S2]]=1,IF(Table_RiskAssessment[[#This Row],[F2]]=1,IF(Table_RiskAssessment[[#This Row],[P2]]=1,\"a\",IF(Table_RiskAssessment[[#This Row],[W2]]=1,\"a\",\"b\")),IF(Table_RiskAssessment[[#This Row],[P2]]=1,IF(Table_RiskAssessment[[#This Row],[W2]]=1,\"a\",\"b\"),IF(Table_RiskAssessment[[#This Row],[W2]]=1,\"b\",\"c\"))),IF(Table_RiskAssessment[[#This Row],[F2]]=1,IF(Table_RiskAssessment[[#This Row],[P2]]=1,IF(Table_RiskAssessment[[#This Row],[W2]]=1,\"b\",\"c\"),IF(Table_RiskAssessment[[#This Row],[W2]]=1,\"c\",\"d\")),IF(Table_RiskAssessment[[#This Row],[P2]]=1,IF(Table_RiskAssessment[[#This Row],[W2]]=1,\"c\",\"d\"),IF(Table_RiskAssessment[[#This Row],[W2]]=1,\"d\",\"e\")))),\"?\")","v":"?"},null,null,null,"-"]
[null,null,null,"2006 / 42","6.2.",{"$f":"Sprache!A$253","v":"Stellteile"},"x","","x",null,null,null,null,null,null,null,null,null,null,null,null,null,null,null,null,null,null,null,null,null,null,null,null,{"$f":"IF((Table_RiskAssessment[[#This Row],[S]]* Table_RiskAssessment[[#This Row],[F]]* Table_RiskAssessment[[#This Row],[P]]>0),IF(Table_RiskAssessment[[#This Row],[S]]=1,IF(Table_RiskAssessment[[#This Row],[F]]=1,IF(Table_RiskAssessment[[#This Row],[P]]=1,\"a\",IF(Table_RiskAssessment[[#This Row],[W]]=1,\"a\",\"b\")),IF(Table_RiskAssessment[[#This Row],[P]]=1,IF(Table_RiskAssessment[[#This Row],[W]]=1,\"a\",\"b\"),IF(Table_RiskAssessment[[#This Row],[W]]=1,\"b\",\"c\"))),IF(Table_RiskAssessment[[#This Row],[F]]=1,IF(Table_RiskAssessment[[#This Row],[P]]=1,IF(Table_RiskAssessment[[#This Row],[W]]=1,\"b\",\"c\"),IF(Table_RiskAssessment[[#This Row],[W]]=1,\"c\",\"d\")),IF(Table_RiskAssessment[[#This Row],[P]]=1,IF(Table_RiskAssessment[[#This Row],[W]]=1,\"c\",\"d\"),IF(Table_RiskAssessment[[#This Row],[W]]=1,\"d\",\"e\")))),\"?\")","v":"?"},null,null,null,null,null,null,null,null,null,null,null,null,null,null,{"$f":"IF((Table_RiskAssessment[[#This Row],[S2]]* Table_RiskAssessment[[#This Row],[F2]]* Table_RiskAssessment[[#This Row],[P2]]>0),IF(Table_RiskAssessment[[#This Row],[S2]]=1,IF(Table_RiskAssessment[[#This Row],[F2]]=1,IF(Table_RiskAssessment[[#This Row],[P2]]=1,\"a\",IF(Table_RiskAssessment[[#This Row],[W2]]=1,\"a\",\"b\")),IF(Table_RiskAssessment[[#This Row],[P2]]=1,IF(Table_RiskAssessment[[#This Row],[W2]]=1,\"a\",\"b\"),IF(Table_RiskAssessment[[#This Row],[W2]]=1,\"b\",\"c\"))),IF(Table_RiskAssessment[[#This Row],[F2]]=1,IF(Table_RiskAssessment[[#This Row],[P2]]=1,IF(Table_RiskAssessment[[#This Row],[W2]]=1,\"b\",\"c\"),IF(Table_RiskAssessment[[#This Row],[W2]]=1,\"c\",\"d\")),IF(Table_RiskAssessment[[#This Row],[P2]]=1,IF(Table_RiskAssessment[[#This Row],[W2]]=1,\"c\",\"d\"),IF(Table_RiskAssessment[[#This Row],[W2]]=1,\"d\",\"e\")))),\"?\")","v":"?"},null,null,null,"-"]
[null,null,null,"2006 / 42","6.3.",{"$f":"Sprache!A$254","v":"Risiken für in oder auf dem Lastträger befindliche Personen"},"x","x","x",null,null,null,null,null,null,null,null,null,null,null,null,null,null,null,null,null,null,null,null,null,null,null,null,{"$f":"IF((Table_RiskAssessment[[#This Row],[S]]* Table_RiskAssessment[[#This Row],[F]]* Table_RiskAssessment[[#This Row],[P]]>0),IF(Table_RiskAssessment[[#This Row],[S]]=1,IF(Table_RiskAssessment[[#This Row],[F]]=1,IF(Table_RiskAssessment[[#This Row],[P]]=1,\"a\",IF(Table_RiskAssessment[[#This Row],[W]]=1,\"a\",\"b\")),IF(Table_RiskAssessment[[#This Row],[P]]=1,IF(Table_RiskAssessment[[#This Row],[W]]=1,\"a\",\"b\"),IF(Table_RiskAssessment[[#This Row],[W]]=1,\"b\",\"c\"))),IF(Table_RiskAssessment[[#This Row],[F]]=1,IF(Table_RiskAssessment[[#This Row],[P]]=1,IF(Table_RiskAssessment[[#This Row],[W]]=1,\"b\",\"c\"),IF(Table_RiskAssessment[[#This Row],[W]]=1,\"c\",\"d\")),IF(Table_RiskAssessment[[#This Row],[P]]=1,IF(Table_RiskAssessment[[#This Row],[W]]=1,\"c\",\"d\"),IF(Table_RiskAssessment[[#This Row],[W]]=1,\"d\",\"e\")))),\"?\")","v":"?"},null,null,null,null,null,null,null,null,null,null,null,null,null,null,{"$f":"IF((Table_RiskAssessment[[#This Row],[S2]]* Table_RiskAssessment[[#This Row],[F2]]* Table_RiskAssessment[[#This Row],[P2]]>0),IF(Table_RiskAssessment[[#This Row],[S2]]=1,IF(Table_RiskAssessment[[#This Row],[F2]]=1,IF(Table_RiskAssessment[[#This Row],[P2]]=1,\"a\",IF(Table_RiskAssessment[[#This Row],[W2]]=1,\"a\",\"b\")),IF(Table_RiskAssessment[[#This Row],[P2]]=1,IF(Table_RiskAssessment[[#This Row],[W2]]=1,\"a\",\"b\"),IF(Table_RiskAssessment[[#This Row],[W2]]=1,\"b\",\"c\"))),IF(Table_RiskAssessment[[#This Row],[F2]]=1,IF(Table_RiskAssessment[[#This Row],[P2]]=1,IF(Table_RiskAssessment[[#This Row],[W2]]=1,\"b\",\"c\"),IF(Table_RiskAssessment[[#This Row],[W2]]=1,\"c\",\"d\")),IF(Table_RiskAssessment[[#This Row],[P2]]=1,IF(Table_RiskAssessment[[#This Row],[W2]]=1,\"c\",\"d\"),IF(Table_RiskAssessment[[#This Row],[W2]]=1,\"d\",\"e\")))),\"?\")","v":"?"},null,null,null,"-"]
[null,null,null,"2006 / 42","6.3.1.",{"$f":"Sprache!A$255","v":"Risiken durch Bewegungen des Lastträgers"},"x","","x",null,null,null,null,null,null,null,null,null,null,null,null,null,null,null,null,null,null,null,null,null,null,null,null,{"$f":"IF((Table_RiskAssessment[[#This Row],[S]]* Table_RiskAssessment[[#This Row],[F]]* Table_RiskAssessment[[#This Row],[P]]>0),IF(Table_RiskAssessment[[#This Row],[S]]=1,IF(Table_RiskAssessment[[#This Row],[F]]=1,IF(Table_RiskAssessment[[#This Row],[P]]=1,\"a\",IF(Table_RiskAssessment[[#This Row],[W]]=1,\"a\",\"b\")),IF(Table_RiskAssessment[[#This Row],[P]]=1,IF(Table_RiskAssessment[[#This Row],[W]]=1,\"a\",\"b\"),IF(Table_RiskAssessment[[#This Row],[W]]=1,\"b\",\"c\"))),IF(Table_RiskAssessment[[#This Row],[F]]=1,IF(Table_RiskAssessment[[#This Row],[P]]=1,IF(Table_RiskAssessment[[#This Row],[W]]=1,\"b\",\"c\"),IF(Table_RiskAssessment[[#This Row],[W]]=1,\"c\",\"d\")),IF(Table_RiskAssessment[[#This Row],[P]]=1,IF(Table_RiskAssessment[[#This Row],[W]]=1,\"c\",\"d\"),IF(Table_RiskAssessment[[#This Row],[W]]=1,\"d\",\"e\")))),\"?\")","v":"?"},null,null,null,null,null,null,null,null,null,null,null,null,null,null,{"$f":"IF((Table_RiskAssessment[[#This Row],[S2]]* Table_RiskAssessment[[#This Row],[F2]]* Table_RiskAssessment[[#This Row],[P2]]>0),IF(Table_RiskAssessment[[#This Row],[S2]]=1,IF(Table_RiskAssessment[[#This Row],[F2]]=1,IF(Table_RiskAssessment[[#This Row],[P2]]=1,\"a\",IF(Table_RiskAssessment[[#This Row],[W2]]=1,\"a\",\"b\")),IF(Table_RiskAssessment[[#This Row],[P2]]=1,IF(Table_RiskAssessment[[#This Row],[W2]]=1,\"a\",\"b\"),IF(Table_RiskAssessment[[#This Row],[W2]]=1,\"b\",\"c\"))),IF(Table_RiskAssessment[[#This Row],[F2]]=1,IF(Table_RiskAssessment[[#This Row],[P2]]=1,IF(Table_RiskAssessment[[#This Row],[W2]]=1,\"b\",\"c\"),IF(Table_RiskAssessment[[#This Row],[W2]]=1,\"c\",\"d\")),IF(Table_RiskAssessment[[#This Row],[P2]]=1,IF(Table_RiskAssessment[[#This Row],[W2]]=1,\"c\",\"d\"),IF(Table_RiskAssessment[[#This Row],[W2]]=1,\"d\",\"e\")))),\"?\")","v":"?"},null,null,null,"-"]
[null,null,null,"2006 / 42","6.3.2.",{"$f":"Sprache!A$256","v":"Risiko des Sturzes aus dem Lastträger"},"x","","x",null,null,null,null,null,null,null,null,null,null,null,null,null,null,null,null,null,null,null,null,null,null,null,null,{"$f":"IF((Table_RiskAssessment[[#This Row],[S]]* Table_RiskAssessment[[#This Row],[F]]* Table_RiskAssessment[[#This Row],[P]]>0),IF(Table_RiskAssessment[[#This Row],[S]]=1,IF(Table_RiskAssessment[[#This Row],[F]]=1,IF(Table_RiskAssessment[[#This Row],[P]]=1,\"a\",IF(Table_RiskAssessment[[#This Row],[W]]=1,\"a\",\"b\")),IF(Table_RiskAssessment[[#This Row],[P]]=1,IF(Table_RiskAssessment[[#This Row],[W]]=1,\"a\",\"b\"),IF(Table_RiskAssessment[[#This Row],[W]]=1,\"b\",\"c\"))),IF(Table_RiskAssessment[[#This Row],[F]]=1,IF(Table_RiskAssessment[[#This Row],[P]]=1,IF(Table_RiskAssessment[[#This Row],[W]]=1,\"b\",\"c\"),IF(Table_RiskAssessment[[#This Row],[W]]=1,\"c\",\"d\")),IF(Table_RiskAssessment[[#This Row],[P]]=1,IF(Table_RiskAssessment[[#This Row],[W]]=1,\"c\",\"d\"),IF(Table_RiskAssessment[[#This Row],[W]]=1,\"d\",\"e\")))),\"?\")","v":"?"},null,null,null,null,null,null,null,null,null,null,null,null,null,null,{"$f":"IF((Table_RiskAssessment[[#This Row],[S2]]* Table_RiskAssessment[[#This Row],[F2]]* Table_RiskAssessment[[#This Row],[P2]]>0),IF(Table_RiskAssessment[[#This Row],[S2]]=1,IF(Table_RiskAssessment[[#This Row],[F2]]=1,IF(Table_RiskAssessment[[#This Row],[P2]]=1,\"a\",IF(Table_RiskAssessment[[#This Row],[W2]]=1,\"a\",\"b\")),IF(Table_RiskAssessment[[#This Row],[P2]]=1,IF(Table_RiskAssessment[[#This Row],[W2]]=1,\"a\",\"b\"),IF(Table_RiskAssessment[[#This Row],[W2]]=1,\"b\",\"c\"))),IF(Table_RiskAssessment[[#This Row],[F2]]=1,IF(Table_RiskAssessment[[#This Row],[P2]]=1,IF(Table_RiskAssessment[[#This Row],[W2]]=1,\"b\",\"c\"),IF(Table_RiskAssessment[[#This Row],[W2]]=1,\"c\",\"d\")),IF(Table_RiskAssessment[[#This Row],[P2]]=1,IF(Table_RiskAssessment[[#This Row],[W2]]=1,\"c\",\"d\"),IF(Table_RiskAssessment[[#This Row],[W2]]=1,\"d\",\"e\")))),\"?\")","v":"?"},null,null,null,"-"]
[null,null,null,"2006 / 42","6.3.3.",{"$f":"Sprache!A$257","v":"Risiken durch auf den Lastträger herabfallende Gegenstände"},"x","","x",null,null,null,null,null,null,null,null,null,null,null,null,null,null,null,null,null,null,null,null,null,null,null,null,{"$f":"IF((Table_RiskAssessment[[#This Row],[S]]* Table_RiskAssessment[[#This Row],[F]]* Table_RiskAssessment[[#This Row],[P]]>0),IF(Table_RiskAssessment[[#This Row],[S]]=1,IF(Table_RiskAssessment[[#This Row],[F]]=1,IF(Table_RiskAssessment[[#This Row],[P]]=1,\"a\",IF(Table_RiskAssessment[[#This Row],[W]]=1,\"a\",\"b\")),IF(Table_RiskAssessment[[#This Row],[P]]=1,IF(Table_RiskAssessment[[#This Row],[W]]=1,\"a\",\"b\"),IF(Table_RiskAssessment[[#This Row],[W]]=1,\"b\",\"c\"))),IF(Table_RiskAssessment[[#This Row],[F]]=1,IF(Table_RiskAssessment[[#This Row],[P]]=1,IF(Table_RiskAssessment[[#This Row],[W]]=1,\"b\",\"c\"),IF(Table_RiskAssessment[[#This Row],[W]]=1,\"c\",\"d\")),IF(Table_RiskAssessment[[#This Row],[P]]=1,IF(Table_RiskAssessment[[#This Row],[W]]=1,\"c\",\"d\"),IF(Table_RiskAssessment[[#This Row],[W]]=1,\"d\",\"e\")))),\"?\")","v":"?"},null,null,null,null,null,null,null,null,null,null,null,null,null,null,{"$f":"IF((Table_RiskAssessment[[#This Row],[S2]]* Table_RiskAssessment[[#This Row],[F2]]* Table_RiskAssessment[[#This Row],[P2]]>0),IF(Table_RiskAssessment[[#This Row],[S2]]=1,IF(Table_RiskAssessment[[#This Row],[F2]]=1,IF(Table_RiskAssessment[[#This Row],[P2]]=1,\"a\",IF(Table_RiskAssessment[[#This Row],[W2]]=1,\"a\",\"b\")),IF(Table_RiskAssessment[[#This Row],[P2]]=1,IF(Table_RiskAssessment[[#This Row],[W2]]=1,\"a\",\"b\"),IF(Table_RiskAssessment[[#This Row],[W2]]=1,\"b\",\"c\"))),IF(Table_RiskAssessment[[#This Row],[F2]]=1,IF(Table_RiskAssessment[[#This Row],[P2]]=1,IF(Table_RiskAssessment[[#This Row],[W2]]=1,\"b\",\"c\"),IF(Table_RiskAssessment[[#This Row],[W2]]=1,\"c\",\"d\")),IF(Table_RiskAssessment[[#This Row],[P2]]=1,IF(Table_RiskAssessment[[#This Row],[W2]]=1,\"c\",\"d\"),IF(Table_RiskAssessment[[#This Row],[W2]]=1,\"d\",\"e\")))),\"?\")","v":"?"},null,null,null,"-"]
[null,null,null,"2006 / 42","6.4.",{"$f":"Sprache!A$258","v":"Maschinen, die feste Haltestellen anfahren"},"x","x","x",null,null,null,null,null,null,null,null,null,null,null,null,null,null,null,null,null,null,null,null,null,null,null,null,{"$f":"IF((Table_RiskAssessment[[#This Row],[S]]* Table_RiskAssessment[[#This Row],[F]]* Table_RiskAssessment[[#This Row],[P]]>0),IF(Table_RiskAssessment[[#This Row],[S]]=1,IF(Table_RiskAssessment[[#This Row],[F]]=1,IF(Table_RiskAssessment[[#This Row],[P]]=1,\"a\",IF(Table_RiskAssessment[[#This Row],[W]]=1,\"a\",\"b\")),IF(Table_RiskAssessment[[#This Row],[P]]=1,IF(Table_RiskAssessment[[#This Row],[W]]=1,\"a\",\"b\"),IF(Table_RiskAssessment[[#This Row],[W]]=1,\"b\",\"c\"))),IF(Table_RiskAssessment[[#This Row],[F]]=1,IF(Table_RiskAssessment[[#This Row],[P]]=1,IF(Table_RiskAssessment[[#This Row],[W]]=1,\"b\",\"c\"),IF(Table_RiskAssessment[[#This Row],[W]]=1,\"c\",\"d\")),IF(Table_RiskAssessment[[#This Row],[P]]=1,IF(Table_RiskAssessment[[#This Row],[W]]=1,\"c\",\"d\"),IF(Table_RiskAssessment[[#This Row],[W]]=1,\"d\",\"e\")))),\"?\")","v":"?"},null,null,null,null,null,null,null,null,null,null,null,null,null,null,{"$f":"IF((Table_RiskAssessment[[#This Row],[S2]]* Table_RiskAssessment[[#This Row],[F2]]* Table_RiskAssessment[[#This Row],[P2]]>0),IF(Table_RiskAssessment[[#This Row],[S2]]=1,IF(Table_RiskAssessment[[#This Row],[F2]]=1,IF(Table_RiskAssessment[[#This Row],[P2]]=1,\"a\",IF(Table_RiskAssessment[[#This Row],[W2]]=1,\"a\",\"b\")),IF(Table_RiskAssessment[[#This Row],[P2]]=1,IF(Table_RiskAssessment[[#This Row],[W2]]=1,\"a\",\"b\"),IF(Table_RiskAssessment[[#This Row],[W2]]=1,\"b\",\"c\"))),IF(Table_RiskAssessment[[#This Row],[F2]]=1,IF(Table_RiskAssessment[[#This Row],[P2]]=1,IF(Table_RiskAssessment[[#This Row],[W2]]=1,\"b\",\"c\"),IF(Table_RiskAssessment[[#This Row],[W2]]=1,\"c\",\"d\")),IF(Table_RiskAssessment[[#This Row],[P2]]=1,IF(Table_RiskAssessment[[#This Row],[W2]]=1,\"c\",\"d\"),IF(Table_RiskAssessment[[#This Row],[W2]]=1,\"d\",\"e\")))),\"?\")","v":"?"},null,null,null,"-"]
[null,null,null,"2006 / 42","6.4.1.",{"$f":"Sprache!A$259","v":"Risiken für in oder auf dem Lastträger befindliche Personen"},"x","","x",null,null,null,null,null,null,null,null,null,null,null,null,null,null,null,null,null,null,null,null,null,null,null,null,{"$f":"IF((Table_RiskAssessment[[#This Row],[S]]* Table_RiskAssessment[[#This Row],[F]]* Table_RiskAssessment[[#This Row],[P]]>0),IF(Table_RiskAssessment[[#This Row],[S]]=1,IF(Table_RiskAssessment[[#This Row],[F]]=1,IF(Table_RiskAssessment[[#This Row],[P]]=1,\"a\",IF(Table_RiskAssessment[[#This Row],[W]]=1,\"a\",\"b\")),IF(Table_RiskAssessment[[#This Row],[P]]=1,IF(Table_RiskAssessment[[#This Row],[W]]=1,\"a\",\"b\"),IF(Table_RiskAssessment[[#This Row],[W]]=1,\"b\",\"c\"))),IF(Table_RiskAssessment[[#This Row],[F]]=1,IF(Table_RiskAssessment[[#This Row],[P]]=1,IF(Table_RiskAssessment[[#This Row],[W]]=1,\"b\",\"c\"),IF(Table_RiskAssessment[[#This Row],[W]]=1,\"c\",\"d\")),IF(Table_RiskAssessment[[#This Row],[P]]=1,IF(Table_RiskAssessment[[#This Row],[W]]=1,\"c\",\"d\"),IF(Table_RiskAssessment[[#This Row],[W]]=1,\"d\",\"e\")))),\"?\")","v":"?"},null,null,null,null,null,null,null,null,null,null,null,null,null,null,{"$f":"IF((Table_RiskAssessment[[#This Row],[S2]]* Table_RiskAssessment[[#This Row],[F2]]* Table_RiskAssessment[[#This Row],[P2]]>0),IF(Table_RiskAssessment[[#This Row],[S2]]=1,IF(Table_RiskAssessment[[#This Row],[F2]]=1,IF(Table_RiskAssessment[[#This Row],[P2]]=1,\"a\",IF(Table_RiskAssessment[[#This Row],[W2]]=1,\"a\",\"b\")),IF(Table_RiskAssessment[[#This Row],[P2]]=1,IF(Table_RiskAssessment[[#This Row],[W2]]=1,\"a\",\"b\"),IF(Table_RiskAssessment[[#This Row],[W2]]=1,\"b\",\"c\"))),IF(Table_RiskAssessment[[#This Row],[F2]]=1,IF(Table_RiskAssessment[[#This Row],[P2]]=1,IF(Table_RiskAssessment[[#This Row],[W2]]=1,\"b\",\"c\"),IF(Table_RiskAssessment[[#This Row],[W2]]=1,\"c\",\"d\")),IF(Table_RiskAssessment[[#This Row],[P2]]=1,IF(Table_RiskAssessment[[#This Row],[W2]]=1,\"c\",\"d\"),IF(Table_RiskAssessment[[#This Row],[W2]]=1,\"d\",\"e\")))),\"?\")","v":"?"},null,null,null,"-"]
[null,null,null,"2006 / 42","6.4.2.",{"$f":"Sprache!A$260","v":"Befehlseinrichtungen an den Haltestellen"},"x","","x",null,null,null,null,null,null,null,null,null,null,null,null,null,null,null,null,null,null,null,null,null,null,null,null,{"$f":"IF((Table_RiskAssessment[[#This Row],[S]]* Table_RiskAssessment[[#This Row],[F]]* Table_RiskAssessment[[#This Row],[P]]>0),IF(Table_RiskAssessment[[#This Row],[S]]=1,IF(Table_RiskAssessment[[#This Row],[F]]=1,IF(Table_RiskAssessment[[#This Row],[P]]=1,\"a\",IF(Table_RiskAssessment[[#This Row],[W]]=1,\"a\",\"b\")),IF(Table_RiskAssessment[[#This Row],[P]]=1,IF(Table_RiskAssessment[[#This Row],[W]]=1,\"a\",\"b\"),IF(Table_RiskAssessment[[#This Row],[W]]=1,\"b\",\"c\"))),IF(Table_RiskAssessment[[#This Row],[F]]=1,IF(Table_RiskAssessment[[#This Row],[P]]=1,IF(Table_RiskAssessment[[#This Row],[W]]=1,\"b\",\"c\"),IF(Table_RiskAssessment[[#This Row],[W]]=1,\"c\",\"d\")),IF(Table_RiskAssessment[[#This Row],[P]]=1,IF(Table_RiskAssessment[[#This Row],[W]]=1,\"c\",\"d\"),IF(Table_RiskAssessment[[#This Row],[W]]=1,\"d\",\"e\")))),\"?\")","v":"?"},null,null,null,null,null,null,null,null,null,null,null,null,null,null,{"$f":"IF((Table_RiskAssessment[[#This Row],[S2]]* Table_RiskAssessment[[#This Row],[F2]]* Table_RiskAssessment[[#This Row],[P2]]>0),IF(Table_RiskAssessment[[#This Row],[S2]]=1,IF(Table_RiskAssessment[[#This Row],[F2]]=1,IF(Table_RiskAssessment[[#This Row],[P2]]=1,\"a\",IF(Table_RiskAssessment[[#This Row],[W2]]=1,\"a\",\"b\")),IF(Table_RiskAssessment[[#This Row],[P2]]=1,IF(Table_RiskAssessment[[#This Row],[W2]]=1,\"a\",\"b\"),IF(Table_RiskAssessment[[#This Row],[W2]]=1,\"b\",\"c\"))),IF(Table_RiskAssessment[[#This Row],[F2]]=1,IF(Table_RiskAssessment[[#This Row],[P2]]=1,IF(Table_RiskAssessment[[#This Row],[W2]]=1,\"b\",\"c\"),IF(Table_RiskAssessment[[#This Row],[W2]]=1,\"c\",\"d\")),IF(Table_RiskAssessment[[#This Row],[P2]]=1,IF(Table_RiskAssessment[[#This Row],[W2]]=1,\"c\",\"d\"),IF(Table_RiskAssessment[[#This Row],[W2]]=1,\"d\",\"e\")))),\"?\")","v":"?"},null,null,null,"-"]
[null,null,null,"2006 / 42","6.4.3.",{"$f":"Sprache!A$261","v":"Zugang zum Lastträger"},"x","","x",null,null,null,null,null,null,null,null,null,null,null,null,null,null,null,null,null,null,null,null,null,null,null,null,{"$f":"IF((Table_RiskAssessment[[#This Row],[S]]* Table_RiskAssessment[[#This Row],[F]]* Table_RiskAssessment[[#This Row],[P]]>0),IF(Table_RiskAssessment[[#This Row],[S]]=1,IF(Table_RiskAssessment[[#This Row],[F]]=1,IF(Table_RiskAssessment[[#This Row],[P]]=1,\"a\",IF(Table_RiskAssessment[[#This Row],[W]]=1,\"a\",\"b\")),IF(Table_RiskAssessment[[#This Row],[P]]=1,IF(Table_RiskAssessment[[#This Row],[W]]=1,\"a\",\"b\"),IF(Table_RiskAssessment[[#This Row],[W]]=1,\"b\",\"c\"))),IF(Table_RiskAssessment[[#This Row],[F]]=1,IF(Table_RiskAssessment[[#This Row],[P]]=1,IF(Table_RiskAssessment[[#This Row],[W]]=1,\"b\",\"c\"),IF(Table_RiskAssessment[[#This Row],[W]]=1,\"c\",\"d\")),IF(Table_RiskAssessment[[#This Row],[P]]=1,IF(Table_RiskAssessment[[#This Row],[W]]=1,\"c\",\"d\"),IF(Table_RiskAssessment[[#This Row],[W]]=1,\"d\",\"e\")))),\"?\")","v":"?"},null,null,null,null,null,null,null,null,null,null,null,null,null,null,{"$f":"IF((Table_RiskAssessment[[#This Row],[S2]]* Table_RiskAssessment[[#This Row],[F2]]* Table_RiskAssessment[[#This Row],[P2]]>0),IF(Table_RiskAssessment[[#This Row],[S2]]=1,IF(Table_RiskAssessment[[#This Row],[F2]]=1,IF(Table_RiskAssessment[[#This Row],[P2]]=1,\"a\",IF(Table_RiskAssessment[[#This Row],[W2]]=1,\"a\",\"b\")),IF(Table_RiskAssessment[[#This Row],[P2]]=1,IF(Table_RiskAssessment[[#This Row],[W2]]=1,\"a\",\"b\"),IF(Table_RiskAssessment[[#This Row],[W2]]=1,\"b\",\"c\"))),IF(Table_RiskAssessment[[#This Row],[F2]]=1,IF(Table_RiskAssessment[[#This Row],[P2]]=1,IF(Table_RiskAssessment[[#This Row],[W2]]=1,\"b\",\"c\"),IF(Table_RiskAssessment[[#This Row],[W2]]=1,\"c\",\"d\")),IF(Table_RiskAssessment[[#This Row],[P2]]=1,IF(Table_RiskAssessment[[#This Row],[W2]]=1,\"c\",\"d\"),IF(Table_RiskAssessment[[#This Row],[W2]]=1,\"d\",\"e\")))),\"?\")","v":"?"},null,null,null,"-"]
[null,null,null,"2006 / 42","6.5.",{"$f":"Sprache!A$262","v":"Kennzeichnung"},"x","","x",null,null,null,null,null,null,null,null,null,null,null,null,null,null,null,null,null,null,null,null,null,null,null,null,{"$f":"IF((Table_RiskAssessment[[#This Row],[S]]* Table_RiskAssessment[[#This Row],[F]]* Table_RiskAssessment[[#This Row],[P]]>0),IF(Table_RiskAssessment[[#This Row],[S]]=1,IF(Table_RiskAssessment[[#This Row],[F]]=1,IF(Table_RiskAssessment[[#This Row],[P]]=1,\"a\",IF(Table_RiskAssessment[[#This Row],[W]]=1,\"a\",\"b\")),IF(Table_RiskAssessment[[#This Row],[P]]=1,IF(Table_RiskAssessment[[#This Row],[W]]=1,\"a\",\"b\"),IF(Table_RiskAssessment[[#This Row],[W]]=1,\"b\",\"c\"))),IF(Table_RiskAssessment[[#This Row],[F]]=1,IF(Table_RiskAssessment[[#This Row],[P]]=1,IF(Table_RiskAssessment[[#This Row],[W]]=1,\"b\",\"c\"),IF(Table_RiskAssessment[[#This Row],[W]]=1,\"c\",\"d\")),IF(Table_RiskAssessment[[#This Row],[P]]=1,IF(Table_RiskAssessment[[#This Row],[W]]=1,\"c\",\"d\"),IF(Table_RiskAssessment[[#This Row],[W]]=1,\"d\",\"e\")))),\"?\")","v":"?"},null,null,null,null,null,null,null,null,null,null,null,null,null,null,{"$f":"IF((Table_RiskAssessment[[#This Row],[S2]]* Table_RiskAssessment[[#This Row],[F2]]* Table_RiskAssessment[[#This Row],[P2]]>0),IF(Table_RiskAssessment[[#This Row],[S2]]=1,IF(Table_RiskAssessment[[#This Row],[F2]]=1,IF(Table_RiskAssessment[[#This Row],[P2]]=1,\"a\",IF(Table_RiskAssessment[[#This Row],[W2]]=1,\"a\",\"b\")),IF(Table_RiskAssessment[[#This Row],[P2]]=1,IF(Table_RiskAssessment[[#This Row],[W2]]=1,\"a\",\"b\"),IF(Table_RiskAssessment[[#This Row],[W2]]=1,\"b\",\"c\"))),IF(Table_RiskAssessment[[#This Row],[F2]]=1,IF(Table_RiskAssessment[[#This Row],[P2]]=1,IF(Table_RiskAssessment[[#This Row],[W2]]=1,\"b\",\"c\"),IF(Table_RiskAssessment[[#This Row],[W2]]=1,\"c\",\"d\")),IF(Table_RiskAssessment[[#This Row],[P2]]=1,IF(Table_RiskAssessment[[#This Row],[W2]]=1,\"c\",\"d\"),IF(Table_RiskAssessment[[#This Row],[W2]]=1,\"d\",\"e\")))),\"?\")","v":"?"},null,null,null,"-"]

{"sheet":"Risikobeurteilung Log","index":2,"n_rows":0,"n_cols":0,"rows_kept":0,"cut":false,"hidden":true,"merged":[]}

{"sheet":"B-Normen","index":3,"n_rows":220,"n_cols":6,"rows_kept":220,"cut":false,"hidden":false,"merged":[[0,2,0,4],[0,0,0,1]]}
["Stand EU-Amtsblatt: \nC 183/14 vom 9.6.2017",null,"Auflistung der B-Normen,\njeweils den grundlegenden Sicherheits- und Gesundheitsanforderungen,\nAnlage I der Maschinenrichtlinie 2006/42/EG, zugeordnet\nnach: MMS Muck Maschinensicherheit GmbH"]
["GSA","Nummer","Bezeichnung","Deutsch","English","Français"]
[null,"---",{"$f":"INDEX(Table_Standards[#This Row],1,Language_select+3)","v":" "}," "," "," "]
[null,null,{"$f":"INDEX(Table_Standards[#This Row],1,Language_select+3)","v":"Beleuchtung"},"Beleuchtung","Lighting"]
["1.1.4.","EN 1837:1999+A1:2009",{"$f":"INDEX(Table_Standards[#This Row],1,Language_select+3)","v":"Sicherheit von Maschinen — Maschinenintegrierte Beleuchtung"},"Sicherheit von Maschinen — Maschinenintegrierte Beleuchtung","Safety of machinery - Integral lighting of machines","Sécurité des machines — Éclairage intégré aux machines"]
[null,"---",{"$f":"INDEX(Table_Standards[#This Row],1,Language_select+3)","v":" "}," "," "," "]
[null,null,{"$f":"INDEX(Table_Standards[#This Row],1,Language_select+3)","v":"Ergonomie"},"Ergonomie","Ergonomics","Français"]
["1.1.6.","EN 547-1:1996+A1:2008",{"$f":"INDEX(Table_Standards[#This Row],1,Language_select+3)","v":"Sicherheit von Maschinen — Körpermaße des Menschen —  Teil 1: Grundlagen zur Bestimmung von Abmessungen für Ganzkörperzugänge  an Maschinenarbeitsplätzen"},"Sicherheit von Maschinen — Körpermaße des Menschen —  Teil 1: Grundlagen zur Bestimmung von Abmessungen für Ganzkörperzugänge  an Maschinenarbeitsplätzen","Safety of machinery - Human body measurements - Part 1: Principles for determining the dimensions required for openings for whole body access into machinery","Sécurité des machines — Mesures du corps humain — Partie 1: Principes de détermination des dimensions requises pour les ouvertures destinées au passage de l’ensemble du corps dans les machines"]
["1.1.6.","EN 547-2:1996+A1:2008",{"$f":"INDEX(Table_Standards[#This Row],1,Language_select+3)","v":"Sicherheit von Maschinen — Körpermaße des Menschen —  Teil 2: Grundlagen für die Bemessung von Zugangsöffnungen"},"Sicherheit von Maschinen — Körpermaße des Menschen —  Teil 2: Grundlagen für die Bemessung von Zugangsöffnungen","Safety of machinery - Human body measurements - Part 2: Principles for determining the dimensions required for access openings","Sécurité des machines — Mesures du corps humain — Partie 2: Principes de détermination des dimensions requises pour les orifices d’accès"]
["1.1.6.","EN 547-3:1996+A1:2008",{"$f":"INDEX(Table_Standards[#This Row],1,Language_select+3)","v":"Sicherheit von Maschinen — Körpermaße des Menschen —  Teil 3: Körpermaßdaten"},"Sicherheit von Maschinen — Körpermaße des Menschen —  Teil 3: Körpermaßdaten","Safety of machinery - Human body measurements - Part 3: Anthropometric data","Sécurité des machines — Mesures du corps humain — Partie 3: Données anthropométriques"]
["1.1.6.","EN 614-1:2006+A1:2009",{"$f":"INDEX(Table_Standards[#This Row],1,Language_select+3)","v":"Sicherheit von Maschinen — Ergonomische Gestaltungsgrundsätze —  Teil 1: Begriffe und allgemeine Leitsätze"},"Sicherheit von Maschinen — Ergonomische Gestaltungsgrundsätze —  Teil 1: Begriffe und allgemeine Leitsätze","Safety of machinery - Ergonomic design principles - Part 1: Terminology and general principles","Sécurité des machines — Principes ergonomiques de conception — Partie 1: Terminologie et principes généraux"]
["1.1.6.","EN 614-2:2000+A1:2008",{"$f":"INDEX(Table_Standards[#This Row],1,Language_select+3)","v":"Sicherheit von Maschinen — Ergonomische Gestaltungsgrundsätze —  Teil 2: Wechselwirkungen zwischen der Gestaltung von Maschinen und  den Arbeitsaufgaben"},"Sicherheit von Maschinen — Ergonomische Gestaltungsgrundsätze —  Teil 2: Wechselwirkungen zwischen der Gestaltung von Maschinen und  den Arbeitsaufgaben","Safety of machinery - Ergonomic design principles - Part 2: Interactions between the design of machinery and work tasks","Sécurité des machines — Principes ergonomiques de conception — Partie 2: Interactions entre la conception des machines et les tâches du travail"]
["1.1.6.","EN 1005-1:2001+A1:2008",{"$f":"INDEX(Table_Standards[#This Row],1,Language_select+3)","v":"Sicherheit von Maschinen — Menschliche körperliche Leistung —  Teil 1: Begriffe"},"Sicherheit von Maschinen — Menschliche körperliche Leistung —  Teil 1: Begriffe","Safety of machinery - Human physical performance - Part 1: Terms and definitions","Sécurité des machines — Performance physique humaine — Partie 1: Termes et définitions"]
["1.1.6.","EN 1005-2:2003+A1:2008",{"$f":"INDEX(Table_Standards[#This Row],1,Language_select+3)","v":"Sicherheit von Maschinen — Menschliche körperliche Leistung —  Teil 2: Manuelle Handhabung von Gegenständen in Verbindung mit  Maschinen und Maschinenteilen"},"Sicherheit von Maschinen — Menschliche körperliche Leistung —  Teil 2: Manuelle Handhabung von Gegenständen in Verbindung mit  Maschinen und Maschinenteilen","Safety of machinery - Human physical performance - Part 2: Manual handling of machinery and component parts of machinery","Sécurité des machines — Performance physique humaine — Partie 2: Manutention manuelle de machines et d’éléments de machines"]
["1.1.6.","EN 1005-3:2002+A1:2008",{"$f":"INDEX(Table_Standards[#This Row],1,Language_select+3)","v":"Sicherheit von Maschinen — Menschliche körperliche Leistung —  Teil 3: Empfohlene Kraftgrenzen bei Maschinenbetätigung"},"Sicherheit von Maschinen — Menschliche körperliche Leistung —  Teil 3: Empfohlene Kraftgrenzen bei Maschinenbetätigung","Safety of machinery - Human physical performance - Part 3: Recommended force limits for machinery operation","Sécurité des machines — Performance physique humaine — Partie 3: Limites des forces recommandées pour l’utilisation de machines"]
["1.1.6.","EN 1005-4:2005+A1:2008",{"$f":"INDEX(Table_Standards[#This Row],1,Language_select+3)","v":"Sicherheit von Maschinen — Menschliche körperliche Leistung —  Teil 4: Bewertung von Körperhaltungen und Bewegungen bei der Arbeit  an Maschinen"},"Sicherheit von Maschinen — Menschliche körperliche Leistung —  Teil 4: Bewertung von Körperhaltungen und Bewegungen bei der Arbeit  an Maschinen","Safety of machinery - Human physical performance - Part 4: Evaluation of working postures and movements in relation to machinery","Sécurité des machines — Performance physique humaine — Partie 4: Évaluation des postures et mouvements lors du travail en relation avec les machines"]
["1.1.6.","EN ISO 14738:2008",{"$f":"INDEX(Table_Standards[#This Row],1,Language_select+3)","v":"Sicherheit von Maschinen — Anthropometrische Anforderungen an die  Gestaltung von Maschinenarbeitsplätzen"},"Sicherheit von Maschinen — Anthropometrische Anforderungen an die  Gestaltung von Maschinenarbeitsplätzen","Safety of machinery - Anthropometric requirements for the design of workstations at machinery (ISO 14738:2002, including Cor 1:2003 and Cor 2:2005)","Sécurité des machines — Prescriptions anthropométriques relatives à la conception des postes de travail sur les machines"]
["1.1.6.","EN ISO 15536-1:2008",{"$f":"INDEX(Table_Standards[#This Row],1,Language_select+3)","v":"Ergonomie — Computer-Manikins und Körperumrissschablonen —  Teil 1: Allgemeine Anforderungen"},"Ergonomie — Computer-Manikins und Körperumrissschablonen —  Teil 1: Allgemeine Anforderungen","Ergonomics - Computer manikins and body templates - Part 1: General requirements (ISO 15536-1:2005)","Ergonomie — Mannequins informatisés et gabarits humains — Partie 1: Exigences générales"]
[null,"---",{"$f":"INDEX(Table_Standards[#This Row],1,Language_select+3)","v":" "}," "," "," "]
[null,null,{"$f":"INDEX(Table_Standards[#This Row],1,Language_select+3)","v":"Sicherheit und Zuverlässigkeit von Steuerungen"},"Sicherheit und Zuverlässigkeit von Steuerungen","Safety and reliability of control systems","Français"]
["1.2.1.","EN ISO 4413:2010",{"$f":"INDEX(Table_Standards[#This Row],1,Language_select+3)","v":"Fluidtechnik — Allgemeine Regeln und sicherheitstechnische Anforderungen  an Hydraulikanlagen und deren Bauteile"},"Fluidtechnik — Allgemeine Regeln und sicherheitstechnische Anforderungen  an Hydraulikanlagen und deren Bauteile","Hydraulic fluid power - General rules and safety requirements for systems and their components (ISO 4413:2010)","Transmissions hydrauliques — Règles générales et exigences de sécurité relatives aux systèmes et leurs composants"]
["1.2.1.","EN ISO 4414:2010",{"$f":"INDEX(Table_Standards[#This Row],1,Language_select+3)","v":"Fluidtechnik — Allgemeine Regeln und sicherheitstechnische Anforderungen  an Pneumatikanlagen und deren Bauteile"},"Fluidtechnik — Allgemeine Regeln und sicherheitstechnische Anforderungen  an Pneumatikanlagen und deren Bauteile","Pneumatic fluid power - General rules and safety requirements for systems and their components (ISO 4414:2010)","Transmissions pneumatiques — Règles générales et exigences de sécurité pour les systèmes et leurs composants"]
["1.2.1.","EN ISO 13849-1:2015",{"$f":"INDEX(Table_Standards[#This Row],1,Language_select+3)","v":"Sicherheit von Maschinen — Sicherheitsbezogene Teile von Steuerungen  — Teil 1: Allgemeine Gestaltungsleitsätze"},"Sicherheit von Maschinen — Sicherheitsbezogene Teile von Steuerungen  — Teil 1: Allgemeine Gestaltungsleitsätze","Safety of machinery - Safety-related parts of control systems - Part 1: General principles for design (ISO 13849-1:2006)","Sécurité des machines — Parties des systèmes de commande relatives à la sécurité — Partie 1: Principes généraux de conception"]
["1.2.1.","EN 16590-1:2014",{"$f":"INDEX(Table_Standards[#This Row],1,Language_select+3)","v":"Traktoren und Maschinen für die Land- und Forstwirtschaft — Sicherheitsbezogene Teile von Steuerungen — Teil 1: Allgemeine Gestaltungs-und Entwicklungsleitsätze"},"Traktoren und Maschinen für die Land- und Forstwirtschaft — Sicherheitsbezogene Teile von Steuerungen — Teil 1: Allgemeine Gestaltungs-und Entwicklungsleitsätze","Tractors and machinery for agriculture and forestry — Safety-related parts of control systems — Part 1: General principles for design and development","Tracteurs et matériels agricoles et forestiers — Parties des systèmes de commande relatives à la sécurité — Partie 1: Principes généraux pour la conception et le développement"]
["1.2.1.","EN 16590-2:2014",{"$f":"INDEX(Table_Standards[#This Row],1,Language_select+3)","v":"Traktoren und Maschinen für die Land- und Forstwirtschaft — Sicherheitsbezogene Teile von Steuerungen — Teil 2: Konzeptphase"},"Traktoren und Maschinen für die Land- und Forstwirtschaft — Sicherheitsbezogene Teile von Steuerungen — Teil 2: Konzeptphase","Tractors and machinery for agriculture and forestry — Safety-related parts of control systems — Part 2: Concept phase","Tracteurs et matériels agricoles et forestiers — Parties des systèmes de commande relatives à la sécurité — Partie 2: Phase de projet"]
["1.2.1.","EN 60204-1:2006/A1:2009",{"$f":"INDEX(Table_Standards[#This Row],1,Language_select+3)","v":"Sicherheit von Maschinen — Elektrische Ausrüstung von Maschinen —  Teil 1: Allgemeine Anforderungen"},"Sicherheit von Maschinen — Elektrische Ausrüstung von Maschinen —  Teil 1: Allgemeine Anforderungen","Safety of machinery - Electrical equipment of machines - Part 1: General requirements IEC 60204-1:2005 (Modified)","Sécurité des machines — Equipement électrique des machines — Partie 1: Règles générales"]
["1.2.1.","IEC 60204-1:2005/A1:2008",{"$f":"INDEX(Table_Standards[#This Row],1,Language_select+3)","v":"Sicherheit von Maschinen — Elektrische Ausrüstung von Maschinen —  Teil 1: Allgemeine Anforderungen"},"Sicherheit von Maschinen — Elektrische Ausrüstung von Maschinen —  Teil 1: Allgemeine Anforderungen","Safety of machinery - Electrical equipment of machines - Part 1: General requirements IEC 60204-1:2005 (Modified)","Sécurité des machines — Equipement électrique des machines — Partie 1: Règles générales"]
["1.2.1.","EN 60204-1:2006/AC:2010",{"$f":"INDEX(Table_Standards[#This Row],1,Language_select+3)","v":"Sicherheit von Maschinen — Elektrische Ausrüstung von Maschinen —  Teil 1: Allgemeine Anforderungen"},"Sicherheit von Maschinen — Elektrische Ausrüstung von Maschinen —  Teil 1: Allgemeine Anforderungen","Safety of machinery - Electrical equipment of machines - Part 1: General requirements IEC 60204-1:2005 (Modified)","Sécurité des machines — Equipement électrique des machines — Partie 1: Règles générales"]
["1.2.1.","EN 60204-31:2013",{"$f":"INDEX(Table_Standards[#This Row],1,Language_select+3)","v":"Sicherheit von Maschinen — Elektrische Ausrüstung von Maschinen — Teil 31: Besondere Sicherheits- und EMV-Anforderungen an Nähmaschinen, Näheinheiten und Nähanlagen (CENELEC)"},"Sicherheit von Maschinen — Elektrische Ausrüstung von Maschinen — Teil 31: Besondere Sicherheits- und EMV-Anforderungen an Nähmaschinen, Näheinheiten und Nähanlagen (CENELEC)","Safety of machinery — Electrical equipment of machines — Part 31: Particular safety and EMC requirements for sewing machines, units and systems","Sécurité des machines — Equipement électrique des machines — Partie 31: Exigences particulières de sécurité et de CEM pour machines à coudre, unités et systèmes de couture"]
["1.2.1.","EN 60947-5-3:2013",{"$f":"INDEX(Table_Standards[#This Row],1,Language_select+3)","v":"Niederspannungsschaltgeräte — Teil 5-3: Steuergeräte und Schaltelemente — Anforderungen für Näherungsschalter mit definiertem Verhal-ten unter Fehlerbedingungen (PDDB)"},"Niederspannungsschaltgeräte — Teil 5-3: Steuergeräte und Schaltelemente — Anforderungen für Näherungsschalter mit definiertem Verhal-ten unter Fehlerbedingungen (PDDB)","Low-voltage switchgear and controlgear — Part 5-3: Control circuit devices and switching elements — Requirements for proximity devices with defined behaviour under fault conditions","Appareillage à basse tension — Partie 5-3: Appareils et éléments de commutation pour circuits de commande — Exigences pour dispositifs de détection de proximité à comportement défini dans des conditions de défaut"]
["1.2.1.","EN 61800-5-2:2007",{"$f":"INDEX(Table_Standards[#This Row],1,Language_select+3)","v":"Elektrische Leistungsantriebe mit einstellbarer Drehzahl – Teil 5-2: Anforderungen an die Sicherheit – Funktionelle Sicherheit (CENELEC)"},"Elektrische Leistungsantriebe mit einstellbarer Drehzahl – Teil 5-2: Anforderungen an die Sicherheit – Funktionelle Sicherheit (CENELEC)","Adjustable speed electrical power drive systems — Part 5-2: Safety requirements — Functional","Entraînements électriques de puissance à vitesse variable — Partie 5-2: Exigences de sécurité — Fonctionnalité"]
["1.2.1.","EN 62061:2005/AC:2010",{"$f":"INDEX(Table_Standards[#This Row],1,Language_select+3)","v":"Sicherheit von Maschinen — Funktionale Sicherheit sicherheitsbezogener  elektrischer, elektronischer und programmierbarer elektronischer  Steuerungssysteme"},"Sicherheit von Maschinen — Funktionale Sicherheit sicherheitsbezogener  elektrischer, elektronischer und programmierbarer elektronischer  Steuerungssysteme","Safety of machinery - Functional safety of safety-related electrical, electronic and programmable electronic control systems IEC 62061:2005","Sécurité des machines — Sécurité fonctionnelle des systèmes de commande électriques, électroniques et électroniques programmables relatifs à la sécurité"]
["1.2.1.","EN 62061:2005/A1:2013",{"$f":"INDEX(Table_Standards[#This Row],1,Language_select+3)","v":"Sicherheit von Maschinen — Funktionale Sicherheit sicherheitsbezogener  elektrischer, elektronischer und programmierbarer elektronischer  Steuerungssysteme"},"Sicherheit von Maschinen — Funktionale Sicherheit sicherheitsbezogener  elektrischer, elektronischer und programmierbarer elektronischer  Steuerungssysteme","Safety of machinery - Functional safety of safety-related electrical, electronic and programmable electronic control systems IEC 62061:2005","Sécurité des machines — Sécurité fonctionnelle des systèmes de commande électriques, électroniques et électroniques programmables relatifs à la sécurité"]
["1.2.1.","EN 62061:2005/A2:2015",{"$f":"INDEX(Table_Standards[#This Row],1,Language_select+3)","v":"Sicherheit von Maschinen — Funktionale Sicherheit sicherheitsbezogener  elektrischer, elektronischer und programmierbarer elektronischer  Steuerungssysteme"},"Sicherheit von Maschinen — Funktionale Sicherheit sicherheitsbezogener  elektrischer, elektronischer und programmierbarer elektronischer  Steuerungssysteme","Safety of machinery - Functional safety of safety-related electrical, electronic and programmable electronic control systems IEC 62061:2005","Sécurité des machines — Sécurité fonctionnelle des systèmes de commande électriques, électroniques et électroniques programmables relatifs à la sécurité"]
[null,"---",{"$f":"INDEX(Table_Standards[#This Row],1,Language_select+3)","v":" "}," "," "," "]
[null,null,{"$f":"INDEX(Table_Standards[#This Row],1,Language_select+3)","v":"Stellteile"},"Stellteile","Control devices","Français"]
["1.2.2.","EN 894-1:1997+A1:2008",{"$f":"INDEX(Table_Standards[#This Row],1,Language_select+3)","v":"Sicherheit von Maschinen — Ergonomische Anforderungen an die Gestaltung  von Anzeigen und Stellteilen —  Teil 1: Allgemeine Leitsätze für Benutzer-Interaktion mit Anzeigen und  Stellteilen"},"Sicherheit von Maschinen — Ergonomische Anforderungen an die Gestaltung  von Anzeigen und Stellteilen —  Teil 1: Allgemeine Leitsätze für Benutzer-Interaktion mit Anzeigen und  Stellteilen","Safety of machinery - Ergonomics requirements for the design of displays and control actuators - Part 1: General principles for human interactions with displays and control actuators","Sécurité des machines — Spécifications ergonomiques pour la conception des dispositifs de signalisation et des organes de service — Partie 1: Principes généraux des interactions entre l’homme et les dispositifs de signalisation et organes de service"]
["1.2.2.","EN 894-2:1997+A1:2008",{"$f":"INDEX(Table_Standards[#This Row],1,Language_select+3)","v":"Sicherheit von Maschinen — Ergonomische Anforderungen an die Gestaltung  von Anzeigen und Stellteilen — Teil 2: Anzeigen"},"Sicherheit von Maschinen — Ergonomische Anforderungen an die Gestaltung  von Anzeigen und Stellteilen — Teil 2: Anzeigen","Safety of machinery - Ergonomics requirements for the design of displays and control actuators - Part 2: Displays","Sécurité des machines — Spécifications ergonomiques pour la conception des dispositifs de signalisation et des organes de service — Partie 2: Dispositifs de signalisation"]
["1.2.2.","EN 894-3:2000+A1:2008",{"$f":"INDEX(Table_Standards[#This Row],1,Language_select+3)","v":"Sicherheit von Maschinen — Ergonomische Anforderungen an die Gestaltung  von Anzeigen und Stellteilen — Teil 3: Stellteile"},"Sicherheit von Maschinen — Ergonomische Anforderungen an die Gestaltung  von Anzeigen und Stellteilen — Teil 3: Stellteile","Safety of machinery - Ergonomics requirements for the design of displays and control actuators - Part 3: Control actuators","Sécurité des machines — Spécifications ergonomiques pour la conception des dispositifs de signalisation et des organes de service — Partie 3: Organes de service"]
["1.2.2.","EN 894-4:2010",{"$f":"INDEX(Table_Standards[#This Row],1,Language_select+3)","v":"Sicherheit von Maschinen — Ergonomische Anforderungen an die Gestaltung  von Anzeigen und Stellteilen — Teil 4: Lage und Anordnung von  Anzeigen und Stellteilen"},"Sicherheit von Maschinen — Ergonomische Anforderungen an die Gestaltung  von Anzeigen und Stellteilen — Teil 4: Lage und Anordnung von  Anzeigen und Stellteilen","Safety of machinery - Ergonomics requirements for the design of displays and control actuators - Part 4: Location and arrangement of displays and control actuators","Sécurité des machines — Spécifications ergonomiques pour la conception des dispositifs de signalisation et des organes de service — Partie 4: Agencement et arrangement des dispositifs de signalisation et organes de service"]
["1.2.2.","EN 61310-1:2008",{"$f":"INDEX(Table_Standards[#This Row],1,Language_select+3)","v":"Sicherheit von Maschinen — Anzeigen, Kennzeichen und Bedienen—  Teil 1: Anforderungen an sichtbare, hörbare und tastbare Signale"},"Sicherheit von Maschinen — Anzeigen, Kennzeichen und Bedienen—  Teil 1: Anforderungen an sichtbare, hörbare und tastbare Signale","Safety of machinery - Indication, marking and actuation - Part 1: Requirements for visual, acoustic and tactile signals IEC 61310-1:2007","Sécurité des machines — Indication, marquage et manoeuvre — Partie 1: Exigences pour les signaux visuels, acoustiques et tactiles"]
["1.2.2.","EN 61310-2:2008",{"$f":"INDEX(Table_Standards[#This Row],1,Language_select+3)","v":"Sicherheit von Maschinen — Anzeigen, Kennzeichen und Bedienen —  Teil 2: Anforderungen an die Kennzeichnung"},"Sicherheit von Maschinen — Anzeigen, Kennzeichen und Bedienen —  Teil 2: Anforderungen an die Kennzeichnung","Safety of machinery - Indication, marking and actuation - Part 2: Requirements for marking IEC 61310-2:2007","Sécurité des machines — Indication, marquage et manoeuvre — Partie 2: Exigences pour le marquage"]
["1.2.2.","EN 61310-3:2008",{"$f":"INDEX(Table_Standards[#This Row],1,Language_select+3)","v":"Sicherheit von Maschinen — Anzeigen, Kennzeichen und Bedienen —  Teil 3: Anforderungen an die Anordnung und den Betrieb von Bedienteilen"},"Sicherheit von Maschinen — Anzeigen, Kennzeichen und Bedienen —  Teil 3: Anforderungen an die Anordnung und den Betrieb von Bedienteilen","Safety of machinery - Indication, marking and actuation - Part 3: Requirements for the location and operation of actuators IEC 61310-3:2007","Sécurité des machines — Indication, marquage et manoeuvre — Partie 3: Exigences sur la position et le fonctionnement des organes de commande"]
[null,"---",{"$f":"INDEX(Table_Standards[#This Row],1,Language_select+3)","v":" "}," "," "," "]
[null,null,{"$f":"INDEX(Table_Standards[#This Row],1,Language_select+3)","v":"Ingangsetzen"},"Ingangsetzen","Starting","Français"]
["1.2.3.","EN 1037:1995+A1:2008",{"$f":"INDEX(Table_Standards[#This Row],1,Language_select+3)","v":"Sicherheit von Maschinen — Vermeidung von unerwartetem Anlauf"},"Sicherheit von Maschinen — Vermeidung von unerwartetem Anlauf","Safety of machinery - Prevention of unexpected start-up","Sécurité des machines — Prévention de la mise en marche intempestive"]
[null,"---",{"$f":"INDEX(Table_Standards[#This Row],1,Language_select+3)","v":" "}," "," "," "]
[null,null,{"$f":"INDEX(Table_Standards[#This Row],1,Language_select+3)","v":"Stillsetzen im Notfall"},"Stillsetzen im Notfall","Emergency stop","Français"]
["1.2.4.3.","EN ISO 13850:2015",{"$f":"INDEX(Table_Standards[#This Row],1,Language_select+3)","v":"Sicherheit von Maschinen — Not-Halt — Gestaltungsleitsätze"},"Sicherheit von Maschinen — Not-Halt — Gestaltungsleitsätze","Safety of machinery - Emergency stop - Principles for design (ISO 13850:2006)","Sécurité des machines — Arrêt d’urgence — Principes de conception"]
["1.2.4.3.","EN 60947-5-5:1997+A11:2013",{"$f":"INDEX(Table_Standards[#This Row],1,Language_select+3)","v":"Niederspannungsschaltgeräte — Teil 5-5: Steuergeräte und Schaltelemente — Elektrisches Not-Aus-Gerät mit mechanischer Verrastfunktion"},"Niederspannungsschaltgeräte — Teil 5-5: Steuergeräte und Schaltelemente — Elektrisches Not-Aus-Gerät mit mechanischer Verrastfunktion","Low-voltage switchgear and controlgear - Part 5-5: Control circuit devices and switching elements - Electrical emergency stop device with mechanical latching function","Appareillage à basse tension — Partie 5-5: Appareils et éléments de commutation pour circuits de commande — Appareil d’arrêt d’urgence électrique à accrochage mécanique"]
[null,"---",{"$f":"INDEX(Table_Standards[#This Row],1,Language_select+3)","v":" "}," "," "," "]
[null,null,{"$f":"INDEX(Table_Standards[#This Row],1,Language_select+3)","v":"Bruchrisiko beim Betrieb"},"Bruchrisiko beim Betrieb","Risk of break-up during operation","Français"]
["1.3.2.","EN ISO 4413:2010",{"$f":"INDEX(Table_Standards[#This Row],1,Language_select+3)","v":"Fluidtechnik — Allgemeine Regeln und sicherheitstechnische Anforderungen  an Hydraulikanlagen und deren Bauteile"},"Fluidtechnik — Allgemeine Regeln und sicherheitstechnische Anforderungen  an Hydraulikanlagen und deren Bauteile","Hydraulic fluid power - General rules and safety requirements for systems and their components (ISO 4413:2010)","Transmissions hydrauliques — Règles générales et exigences de sécurité relatives aux systèmes et leurs composants"]
["1.3.2.","EN ISO 4414:2010",{"$f":"INDEX(Table_Standards[#This Row],1,Language_select+3)","v":"Fluidtechnik — Allgemeine Regeln und sicherheitstechnische Anforderungen  an Pneumatikanlagen und deren Bauteile"},"Fluidtechnik — Allgemeine Regeln und sicherheitstechnische Anforderungen  an Pneumatikanlagen und deren Bauteile","Pneumatic fluid power - General rules and safety requirements for systems and their components (ISO 4414:2010)","Transmissions pneumatiques — Règles générales et exigences de sécurité pour les systèmes et leurs composants"]
[null,"---",{"$f":"INDEX(Table_Standards[#This Row],1,Language_select+3)","v":" "}," "," "," "]
[null,null,{"$f":"INDEX(Table_Standards[#This Row],1,Language_select+3)","v":"Risiken durch bewegte Teile"},"Risiken durch bewegte Teile","Risks related to moving parts","Français"]
["1.3.7.","EN 349:1993/A1:2008",{"$f":"INDEX(Table_Standards[#This Row],1,Language_select+3)","v":"Sicherheit von Maschinen — Mindestabstände zur Vermeidung des  Quetschens von Körperteilen"},"Sicherheit von Maschinen — Mindestabstände zur Vermeidung des  Quetschens von Körperteilen","Safety of machinery - Minimum gaps to avoid crushing of parts of the human body","Sécurité des machines — Ecartements minimaux pour prévenir les risques d’écrasement de parties du corps humain"]
["1.3.7.","EN ISO 11161:2007/A1:2010",{"$f":"INDEX(Table_Standards[#This Row],1,Language_select+3)","v":"Sicherheit von Maschinen — Integrierte Fertigungssysteme — Grundlegende Anforderungen"},"Sicherheit von Maschinen — Integrierte Fertigungssysteme — Grundlegende Anforderungen","Safety of machinery — Integrated manufacturing systems — Basic requirements","Sécurité des machines — Systèmes de fabrication intégrés — Prescriptions fondamentales"]
["1.3.7.","EN ISO 13857:2008",{"$f":"INDEX(Table_Standards[#This Row],1,Language_select+3)","v":"Sicherheit von Maschinen — Sicherheitsabstände gegen das Erreichen  von Gefährdungsbereichen mit den oberen und unteren Gliedmaßen"},"Sicherheit von Maschinen — Sicherheitsabstände gegen das Erreichen  von Gefährdungsbereichen mit den oberen und unteren Gliedmaßen","Safety of machinery - Safety distances to prevent hazard zones being reached by upper and lower limbs (ISO 13857:2008)","Sécurité des machines — Distances de sécurité empêchant les membres supérieurs et inférieurs d’atteindre les zones dangereuses"]
[null,"---",{"$f":"INDEX(Table_Standards[#This Row],1,Language_select+3)","v":" "}," "," "," "]
[null,null,{"$f":"INDEX(Table_Standards[#This Row],1,Language_select+3)","v":"Besondere Anforderungen an trennende Schutzeinrichtungen"},"Besondere Anforderungen an trennende Schutzeinrichtungen","Special requirements for guards","Français"]
["1.4.2.","EN ISO 14120:2015",{"$f":"INDEX(Table_Standards[#This Row],1,Language_select+3)","v":"Sicherheit von Maschinen — Trennende Schutzeinrichtungen — Allgemeine Anforderungen an Gestaltung, Bau und Auswahl von feststehenden und beweglichen trennenden Schutzeinrichtungen"},"Sicherheit von Maschinen — Trennende Schutzeinrichtungen — Allgemeine Anforderungen an Gestaltung, Bau und Auswahl von feststehenden und beweglichen trennenden Schutzeinrichtungen","Safety of machinery — Guards — General requirements for the design and construction of fixed and movable guards","Français"]
[null,"---",{"$f":"INDEX(Table_Standards[#This Row],1,Language_select+3)","v":" "}," "," "," "]
[null,null,{"$f":"INDEX(Table_Standards[#This Row],1,Language_select+3)","v":"Beweglich trennende Schutzeinrichtungen mit Verriegelungen"},"Beweglich trennende Schutzeinrichtungen mit Verriegelungen","Interlocking movable guards","Français"]
["1.4.2.2.","EN ISO 14119:2013",{"$f":"INDEX(Table_Standards[#This Row],1,Language_select+3)","v":"Sicherheit von Maschinen — Verriegelungseinrichtungen in Verbindung mit trennenden Schutzeinrichtungen — Leitsätze für Gestaltung und Auswahl"},"Sicherheit von Maschinen — Verriegelungseinrichtungen in Verbindung mit trennenden Schutzeinrichtungen — Leitsätze für Gestaltung und Auswahl","Safety of machinery - Interlocking devices associated with guards - Principles for design and selection","Sécurité des machines — Dispositifs de verrouillage associés à des protecteurs — Principes de conception et de choix"]
[null,"---",{"$f":"INDEX(Table_Standards[#This Row],1,Language_select+3)","v":" "}," "," "," "]
[null,null,{"$f":"INDEX(Table_Standards[#This Row],1,Language_select+3)","v":"Besondere Anforderungen an nicht trennende Schutzeinrichtungen"},"Besondere Anforderungen an nicht trennende Schutzeinrichtungen","Special requirements for protective devices","Français"]
["1.4.3.","EN 574:1996/A1:2008",{"$f":"INDEX(Table_Standards[#This Row],1,Language_select+3)","v":"Sicherheit von Maschinen — Zweihandschaltungen — Funktionelle  Aspekte — Gestaltungsleitsätze"},"Sicherheit von Maschinen — Zweihandschaltungen — Funktionelle  Aspekte — Gestaltungsleitsätze","Safety of machinery - Two-hand control devices - Functional aspects - Principles for design","Sécurité des machines — Dispositifs de commande bimanuelle — Aspects fonctionnels — Principes de conception"]
["1.4.3.","EN ISO 13855:2010",{"$f":"INDEX(Table_Standards[#This Row],1,Language_select+3)","v":"Sicherheit von Maschinen — Anordnung von Schutzeinrichtungen im  Hinblick auf Annäherungsgeschwindigkeiten von Körperteilen"},"Sicherheit von Maschinen — Anordnung von Schutzeinrichtungen im  Hinblick auf Annäherungsgeschwindigkeiten von Körperteilen","Safety of machinery - Positioning of safeguards with respect to the approach speeds of parts of the human body (ISO 13855:2010)","Sécurité des machines — Positionnement des moyens de protection par rapport à la vitesse d’approche des parties du corps"]
["1.4.3.","EN ISO 13856-1:2013",{"$f":"INDEX(Table_Standards[#This Row],1,Language_select+3)","v":"Sicherheit von Maschinen — Druckempfindliche Schutzeinrichtungen — Teil 1: Allgemeine Leitsätze für die Gestaltung und Prüfung von Schaltmatten und Schaltplatten"},"Sicherheit von Maschinen — Druckempfindliche Schutzeinrichtungen — Teil 1: Allgemeine Leitsätze für die Gestaltung und Prüfung von Schaltmatten und Schaltplatten","Safety of machinery - Pressure-sensitive protective devices - Part 1: General principles for the design and testing of pressure-sensitive mats and pressure-sensitive floors","Sécurité des machines — Dispositifs de protection sensibles à la pression — Partie 1: Principes généraux de conception et d’essai des tapis et planchers sensibles à la pression"]
["1.4.3.","EN ISO 13856-2:2013",{"$f":"INDEX(Table_Standards[#This Row],1,Language_select+3)","v":"Sicherheit von Maschinen — Druckempfindliche Schutzeinrichtungen — Teil 2: Allgemeine Leitsätze für die Gestaltung und Prüfung von Schaltleisten und Schaltstangen"},"Sicherheit von Maschinen — Druckempfindliche Schutzeinrichtungen — Teil 2: Allgemeine Leitsätze für die Gestaltung und Prüfung von Schaltleisten und Schaltstangen","Safety of machinery - Pressure-sensitive protective devices - Part 2: General principles for the design and testing of pressure-sensitive edges and pressure-sensitive bars","Sécurité des machines — Dispositifs de protection sensibles à la pression — Partie 2: Principes généraux de conception et d’essai des bords et barres sensibles à la pression"]
["1.4.3.","EN ISO 13856-3:2013",{"$f":"INDEX(Table_Standards[#This Row],1,Language_select+3)","v":"Sicherheit von Maschinen — Druckempfindliche Schutzeinrichtungen — Teil 3: Allgemeine Leitsätze für die Gestaltung und Prüfung von Schaltpuffern, Schaltflächen, Schaltleinen und ähnlichen Einrichtungen"},"Sicherheit von Maschinen — Druckempfindliche Schutzeinrichtungen — Teil 3: Allgemeine Leitsätze für die Gestaltung und Prüfung von Schaltpuffern, Schaltflächen, Schaltleinen und ähnlichen Einrichtungen","Safety of machinery - Pressure-sensitive protective devices - Part 3: General principles for design and testing of pressure-sensitive bumpers, plates, wires and similar devices ","Sécurité des machines — Dispositifs de protection sensibles à la pression — Partie 3: Principes généraux de conception et d’essai des pare-chocs, plaques, câbles et dispositifs analogues sensibles à la pression"]
["1.4.3.","EN 61496-1:2013",{"$f":"INDEX(Table_Standards[#This Row],1,Language_select+3)","v":"Sicherheit von Maschinen — Berührungslos wirkende Schutzeinrichtungen  — Teil 1: Allgemeine Anforderungen und Prüfungen"},"Sicherheit von Maschinen — Berührungslos wirkende Schutzeinrichtungen  — Teil 1: Allgemeine Anforderungen und Prüfungen","Safety of machinery - Electro-sensitive protective equipment - Part 1: General requirements and tests IEC 61496-1:2004 (Modified)","Sécurité des machines — Équipements de protection électro-sensibles — Partie 1: Prescriptions générales et essais"]
[null,"---",{"$f":"INDEX(Table_Standards[#This Row],1,Language_select+3)","v":" "}," "," "," "]
[null,null,{"$f":"INDEX(Table_Standards[#This Row],1,Language_select+3)","v":"Elektrische Energieversorgung"},"Elektrische Energieversorgung","Electricity supply","Français"]
["1.5.01.","EN 60204-1:2006/A1:2009",{"$f":"INDEX(Table_Standards[#This Row],1,Language_select+3)","v":"Sicherheit von Maschinen — Elektrische Ausrüstung von Maschinen —  Teil 1: Allgemeine Anforderungen"},"Sicherheit von Maschinen — Elektrische Ausrüstung von Maschinen —  Teil 1: Allgemeine Anforderungen","Safety of machinery - Electrical equipment of machines - Part 1: General requirements IEC 60204-1:2005 (Modified)","Sécurité des machines — Equipement électrique des machines — Partie 1: Règles générales"]
["1.5.01.","IEC 60204-1:2005/A1:2008",{"$f":"INDEX(Table_Standards[#This Row],1,Language_select+3)","v":"Sicherheit von Maschinen — Elektrische Ausrüstung von Maschinen —  Teil 1: Allgemeine Anforderungen"},"Sicherheit von Maschinen — Elektrische Ausrüstung von Maschinen —  Teil 1: Allgemeine Anforderungen","Safety of machinery - Electrical equipment of machines - Part 1: General requirements IEC 60204-1:2005 (Modified)","Sécurité des machines — Equipement électrique des machines — Partie 1: Règles générales"]
["1.5.01.","EN 60204-1:2006/AC:2010",{"$f":"INDEX(Table_Standards[#This Row],1,Language_select+3)","v":"Sicherheit von Maschinen — Elektrische Ausrüstung von Maschinen —  Teil 1: Allgemeine Anforderungen"},"Sicherheit von Maschinen — Elektrische Ausrüstung von Maschinen —  Teil 1: Allgemeine Anforderungen","Safety of machinery - Electrical equipment of machines - Part 1: General requirements IEC 60204-1:2005 (Modified)","Sécurité des machines — Equipement électrique des machines — Partie 1: Règles générales"]
["1.5.01.","EN 60204-11:2000",{"$f":"INDEX(Table_Standards[#This Row],1,Language_select+3)","v":"Sicherheit von Maschinen — Elektrische Ausrüstung von Maschinen —  Teil 11: Anforderungen an Hochspannungsausrüstung für Spannungen  über 1000 V Wechselspannung oder 1 500 V Gleichspannung aber nicht  über 36 kV"},"Sicherheit von Maschinen — Elektrische Ausrüstung von Maschinen —  Teil 11: Anforderungen an Hochspannungsausrüstung für Spannungen  über 1000 V Wechselspannung oder 1 500 V Gleichspannung aber nicht  über 36 kV","Safety of machinery - Electrical equipment of machines - Part 11: Requirements for HV equipment for voltages above 1 000 V a.c. or 1 500 V d.c. and not exceeding 36 kV IEC 60204-11:2000","Sécurité des machines — Equipement électrique des machines — Partie 11: Prescriptions pour les équipements HT fonctionnant à des tensions supérieures à 1 000 V c.a. ou 1 500 V c.c. et ne dépassant pas 36 kV"]
["1.5.01.","EN 60204-11:2000/AC:2010",{"$f":"INDEX(Table_Standards[#This Row],1,Language_select+3)","v":"Sicherheit von Maschinen — Elektrische Ausrüstung von Maschinen —  Teil 11: Anforderungen an Hochspannungsausrüstung für Spannungen  über 1000 V Wechselspannung oder 1 500 V Gleichspannung aber nicht  über 36 kV"},"Sicherheit von Maschinen — Elektrische Ausrüstung von Maschinen —  Teil 11: Anforderungen an Hochspannungsausrüstung für Spannungen  über 1000 V Wechselspannung oder 1 500 V Gleichspannung aber nicht  über 36 kV","Safety of machinery - Electrical equipment of machines - Part 11: Requirements for HV equipment for voltages above 1 000 V a.c. or 1 500 V d.c. and not exceeding 36 kV IEC 60204-11:2000","Sécurité des machines — Equipement électrique des machines — Partie 11: Prescriptions pour les équipements HT fonctionnant à des tensions supérieures à 1 000 V c.a. ou 1 500 V c.c. et ne dépassant pas 36 kV"]
["1.5.01.","EN 60204-32:2008",{"$f":"INDEX(Table_Standards[#This Row],1,Language_select+3)","v":"Sicherheit von Maschinen — Elektrische Ausrüstung von Maschinen —  Teil 32: Anforderungen für Hebezeuge"},"Sicherheit von Maschinen — Elektrische Ausrüstung von Maschinen —  Teil 32: Anforderungen für Hebezeuge","Safety of machinery - Electrical equipment of machines - Part 32: Requirements for hoisting machines IEC 60204-32:2008","Sécurité des machines — Équipement électrique des machines — Partie 32: Exigences pour les appareils de levage"]
["1.5.01.","EN 60204-33:2011",{"$f":"INDEX(Table_Standards[#This Row],1,Language_select+3)","v":"Sicherheit von Maschinen — Elektrische Ausrüstungen von Maschinen — Teil 33: Anforderungen an Fertigungseinrichtungen für Halbleiter"},"Sicherheit von Maschinen — Elektrische Ausrüstungen von Maschinen — Teil 33: Anforderungen an Fertigungseinrichtungen für Halbleiter","Safety of machinery - Electrical equipment of machines – Part 33: Requirements for semiconductor fabrication equipment IEC 60204-33:2009 (Modified)","Sécurité des machines — Equipement électrique des machines — Partie 33: Exigences pour les équipements de fabrication des semi-conducteurs"]
["1.5.01.","EN 61800-5-2:2007",{"$f":"INDEX(Table_Standards[#This Row],1,Language_select+3)","v":"Elektrische Leistungsantriebe mit einstellbarer Drehzahl –  Teil 5-2: Anforderungen an die Sicherheit – Funktionelle Sicherheit"},"Elektrische Leistungsantriebe mit einstellbarer Drehzahl –  Teil 5-2: Anforderungen an die Sicherheit – Funktionelle Sicherheit","Adjustable speed electrical power drive systems - Part 5-2: Safety requirements - Functional IEC 61800-5-2:2007","Entraînements électriques de puissance à vitesse variable — Partie 5-2: Exigences de sécurité — Fonctionnalité"]
[null,"---",{"$f":"INDEX(Table_Standards[#This Row],1,Language_select+3)","v":" "}," "," "," "]
[null,null,{"$f":"INDEX(Table_Standards[#This Row],1,Language_select+3)","v":"Nichtelektrische Energieversorgung"},"Nichtelektrische Energieversorgung","Energy supply other than electricity","Français"]
["1.5.03.","EN ISO 4413:2010",{"$f":"INDEX(Table_Standards[#This Row],1,Language_select+3)","v":"Fluidtechnik — Allgemeine Regeln und sicherheitstechnische Anforderungen  an Hydraulikanlagen und deren Bauteile"},"Fluidtechnik — Allgemeine Regeln und sicherheitstechnische Anforderungen  an Hydraulikanlagen und deren Bauteile","Hydraulic fluid power - General rules and safety requirements for systems and their components (ISO 4413:2010)","Transmissions hydrauliques — Règles générales et exigences de sécurité relatives aux systèmes et leurs composants"]
["1.5.03.","EN ISO 4414:2010",{"$f":"INDEX(Table_Standards[#This Row],1,Language_select+3)","v":"Fluidtechnik — Allgemeine Regeln und sicherheitstechnische Anforderungen  an Pneumatikanlagen und deren Bauteile"},"Fluidtechnik — Allgemeine Regeln und sicherheitstechnische Anforderungen  an Pneumatikanlagen und deren Bauteile","Pneumatic fluid power - General rules and safety requirements for systems and their components (ISO 4414:2010)","Transmissions pneumatiques — Règles générales et exigences de sécurité pour les systèmes et leurs composants"]
[null,"---",{"$f":"INDEX(Table_Standards[#This Row],1,Language_select+3)","v":" "}," "," "," "]
[null,null,{"$f":"INDEX(Table_Standards[#This Row],1,Language_select+3)","v":"Extreme Temperaturen"},"Extreme Temperaturen","Extreme temperatures","Français"]
["1.5.05.","EN ISO 13732-1:2008",{"$f":"INDEX(Table_Standards[#This Row],1,Language_select+3)","v":"Ergonomie der thermischen Umgebung — Bewertungsverfahren für  menschliche Reaktionen bei Kontakt mit Oberflächen — Teil 1: Heiße  Oberflächen"},"Ergonomie der thermischen Umgebung — Bewertungsverfahren für  menschliche Reaktionen bei Kontakt mit Oberflächen — Teil 1: Heiße  Oberflächen","Ergonomics of the thermal environment - Methods for the assessment of human responses to contact with surfaces - Part 1: Hot surfaces (ISO 13732-1:2006)","Ergonomie des ambiances thermiques — Méthodes d’évaluation de la réponse humaine au contact avec des surfaces — Partie 1: Surfaces chaudes"]
["1.5.05.","EN ISO 13732-3:2008",{"$f":"INDEX(Table_Standards[#This Row],1,Language_select+3)","v":"Ergonomie der thermischen Umgebung — Bewertungsmethoden für  Reaktionen des Menschen bei Kontakt mit Oberflächen — Teil 3: Kalte  Oberflächen"},"Ergonomie der thermischen Umgebung — Bewertungsmethoden für  Reaktionen des Menschen bei Kontakt mit Oberflächen — Teil 3: Kalte  Oberflächen","Ergonomics of the thermal environment - Methods for the assessment of human responses to contact with surfaces - Part 3: Cold surfaces (ISO 13732-3:2005)","Ergonomie des ambiances thermiques — Méthodes d’évaluation de la réponse humaine au contact avec des surfaces — Partie 3: Surfaces froides"]
[null,"---",{"$f":"INDEX(Table_Standards[#This Row],1,Language_select+3)","v":" "}," "," "," "]
[null,null,{"$f":"INDEX(Table_Standards[#This Row],1,Language_select+3)","v":"Brand"},"Brand","Fire","Français"]
["1.5.06.","EN ISO 19353:2016",{"$f":"INDEX(Table_Standards[#This Row],1,Language_select+3)","v":"Sicherheit von Maschinen — Vorbeugender und abwehrender Brandschutz"},"Sicherheit von Maschinen — Vorbeugender und abwehrender Brandschutz","Safety of machinery - Fire prevention and fire protection","Sécurité des machines — Prévention et protection contre l’incendie"]
[null,"---",{"$f":"INDEX(Table_Standards[#This Row],1,Language_select+3)","v":" "}," "," "," "]
[null,null,{"$f":"INDEX(Table_Standards[#This Row],1,Language_select+3)","v":"Explosion"},"Explosion","Explosion","Français"]
["1.5.07.","EN 1127-1:2011",{"$f":"INDEX(Table_Standards[#This Row],1,Language_select+3)","v":"Explosionsfähige Atmosphären — Explosionsschutz — Teil 1: Grundlagen  und Methodik (<-- A-Norm)"},"Explosionsfähige Atmosphären — Explosionsschutz — Teil 1: Grundlagen  und Methodik (<-- A-Norm)","Explosive atmospheres - Explosion prevention and protection - Part 1: Basic concepts and methodology","Atmosphères explosives — Prévention de l’explosion et protection contre l’explosion — Partie 1: Notions fondamentales et méthodologie"]
["1.5.07.","EN 1127-2:2002+A1:2008",{"$f":"INDEX(Table_Standards[#This Row],1,Language_select+3)","v":"Explosionsfähige Atmosphären — Explosionsschutz — Teil 2: Grundlagen  und Methodik in Bergwerken (<-- A-Norm)"},"Explosionsfähige Atmosphären — Explosionsschutz — Teil 2: Grundlagen  und Methodik in Bergwerken (<-- A-Norm)","Explosive atmospheres - Explosion prevention and protection - Part 2: Basic concepts and methodology for mining","Atmosphères explosives — Prévention de l’explosion et protection contre l’explosion — Partie 2: Notions fondamentales et méthodologie dans l’exploitation des mines"]
["1.5.07.","EN 15967:2011",{"$f":"INDEX(Table_Standards[#This Row],1,Language_select+3)","v":"Verfahren zur Bestimmung des maximalen Explosionsdruckes und des  maximalen zeitlichen Druckanstieges für Gase und Dämpfe"},"Verfahren zur Bestimmung des maximalen Explosionsdruckes und des  maximalen zeitlichen Druckanstieges für Gase und Dämpfe","Determination of maximum explosion pressure and the maximum rate of pressure rise of gases and vapours","Détermination de la pression maximale d’explosion et de la vitesse maximale de montée en pression des gaz et des vapeurs"]
["1.5.07.","EN 50223:2015",{"$f":"INDEX(Table_Standards[#This Row],1,Language_select+3)","v":"Stationäre elektrostatische Flockanlagen für entzündbaren Flock —  Sicherheitsanforderungen"},"Stationäre elektrostatische Flockanlagen für entzündbaren Flock —  Sicherheitsanforderungen","Stationary electrostatic application equipment for ignitable flock material - Safety requirements","Matériel fixe de projection électrostatique de flock inflammable — Exigences de sécurité"]
[null,"---",{"$f":"INDEX(Table_Standards[#This Row],1,Language_select+3)","v":" "}," "," "," "]
[null,null,{"$f":"INDEX(Table_Standards[#This Row],1,Language_select+3)","v":"Lärm"},"Lärm","Noise","Français"]
["1.5.08.","EN ISO 3741:2010",{"$f":"INDEX(Table_Standards[#This Row],1,Language_select+3)","v":"Akustik — Ermittlung der Schallleistungspegel von Geräuschquellen  durch Schalldruckmessungen — Hallraumverfahren der Genauigkeitsklasse  1"},"Akustik — Ermittlung der Schallleistungspegel von Geräuschquellen  durch Schalldruckmessungen — Hallraumverfahren der Genauigkeitsklasse  1","Acoustics - Determination of sound power levels and sound energy levels of noise sources using sound pressure - Precision methods for reverberation test rooms (ISO 3741:2010)","Acoustique — Détermination des niveaux de puissance et des niveaux d’énergie acoustiques émis par les sources de bruit à partir de la pression acoustique — Méthodes de laboratoire en salles d’essais réverbérantes"]
["1.5.08.","EN ISO 3743-1:2010",{"$f":"INDEX(Table_Standards[#This Row],1,Language_select+3)","v":"Akustik — Bestimmung der Schallleistungspegel von Geräuschquellen —  Verfahren der Genauigkeitsklasse 2 für kleine, transportable Quellen in  Hallfeldern —  Teil 1: Vergleichsverfahren in Prüfverfahren mit schallharten Wänden"},"Akustik — Bestimmung der Schallleistungspegel von Geräuschquellen —  Verfahren der Genauigkeitsklasse 2 für kleine, transportable Quellen in  Hallfeldern —  Teil 1: Vergleichsverfahren in Prüfverfahren mit schallharten Wänden","Acoustics - Determination of sound power levels and sound energy levels of noise sources using sound pressure - Engineering methods for small movable sources in reverberant fields - Part 1: Comparison method for a hard-walled test room (ISO 3743- 1:2010)","Acoustique — Détermination des niveaux de puissance acoustique et des niveaux d’énergie acoustique émis par les sources de bruit à partir de la pression acoustique — Méthodes d’expertise en champ réverbéré applicables aux petites\nsources transportables — Partie 1: Méthode par comparaison en salle d’essai à parois dures"]
["1.5.08.","EN ISO 3743-2:2009",{"$f":"INDEX(Table_Standards[#This Row],1,Language_select+3)","v":"Akustik — Bestimmung der Schallleistungspegel von Geräuschquellen  aus Schalldruckmessungen — Verfahren der Genauigkeitsklasse 2 für  kleine, transportable Quellen in Hallfeldern —  Teil 2: Verfahren für Sonder-Hallräume"},"Akustik — Bestimmung der Schallleistungspegel von Geräuschquellen  aus Schalldruckmessungen — Verfahren der Genauigkeitsklasse 2 für  kleine, transportable Quellen in Hallfeldern —  Teil 2: Verfahren für Sonder-Hallräume","Acoustics - Determination of sound power levels of noise sources using sound pressure - Engineering methods for small, movable sources in reverberant fields - Part 2: Methods for special reverberation test rooms (ISO 3743-2:1994)","Acoustique — Détermination des niveaux de puissance acoustique et des niveaux d’énergie acoustique émis par les sources de bruit à partir de la pression acoustique — Méthodes d’expertise en champ réverbéré applicables aux petites\nsources transportables — Partie 2: Méthodes en salle d’essai réverbérante spéciale"]
["1.5.08.","EN ISO 3744:2010",{"$f":"INDEX(Table_Standards[#This Row],1,Language_select+3)","v":"Akustik — Bestimmung der Schallleistungspegel von Geräuschquellen  aus Schalldruckmessungen — Hüllflächenverfahren der Genauigkeitsklasse  2 für ein im Wesentlichen freies Schallfeld über einer reflektierenden  Ebene"},"Akustik — Bestimmung der Schallleistungspegel von Geräuschquellen  aus Schalldruckmessungen — Hüllflächenverfahren der Genauigkeitsklasse  2 für ein im Wesentlichen freies Schallfeld über einer reflektierenden  Ebene","Acoustics - Determination of sound power levels and sound energy levels of noise sources using sound pressure - Engineering methods for an essentially free field over a reflecting plane (ISO 3744:2010)","Acoustique — Détermination des niveaux de puissance et d’énergie acoustiques émis par les sources de bruit à partir de la pression acoustique — Méthodes d’expertise pour des conditions approchant celles du champ libre sur plan\nréfléchissant"]
["1.5.08.","EN ISO 3745:2012",{"$f":"INDEX(Table_Standards[#This Row],1,Language_select+3)","v":"Akustik — Bestimmung der Schallleistungspegel von Geräuschquellen  aus Schalldruckmessungen — Verfahren der Genauigkeitsklasse 1 für  reflexionsarme Räume und Halbräume"},"Akustik — Bestimmung der Schallleistungspegel von Geräuschquellen  aus Schalldruckmessungen — Verfahren der Genauigkeitsklasse 1 für  reflexionsarme Räume und Halbräume","Acoustics - Determination of sound power levels and sound energy levels of noise sources using sound pressure - Precision methods for anechoic rooms and hemi- anechoic rooms (ISO 3745:2012)","Acoustique — Détermination des niveaux de puissance acoustique et des niveaux d’énergie acoustique émis par les sources de bruit à partir de la pression acoustique — Méthodes de laboratoire pour les salles anéchoïques et les\nsalles semi-anéchoïques"]
["1.5.08.","EN ISO 3746:2010",{"$f":"INDEX(Table_Standards[#This Row],1,Language_select+3)","v":"Akustik — Bestimmung der Schallleistungspegel von Geräuschquellen  aus Schalldruckmessungen — Hüllflächenverfahren der Genauigkeitsklasse  3 über einer reflektierenden Ebene"},"Akustik — Bestimmung der Schallleistungspegel von Geräuschquellen  aus Schalldruckmessungen — Hüllflächenverfahren der Genauigkeitsklasse  3 über einer reflektierenden Ebene","Acoustics - Determination of sound power levels and sound energy levels of noise sources using sound pressure - Survey method using an enveloping measurement surface over a reflecting plane (ISO 3746:2010)","Acoustique — Détermination des niveaux de puissance acoustique et des niveaux d’énergie acoustique émis par les sources de bruit à partir de la pression acoustique — Méthode de contrôle employant une surface de mesure enveloppante\nau-dessus d’un plan réfléchissant"]
["1.5.08.","EN ISO 3747:2010",{"$f":"INDEX(Table_Standards[#This Row],1,Language_select+3)","v":"Akustik — Bestimmung der Schallleistungspegel von Geräuschquellen  aus Schalldruckmessungen –Vergleichsverfahren zur Verwendung unter  Einsatzbedingungen"},"Akustik — Bestimmung der Schallleistungspegel von Geräuschquellen  aus Schalldruckmessungen –Vergleichsverfahren zur Verwendung unter  Einsatzbedingungen","Acoustics - Determination of sound power levels and sound energy levels of noise sources using sound pressure - Engineering/ survey methods for use in situ in a reverberant environment (ISO 3747:2010)","Acoustique — Détermination des niveaux de puissance acoustique et des niveaux d’énergie acoustique émis par les sources de bruit à partir de la pression acoustique — Méthode d’expertise et de contrôle pour une utilisation in situ en\nenvironnement réverbérant"]
["1.5.08.","EN ISO 4871:2009",{"$f":"INDEX(Table_Standards[#This Row],1,Language_select+3)","v":"Akustik — Angabe und Nachprüfung von Geräuschemissionswerten von  Maschinen und Geräten"},"Akustik — Angabe und Nachprüfung von Geräuschemissionswerten von  Maschinen und Geräten","Acoustics - Declaration and verification of noise emission values of machinery and equipment (ISO 4871:1996)","Acoustique — Déclaration et vérification des valeurs d’émission sonore des machines et équipements"]
["1.5.08.","EN ISO 5136:2009",{"$f":"INDEX(Table_Standards[#This Row],1,Language_select+3)","v":"Akustik — Bestimmung der von Ventilatoren und anderen Strömungsmaschinen  in Kanäle abgestrahlten Schallleistung — Kanalverfahren"},"Akustik — Bestimmung der von Ventilatoren und anderen Strömungsmaschinen  in Kanäle abgestrahlten Schallleistung — Kanalverfahren","Acoustics - Determination of sound power radiated into a duct by fans and other air- moving devices - In-duct method (ISO 5136:2003)","Acoustique — Détermination de la puissance acoustique rayonnée dans un conduit par des ventilateurs et d’autres systèmes de ventilation — Méthode en conduit"]
["1.5.08.","EN ISO 7235:2009",{"$f":"INDEX(Table_Standards[#This Row],1,Language_select+3)","v":"Akustik — Labormessungen an Schalldämpfern in Kanälen — Einfügungsdämpfung,  Strömungsgeräusch und Gesamtdruckverlust"},"Akustik — Labormessungen an Schalldämpfern in Kanälen — Einfügungsdämpfung,  Strömungsgeräusch und Gesamtdruckverlust","Acoustics - Laboratory measurement procedures for ducted silencers and air- terminal units - Insertion loss, flow noise and total pressure loss (ISO 7235:2003)","Acoustique — Modes opératoires de mesure en laboratoire pour silencieux en conduit et unités terminales — Perte d’insertion, bruit d’écoulement et perte de pression totale"]
["1.5.08.","EN ISO 9614-1:2009",{"$f":"INDEX(Table_Standards[#This Row],1,Language_select+3)","v":"Akustik — Bestimmung der Schallleistungspegel von Schallquellen aus  Schallintensitätsmessungen — Teil 1: Messungen an diskreten Punkten"},"Akustik — Bestimmung der Schallleistungspegel von Schallquellen aus  Schallintensitätsmessungen — Teil 1: Messungen an diskreten Punkten","Acoustics - Determination of sound power levels of noise sources using sound intensity - Part 1: Measurement at discrete points (ISO 9614-1:1993)","Acoustique — Détermination par intensimétrie des niveaux de puissance acoustique émis par les sources de bruit — Partie 1: Mesurages par points"]
["1.5.08.","EN ISO 9614-3:2009",{"$f":"INDEX(Table_Standards[#This Row],1,Language_select+3)","v":"Akustik — Bestimmung der Schallleistungspegel von Geräuschquellen  aus Schallintensitätsmessungen —  Teil 3: Scanning-Verfahren der Genauigkeitsklasse 1"},"Akustik — Bestimmung der Schallleistungspegel von Geräuschquellen  aus Schallintensitätsmessungen —  Teil 3: Scanning-Verfahren der Genauigkeitsklasse 1","Acoustics - Determination of sound power levels of noise sources using sound intensity - Part 3: Precision method for measurement by scanning (ISO 9614-3:2002)","Acoustique — Détermination par intensimétrie des niveaux de puissance acoustique émis par les sources de bruit — Partie 3: Méthode de précision pour mesurage par balayage"]
["1.5.08.","EN ISO 11200:2009",{"$f":"INDEX(Table_Standards[#This Row],1,Language_select+3)","v":"Akustik — Geräuschabstrahlung von Maschinen und Geräten — Leitlinien  zur Anwendung der Grundnormen zur Bestimmung von Emissions-  Schalldruckpegeln am Arbeitsplatz und an anderen festgelegten Orten"},"Akustik — Geräuschabstrahlung von Maschinen und Geräten — Leitlinien  zur Anwendung der Grundnormen zur Bestimmung von Emissions-  Schalldruckpegeln am Arbeitsplatz und an anderen festgelegten Orten","Acoustics - Noise emitted by machinery and equipment - Guidelines for the use of basic standards for the determination of emission sound pressure levels at a work station and at other specified positions (ISO 11200:1995, including Cor 1:1997)","Acoustique — Bruit émis par les machines et équipements — Guide d’utilisation des normes de base pour la détermination des niveaux de pression acoustique d’émission au poste de travail et en d’autres positions spécifiées"]
["1.5.08.","EN ISO 11201:2010",{"$f":"INDEX(Table_Standards[#This Row],1,Language_select+3)","v":"Akustik — Geräuschabstrahlung von Maschinen und Geräten — Bestimmung  von Emissions-Schalldruckpegeln am Arbeitsplatz und an  anderen festgelegten Orten in einem im Wesentlichen freien Schallfeld  über einer reflektierenden Ebene mit vernachlässigbaren Umgebungskorrekturen"},"Akustik — Geräuschabstrahlung von Maschinen und Geräten — Bestimmung  von Emissions-Schalldruckpegeln am Arbeitsplatz und an  anderen festgelegten Orten in einem im Wesentlichen freien Schallfeld  über einer reflektierenden Ebene mit vernachlässigbaren Umgebungskorrekturen","Acoustics - Noise emitted by machinery and equipment - Determination of emission sound pressure levels at a work station and at other specified positions in an essentially free field over a reflecting plane with negligible environmental corrections (ISO 11201:2010)","Acoustique — Bruit émis par les machines et équipements — Détermination des niveaux de pression acoustique d’émission au poste de travail et en d’autres positions spécifiées dans des conditions approchant celles du champ libre sur\nplan réfléchissant avec des corrections d’environnement négligeables"]
["1.5.08.","EN ISO 11202:2010",{"$f":"INDEX(Table_Standards[#This Row],1,Language_select+3)","v":"Akustik — Geräuschabstrahlung von Maschinen und Geräten — Bestimmung  von Emissions-Schalldruckpegeln am Arbeitsplatz und an  anderen festgelegten Orten unter Anwendung angenäherter Umgebungskorrekturen"},"Akustik — Geräuschabstrahlung von Maschinen und Geräten — Bestimmung  von Emissions-Schalldruckpegeln am Arbeitsplatz und an  anderen festgelegten Orten unter Anwendung angenäherter Umgebungskorrekturen","Acoustics - Noise emitted by machinery and equipment - Determination of emission sound pressure levels at a work station and at other specified positions applying approximate environmental corrections (ISO 11202:2010)","Acoustique — Bruit émis par les machines et équipements — Détermination des niveaux de pression acoustique d’émission au poste de travail et en d’autres positions spécifiées en appliquant des corrections d’environnement approximatives"]
["1.5.08.","EN ISO 11203:2009",{"$f":"INDEX(Table_Standards[#This Row],1,Language_select+3)","v":"Akustik — Geräuschabstrahlung von Maschinen und Geräten — Bestimmung  von Emissions-Schalldruckpegeln am Arbeitsplatz und an  anderen festgelegten Orten aus dem Schallleistungspegel"},"Akustik — Geräuschabstrahlung von Maschinen und Geräten — Bestimmung  von Emissions-Schalldruckpegeln am Arbeitsplatz und an  anderen festgelegten Orten aus dem Schallleistungspegel","Acoustics - Noise emitted by machinery and equipment - Determination of emission sound pressure levels at a work station and at other specified positions from the sound power level (ISO 11203:1995)","Acoustique — Bruit émis par les machines et équipements — Détermination des niveaux de pression acoustique d’émission au poste de travail et en d’autres positions spécifiées à partir du niveau de puissance acoustique"]
["1.5.08.","EN ISO 11204:2010",{"$f":"INDEX(Table_Standards[#This Row],1,Language_select+3)","v":"Akustik — Geräuschabstrahlung von Maschinen und Geräten — Bestimmung  von Emissions-Schalldruckpegeln am Arbeitsplatz und an  anderen festgelegten Orten unter Anwendung exakter Umgebungskorrekturen"},"Akustik — Geräuschabstrahlung von Maschinen und Geräten — Bestimmung  von Emissions-Schalldruckpegeln am Arbeitsplatz und an  anderen festgelegten Orten unter Anwendung exakter Umgebungskorrekturen","Acoustics - Noise emitted by machinery and equipment - Determination of emission sound pressure levels at a work station and at other specified positions applying accurate environmental corrections (ISO 11204:2010)","Acoustique — Bruit émis par les machines et équipements — Détermination des niveaux de pression acoustique d’émission au poste de travail et en d’autres positions spécifiées en appliquant des corrections d’environnement exactes"]
["1.5.08.","EN ISO 11205:2009",{"$f":"INDEX(Table_Standards[#This Row],1,Language_select+3)","v":"Akustik — Geräuschabstrahlung von Maschinen und Geräten — Verfahren  der Genauigkeitsklasse 2 zur Bestimmung von Emissions-  Schalldruckpegeln am Arbeitsplatz und an anderen festgelegten Orten  unter Einsatzbedingungen aus Schallintensitätsmessungen"},"Akustik — Geräuschabstrahlung von Maschinen und Geräten — Verfahren  der Genauigkeitsklasse 2 zur Bestimmung von Emissions-  Schalldruckpegeln am Arbeitsplatz und an anderen festgelegten Orten  unter Einsatzbedingungen aus Schallintensitätsmessungen","Acoustics - Noise emitted by machinery and equipment - Engineering method for the determination of emission sound pressure levels in situ at the work station and at other specified positions using sound intensity (ISO 11205:2003)","Acoustique — Bruits émis par les machines et les équipements — Méthode d’expertise pour la détermination par intensimétrie des niveaux de pression acoustique d’émission in situ au poste de travail et en d’autres positions spécifiées"]
["1.5.08.","EN ISO 11546-1:2009",{"$f":"INDEX(Table_Standards[#This Row],1,Language_select+3)","v":"Akustik — Bestimmung der Schalldämmung von Schallschutzkapseln —  Teil 1: Messungen unter Laborbedingungen (zum Zweck der Kennzeichnung)"},"Akustik — Bestimmung der Schalldämmung von Schallschutzkapseln —  Teil 1: Messungen unter Laborbedingungen (zum Zweck der Kennzeichnung)","Acoustics - Determination of sound insulation performances of enclosures - Part 1: Measurements under laboratory conditions (for declaration purposes) (ISO 11546- 1:1995)","Acoustique — Détermination de l’isolement acoustique des encoffrements — Partie 1: Mesurages dans des conditions de laboratoire (aux fins de déclaration)"]
["1.5.08.","EN ISO 11546-2:2009",{"$f":"INDEX(Table_Standards[#This Row],1,Language_select+3)","v":"Akustik — Bestimmung der Schalldämmung von Schallschutzkapseln —  Teil 2: Messungen im Einsatzfall (zum Zweck der Abnahme und Nachprüfung)"},"Akustik — Bestimmung der Schalldämmung von Schallschutzkapseln —  Teil 2: Messungen im Einsatzfall (zum Zweck der Abnahme und Nachprüfung)","Acoustics - Determination of sound insulation performances of enclosures - Part 2: Measurements in situ (for acceptance and verification purposes) (ISO 11546-2:1995)","Acoustique — Détermination de l’isolement acoustique des encoffrements — Partie 2: Mesurages sur site (aux fins d’acceptation et de vérification)"]
["1.5.08.","EN ISO 11688-1:2009",{"$f":"INDEX(Table_Standards[#This Row],1,Language_select+3)","v":"Akustik — Richtlinien für die Konstruktion lärmarmer Maschinen und  Geräte — Teil 1: Planung"},"Akustik — Richtlinien für die Konstruktion lärmarmer Maschinen und  Geräte — Teil 1: Planung","Acoustics - Recommended practice for the design of low-noise machinery and equipment - Part 1: Planning (ISO/TR 11688-1:1995)","Acoustique — Pratique recommandée pour la conception de machines et d’équipements à bruit réduit — Partie 1: Planification"]
["1.5.08.","EN ISO 11691:2009",{"$f":"INDEX(Table_Standards[#This Row],1,Language_select+3)","v":"Akustik — Messung des Einfügungsdämpfungsmaßes von Schalldämpfern  in Kanälen ohne Strömung — Laborverfahren der Genauigkeitsklasse  3"},"Akustik — Messung des Einfügungsdämpfungsmaßes von Schalldämpfern  in Kanälen ohne Strömung — Laborverfahren der Genauigkeitsklasse  3","Acoustics - Measurement of insertion loss of ducted silencers without flow - Laboratory survey method (ISO 11691:1995)","Acoustique — Détermination de la perte d’insertion de silencieux en conduit sans écoulement — Méthode de mesurage en laboratoire"]
["1.5.08.","EN ISO 11957:2009",{"$f":"INDEX(Table_Standards[#This Row],1,Language_select+3)","v":"Akustik — Messung der Schalldämmung von Schallschutzkabinen —  Messungen im Labor und im Einsatzfall"},"Akustik — Messung der Schalldämmung von Schallschutzkabinen —  Messungen im Labor und im Einsatzfall","Acoustics - Determination of sound insulation performance of cabins - Laboratory and in situ measurements (ISO 11957:1996)","Acoustique — Détermination des performances d’isolation acoustique des cabines — Mesurages en laboratoire et in situ"]
[null,"---",{"$f":"INDEX(Table_Standards[#This Row],1,Language_select+3)","v":" "}," "," "," "]
[null,null,{"$f":"INDEX(Table_Standards[#This Row],1,Language_select+3)","v":"Vibration"},"Vibration","Vibrations","Français"]
["1.5.09.","EN 1032:2003+A1:2008",{"$f":"INDEX(Table_Standards[#This Row],1,Language_select+3)","v":"Mechanische Schwingungen — Prüfverfahren für bewegliche Maschinen  zum Zwecke der Bestimmung des Schwingungsemissionswertes"},"Mechanische Schwingungen — Prüfverfahren für bewegliche Maschinen  zum Zwecke der Bestimmung des Schwingungsemissionswertes","Mechanical vibration - Testing of mobile machinery in order to determine the vibration emission value","Vibrations mécaniques — Essai des machines mobiles dans le but de déterminer la valeur d’émission vibratoire"]
["1.5.09.","EN 1299:1997+A1:2008",{"$f":"INDEX(Table_Standards[#This Row],1,Language_select+3)","v":"Mechanische Schwingungen und Stöße — Schwingungsisolierung von  Maschinen — Angaben für den Einsatz von Quellenisolierungen"},"Mechanische Schwingungen und Stöße — Schwingungsisolierung von  Maschinen — Angaben für den Einsatz von Quellenisolierungen","Mechanical vibration and shock - Vibration isolation of machines - Information for the application of source isolation","Vibrations et chocs mécaniques — Isolation vibratoire des machines — Informations pour la mise en oeuvre de l’isolation des sources"]
["1.5.09.","EN ISO 10326-1:2016",{"$f":"INDEX(Table_Standards[#This Row],1,Language_select+3)","v":"Mechanische Schwingungen — Laborverfahren zur Bewertung der Schwingungen von Fahrzeugsitzen — Teil 1: Grundlegende Anforderungen"},"Mechanische Schwingungen — Laborverfahren zur Bewertung der Schwingungen von Fahrzeugsitzen — Teil 1: Grundlegende Anforderungen","Mechanical vibration - Laboratory method for evaluating vehicle seat vibration - Part 1: Basic requirements","Vibrations mécaniques -- Méthode en laboratoire pour l'évaluation des vibrations du siège de véhicule -- Partie 1: Exigences de base"]
["1.5.09.","EN 12786:2013",{"$f":"INDEX(Table_Standards[#This Row],1,Language_select+3)","v":"Sicherheit von Maschinen — Anforderungen an die Abfassung der Abschnitte über Schwingungen in Sicherheitsnormen"},"Sicherheit von Maschinen — Anforderungen an die Abfassung der Abschnitte über Schwingungen in Sicherheitsnormen","Safety of machinery — Requirements for the drafting of the vibration clauses of safety standards","Sécurité des machines — Exigences relatives à la rédaction des clauses vibrations des normes de sécurité"]
["1.5.09.","EN 13490:2001+A1:2008",{"$f":"INDEX(Table_Standards[#This Row],1,Language_select+3)","v":"Mechanische Schwingungen — Flurförderzeuge — Laborverfahren zur  Bewertung sowie Spezifikation der Schwingungen des Maschinenführersitzes"},"Mechanische Schwingungen — Flurförderzeuge — Laborverfahren zur  Bewertung sowie Spezifikation der Schwingungen des Maschinenführersitzes","Mechanical vibration - Industrial trucks - Laboratory evaluation and specification of operator seat vibration","Sécurité des machines — Exigences relatives à la rédaction des clauses vibrations des normes de sécurité"]
["1.5.09.","EN ISO 13753:2008",{"$f":"INDEX(Table_Standards[#This Row],1,Language_select+3)","v":"Mechanische Schwingungen und Stöße — Hand-Arm-Schwingungen —  Verfahren zur Messung der Schwingungsübertragung elastischer Materialien  unter Belastung durch das Hand-Arm-System"},"Mechanische Schwingungen und Stöße — Hand-Arm-Schwingungen —  Verfahren zur Messung der Schwingungsübertragung elastischer Materialien  unter Belastung durch das Hand-Arm-System","Mechanical vibration and shock - Hand-arm vibration - Method for measuring the vibration transmissibility of resilient materials when loaded by the hand-arm system (ISO 13753:1998)","Vibrations et chocs mécaniques — Vibrations main-bras — Méthode pour mesurer le facteur de transmission des vibrations par les matériaux résilients chargés par le système main-bras"]
["1.5.09.","EN ISO 20643:2008/AC:2010",{"$f":"INDEX(Table_Standards[#This Row],1,Language_select+3)","v":"Mechanische Schwingungen — Handgehaltene und handgeführte Maschinen  — Grundsätzliches Vorgehen bei der Ermittlung der Schwingungsemission"},"Mechanische Schwingungen — Handgehaltene und handgeführte Maschinen  — Grundsätzliches Vorgehen bei der Ermittlung der Schwingungsemission","Mechanical vibration - Hand-held and hand- guided machinery - Principles for evaluation of vibration emission (ISO 20643:2005)","Vibration mécanique — Machines tenues et guidées à la main — Principes pour l’évaluation d’émission de vibration"]
["1.5.09.","EN 30326-1:1994/A2:2011",{"$f":"INDEX(Table_Standards[#This Row],1,Language_select+3)","v":"Mechanische Schwingungen — Laborverfahren zur Bewertung der  Schwingungen von Fahrzeugsitzen — Grundlegende Anforderungen"},"Mechanische Schwingungen — Laborverfahren zur Bewertung der  Schwingungen von Fahrzeugsitzen — Grundlegende Anforderungen","Mechanical vibration - Laboratory method for evaluating vehicle seat vibration - Part 1: Basic requirements ","Vibrations mécaniques — Méthode en laboratoire pour l’évaluation des vibrations du siège de véhicule — Partie 1: Exigences de base"]
["1.5.09.","EN 60204-31:2013",{"$f":"INDEX(Table_Standards[#This Row],1,Language_select+3)","v":"Sicherheit von Maschinen — Elektrische Ausrüstung von Maschinen — Teil 31: Besondere Sicherheits- und EMV-Anforderungen an Nähmaschinen, Näheinheiten und Nähanlagen (CENELEC)"},"Sicherheit von Maschinen — Elektrische Ausrüstung von Maschinen — Teil 31: Besondere Sicherheits- und EMV-Anforderungen an Nähmaschinen, Näheinheiten und Nähanlagen (CENELEC)","Safety of machinery — Electrical equipment of machines — Part 31: Particular safety and EMC requirements for sewing machines, units and systems","Sécurité des machines — Equipement électrique des machines — Partie 31: Exigences particulières de sécurité et de CEM pour machines à coudre, unités et systèmes de couture"]
[null,"---",{"$f":"INDEX(Table_Standards[#This Row],1,Language_select+3)","v":" "}," "," "," "]
[null,null,{"$f":"INDEX(Table_Standards[#This Row],1,Language_select+3)","v":"Strahlung"},"Strahlung","Radiation","Français"]
["1.5.10.","EN 12198-1:2000+A1:2008",{"$f":"INDEX(Table_Standards[#This Row],1,Language_select+3)","v":"Sicherheit von Maschinen — Bewertung und Verminderung des Risikos  der von Maschinen emittierten Strahlung — Teil 1: Allgemeine Leitsätze"},"Sicherheit von Maschinen — Bewertung und Verminderung des Risikos  der von Maschinen emittierten Strahlung — Teil 1: Allgemeine Leitsätze","Safety of machinery - Assessment and reduction of risks arising from radiation emitted by machinery - Part 1: General principles","Sécurité des machines — Estimation et réduction des risques engendrés par les rayonnements émis par les machines — Partie 1: Principes généraux"]
["1.5.10.","EN 12198-2:2002+A1:2008",{"$f":"INDEX(Table_Standards[#This Row],1,Language_select+3)","v":"Sicherheit von Maschinen — Bewertung und Verminderung des Risikos  der von Maschinen emittierten Strahlung —  Teil 2: Messverfahren für die Strahlenemission"},"Sicherheit von Maschinen — Bewertung und Verminderung des Risikos  der von Maschinen emittierten Strahlung —  Teil 2: Messverfahren für die Strahlenemission","Safety of machinery - Assessment and reduction of risks arising from radiation emitted by machinery - Part 2: Radiation emission measurement procedure","Sécurité des machines — Estimation et réduction des risques engendrés par les rayonnements émis par les machines — Partie 2: Procédures de mesurage des émissions de rayonnement"]
["1.5.10.","EN 12198-3:2002+A1:2008",{"$f":"INDEX(Table_Standards[#This Row],1,Language_select+3)","v":"Sicherheit von Maschinen — Bewertung und Verminderung des Risikos  der von Maschinen emittierten Strahlung —  Teil 3: Verminderung der Strahlung durch Abschwächung oder Abschirmung"},"Sicherheit von Maschinen — Bewertung und Verminderung des Risikos  der von Maschinen emittierten Strahlung —  Teil 3: Verminderung der Strahlung durch Abschwächung oder Abschirmung","Safety of machinery - Assessment and reduction of risks arising from radiation emitted by machinery - Part 3: Reduction of radiation by attenuation or screening","Sécurité des machines — Estimation et réduction des risques engendrés par les rayonnements émis par les machines — Partie 3: Réduction du rayonnement par atténuation ou par écrans"]
[null,"---",{"$f":"INDEX(Table_Standards[#This Row],1,Language_select+3)","v":" "}," "," "," "]
[null,null,{"$f":"INDEX(Table_Standards[#This Row],1,Language_select+3)","v":"Laserstrahlung"},"Laserstrahlung","Laser radiation","Français"]
["1.5.12.","EN ISO 11145:2008",{"$f":"INDEX(Table_Standards[#This Row],1,Language_select+3)","v":"Optik und Photonik — Laser und Laseranlagen — Begriffe und Formelzeichen"},"Optik und Photonik — Laser und Laseranlagen — Begriffe und Formelzeichen","Optics and photonics - Lasers and laser-related equipment - Vocabulary and symbols","Optique et photonique — Lasers et équipements associés aux lasers — Vocabulaire et symboles"]
["1.5.12.","EN ISO 11554:2008",{"$f":"INDEX(Table_Standards[#This Row],1,Language_select+3)","v":"Optik und Photonik — Laser und Laseranlagen — Prüfverfahren für Leistung, Energie und Kenngrößen des Zeitverhaltens von Laserstrahlen"},"Optik und Photonik — Laser und Laseranlagen — Prüfverfahren für Leistung, Energie und Kenngrößen des Zeitverhaltens von Laserstrahlen","Optics and photonics — Lasers and laser-related equipment — Test methods for laser beam power, energy and temporal characteristics","Optique et photonique — Lasers et équipements associés aux lasers — Méthodes d’essai de la puissance et de l’énergie des faisceaux lasers et de leurs caractéristiques temporelles"]
["1.5.12.","EN 12254:2010",{"$f":"INDEX(Table_Standards[#This Row],1,Language_select+3)","v":"Abschirmungen an Laserarbeitsplätzen — Sicherheitstechnische Anforderung  und Prüfung"},"Abschirmungen an Laserarbeitsplätzen — Sicherheitstechnische Anforderung  und Prüfung","Screens for laser working places - Safety requirements and testing","Écrans pour postes de travail au laser — Exigences et essais de sécurité"]
["1.5.12.","EN 12254:2010/AC:2011",{"$f":"INDEX(Table_Standards[#This Row],1,Language_select+3)","v":"Abschirmungen an Laserarbeitsplätzen — Sicherheitstechnische Anforderung  und Prüfung"},"Abschirmungen an Laserarbeitsplätzen — Sicherheitstechnische Anforderung  und Prüfung","Screens for laser working places - Safety requirements and testing","Écrans pour postes de travail au laser — Exigences et essais de sécurité"]
[null,"---",{"$f":"INDEX(Table_Standards[#This Row],1,Language_select+3)","v":" "}," "," "," "]
[null,null,{"$f":"INDEX(Table_Standards[#This Row],1,Language_select+3)","v":"Emission gefährlicher Werkstoffe und Substanzen"},"Emission gefährlicher Werkstoffe und Substanzen","Emissions of hazardous materials and substances","Français"]
["1.5.13.","EN 1093-1:2008",{"$f":"INDEX(Table_Standards[#This Row],1,Language_select+3)","v":"Sicherheit von Maschinen — Bewertung der Emission von luftgetragenen  Gefahrstoffen — Teil 1: Auswahl der Prüfverfahren"},"Sicherheit von Maschinen — Bewertung der Emission von luftgetragenen  Gefahrstoffen — Teil 1: Auswahl der Prüfverfahren","Safety of machinery - Evaluation of the emission of airborne hazardous substances - Part 1: Selection of test methods","Sécurité des machines — Évaluation de l’émission de substances dangereuses véhiculées par l’air — Partie 1: Choix des méthodes d’essai"]
["1.5.13.","EN 1093-2:2006+A1:2008",{"$f":"INDEX(Table_Standards[#This Row],1,Language_select+3)","v":"Sicherheit von Maschinen — Bewertung der Emission von luftgetragenen  Gefahrstoffen — Teil 2: Tracergasverfahren zur Messung der Emissionsrate  eines bestimmten luftverunreinigenden Stoffes"},"Sicherheit von Maschinen — Bewertung der Emission von luftgetragenen  Gefahrstoffen — Teil 2: Tracergasverfahren zur Messung der Emissionsrate  eines bestimmten luftverunreinigenden Stoffes","Safety of machinery - Evaluation of the emission of airborne hazardous substances - Part 2: Tracer gas method for the measurement of the emission rate of a given pollutant","Sécurité des machines — Évaluation de l’émission de substances dangereuses véhiculées par l’air — Partie 2: Méthode par traçage pour l’évaluation du débit d’émission d’un polluant donné"]
["1.5.13.","EN 1093-3:2006+A1:2008",{"$f":"INDEX(Table_Standards[#This Row],1,Language_select+3)","v":"Sicherheit von Maschinen — Bewertung der Emission von luftgetragenen  Gefahrstoffen — Teil 3: Prüfstandverfahren zur Messung der Emissionsrate  eines bestimmten luftverunreinigenden Stoffes"},"Sicherheit von Maschinen — Bewertung der Emission von luftgetragenen  Gefahrstoffen — Teil 3: Prüfstandverfahren zur Messung der Emissionsrate  eines bestimmten luftverunreinigenden Stoffes","Safety of machinery - Evaluation of the emission of airborne hazardous substances - Part 3: Test bench method for the measurement of the emission rate of a given pollutant","Sécurité des machines — Évaluation de l’émission de substances dangereuses véhiculées par l’air — Partie 3: Méthode sur banc d’essai pour le mesurage du débit d’émission d’un polluant donné"]
["1.5.13.","EN 1093-4:1996+A1:2008",{"$f":"INDEX(Table_Standards[#This Row],1,Language_select+3)","v":"Sicherheit von Maschinen — Bewertung der Emission von luftgetragenen  Gefahrstoffen — Teil 4: Erfassungsgrad eines Absaugsystems — Tracerverfahren"},"Sicherheit von Maschinen — Bewertung der Emission von luftgetragenen  Gefahrstoffen — Teil 4: Erfassungsgrad eines Absaugsystems — Tracerverfahren","Safety of machinery - Evaluation of the emission of airborne hazardous substances - Part 4: Capture efficiency of an exhaust system - Tracer method","Sécurité des machines — Évaluation de l’émission de substances dangereuses véhiculées par l’air — Partie 4: Efficacité de captage d’un système d’aspiration — Méthode par traçage"]
["1.5.13.","EN 1093-6:1998+A1:2008",{"$f":"INDEX(Table_Standards[#This Row],1,Language_select+3)","v":"Sicherheit von Maschinen — Bewertung der Emission von luftgetragenen  Gefahrstoffen — Teil 6: Masseabscheidegrad, diffuser Auslass"},"Sicherheit von Maschinen — Bewertung der Emission von luftgetragenen  Gefahrstoffen — Teil 6: Masseabscheidegrad, diffuser Auslass","Safety of machinery - Evaluation of the emission of airborne hazardous substances - Part 6: Separation efficiency by mass, unducted outlet","Sécurité des machines — Évaluation de l’émission de substances dangereuses véhiculées par l’air — Partie 6: Efficacité massique de séparation, sortie libre"]
["1.5.13.","EN 1093-7:1998+A1:2008",{"$f":"INDEX(Table_Standards[#This Row],1,Language_select+3)","v":"Sicherheit von Maschinen — Bewertung der Emission von luftgetragenen  Gefahrstoffen — Teil 7: Masseabscheidegrad, definierter Auslass"},"Sicherheit von Maschinen — Bewertung der Emission von luftgetragenen  Gefahrstoffen — Teil 7: Masseabscheidegrad, definierter Auslass","Safety of machinery - Evaluation of the emission of airborne hazardous substances - Part 7: Separation efficiency by mass, ducted outlet","Sécurité des machines — Évaluation de l’émission de substances dangereuses véhiculées par l’air — Partie 7: Efficacité massique de séparation, sortie raccordée"]
["1.5.13.","EN 1093-8:1998+A1:2008",{"$f":"INDEX(Table_Standards[#This Row],1,Language_select+3)","v":"Sicherheit von Maschinen — Bewertung der Emission von luftgetragenen  Gefahrstoffen — Teil 8: Konzentrationsparameter des luftverunreinigenden  Stoffes, Prüfstandverfahren"},"Sicherheit von Maschinen — Bewertung der Emission von luftgetragenen  Gefahrstoffen — Teil 8: Konzentrationsparameter des luftverunreinigenden  Stoffes, Prüfstandverfahren","Safety of machinery - Evaluation of the emission of airborne hazardous substances - Part 8: Pollutant concentration parameter, test bench method","Sécurité des machines — Évaluation de l’émission de substances dangereuses véhiculées par l’air — Partie 8: Paramètre de concentration en polluant, méthode sur banc d’essai"]
["1.5.13.","EN 1093-9:1998+A1:2008",{"$f":"INDEX(Table_Standards[#This Row],1,Language_select+3)","v":"Sicherheit von Maschinen — Bewertung der Emission von luftgetragenen  Gefahrstoffen — Teil 9: Konzentrationsparameter des luftverunreinigenden  Stoffes, Prüfraumverfahren"},"Sicherheit von Maschinen — Bewertung der Emission von luftgetragenen  Gefahrstoffen — Teil 9: Konzentrationsparameter des luftverunreinigenden  Stoffes, Prüfraumverfahren","Safety of machinery - Evaluation of the emission of airborne hazardous substances - Part 9: Pollutant concentration parameter, room method","Sécurité des machines — Évaluation de l’émission de substances dangereuses véhiculées par l’air — Partie 9: Paramètre de concentration en polluant, méthode en salle d’essai"]
["1.5.13.","EN 1093-11:2001+A1:2008",{"$f":"INDEX(Table_Standards[#This Row],1,Language_select+3)","v":"Sicherheit von Maschinen — Bewertung der Emission von luftgetragenen  Gefahrstoffen — Teil 11: Reinigungsindex"},"Sicherheit von Maschinen — Bewertung der Emission von luftgetragenen  Gefahrstoffen — Teil 11: Reinigungsindex","Safety of machinery - Evaluation of the emission of airborne hazardous substances - Part 11: Decontamination index","Sécurité des machines — Évaluation de l’émission de substances dangereuses véhiculées par l’air — Partie 11: Indice d’assainissement"]
["1.5.13.","EN ISO 14123-1:2015",null,"Sicherheit von Maschinen — Minderung von Gesundheitsrisiken, die auf Gefahrstoffemissionen von Maschinen zurückzuführen sind — Teil 1: Grundsätze und Festlegungen für Maschinenhersteller","Safety of machinery — Reduction of risks to health resulting from hazardous substances emitted by machinery — Part 1: Principles and specifications for machinery manufacturers","Sécurité des machines — Réduction des risques pour la santé résultant de substances dangereuses émises par des machines — Partie 1: Principes et spécifications à l’intention des constructeurs de machines"]
["1.5.13.","EN ISO 14123-2:2015",null,"Sicherheit von Maschinen — Minderung von Gesundheitsrisiken, die auf Gefahrstoffemissionen von Maschinen zurückzuführen sind — Teil 2: Methodik beim Aufstellen von Überprüfungsverfahren","Safety of machinery — Reduction of risks to health resulting from hazardous substances emitted by machinery — Part 2: Methodology leading to verification procedures ","Sécurité des machines — Réduction des risques pour la santé résultant de substances dangereuses émises par des machines — Partie 2: Méthodologie menant à des procédures de vérification"]
[null,"---",{"$f":"INDEX(Table_Standards[#This Row],1,Language_select+3)","v":" "}," "," "," "]
[null,null,{"$f":"INDEX(Table_Standards[#This Row],1,Language_select+3)","v":"Zugang zu den Bedienungsständen und den Eingriffspunkten für die Instandhaltung"},"Zugang zu den Bedienungsständen und den Eingriffspunkten für die Instandhaltung","Access to operating positions and servicing points","Français"]
["1.6.2.","EN ISO 14122-1:2016",{"$f":"INDEX(Table_Standards[#This Row],1,Language_select+3)","v":"Sicherheit von Maschinen — Ortsfeste Zugänge zu maschinellen Anlagen  — Teil 1: Wahl eines ortsfesten Zugangs zwischen zwei Ebenen"},"Sicherheit von Maschinen — Ortsfeste Zugänge zu maschinellen Anlagen  — Teil 1: Wahl eines ortsfesten Zugangs zwischen zwei Ebenen","Safety of machinery - Permanent means of access to machinery - Part 1: Choice of fixed means of access between two levels","Sécurité des machines — Moyens d’accès permanents aux machines — Partie 1: Choix d’un moyen d’accès et des exigences générales d’accès"]
["1.6.2.","EN ISO 14122-2:2016",{"$f":"INDEX(Table_Standards[#This Row],1,Language_select+3)","v":"Sicherheit von Maschinen — Ortsfeste Zugänge zu maschinellen Anlagen  — Teil 2: Arbeitsbühnen und Laufstege"},"Sicherheit von Maschinen — Ortsfeste Zugänge zu maschinellen Anlagen  — Teil 2: Arbeitsbühnen und Laufstege","Safety of machinery - Permanent means of access to machinery - Part 2: Working platforms and walkways","Sécurité des machines — Moyens d’accès permanents aux machines — Partie 2: Plates-formes de travail et passerelles "]
["1.6.2.","EN ISO 14122-3:2016",{"$f":"INDEX(Table_Standards[#This Row],1,Language_select+3)","v":"Sicherheit von Maschinen — Ortsfeste Zugänge zu maschinellen Anlagen  — Teil 3: Treppen, Treppenleitern und Geländer"},"Sicherheit von Maschinen — Ortsfeste Zugänge zu maschinellen Anlagen  — Teil 3: Treppen, Treppenleitern und Geländer","Safety of machinery - Permanent means of access to machinery - Part 3: Stairs, stepladders and guard-rails","Sécurité des machines — Moyens d’accès permanents aux machines — Partie 3: Escaliers, échelles à marches et garde-corps "]
["1.6.2.","EN ISO 14122-4:2016",{"$f":"INDEX(Table_Standards[#This Row],1,Language_select+3)","v":"Sicherheit von Maschinen — Ortsfeste Zugänge zu maschinellen Anlagen  — Teil 4: Ortsfeste Steigleitern"},"Sicherheit von Maschinen — Ortsfeste Zugänge zu maschinellen Anlagen  — Teil 4: Ortsfeste Steigleitern","Safety of machinery - Permanent means of access to machinery - Part 4: Fixed ladders","Sécurité des machines — Moyens d’accès permanents aux machines — Partie 4: Échelles fixes "]
[null,"---",{"$f":"INDEX(Table_Standards[#This Row],1,Language_select+3)","v":" "}," "," "," "]
[null,null,{"$f":"INDEX(Table_Standards[#This Row],1,Language_select+3)","v":"Warnung vor Restrisiken"},"Warnung vor Restrisiken","Warning of residual risks","Français"]
["1.7.2.","EN 842:1996+A1:2008",{"$f":"INDEX(Table_Standards[#This Row],1,Language_select+3)","v":"Sicherheit von Maschinen — Optische Gefahrensignale — Allgemeine  Anforderungen, Gestaltung und Prüfung"},"Sicherheit von Maschinen — Optische Gefahrensignale — Allgemeine  Anforderungen, Gestaltung und Prüfung","Safety of machinery - Visual danger signals - General requirements, design and testing","Sécurité des machines — Signaux visuels de danger — Exigences générales, conception et essais"]
["1.7.2.","EN 981:1996+A1:2008",{"$f":"INDEX(Table_Standards[#This Row],1,Language_select+3)","v":"Sicherheit von Maschinen — System akustischer und optischer Gefahrensignale  und Informationssignale"},"Sicherheit von Maschinen — System akustischer und optischer Gefahrensignale  und Informationssignale","Safety of machinery - System of auditory and visual danger and information signals","Sécurité des machines — Système de signaux auditifs et visuels de danger et d’information"]
["1.7.2.","EN ISO 7731:2008",{"$f":"INDEX(Table_Standards[#This Row],1,Language_select+3)","v":"Ergonomie — Gefahrensignale für öffentliche Bereiche und Arbeitsstätten  — Akustische Gefahrensignale"},"Ergonomie — Gefahrensignale für öffentliche Bereiche und Arbeitsstätten  — Akustische Gefahrensignale","Ergonomics - Danger signals for public and work areas - Auditory danger signals (ISO 7731:2003)","Ergonomie — Signaux de danger pour lieux publics et lieux de travail — Signaux de danger auditifs "]
[null,"---",{"$f":"INDEX(Table_Standards[#This Row],1,Language_select+3)","v":" "}," "," "," "]
[null,null,{"$f":"INDEX(Table_Standards[#This Row],1,Language_select+3)","v":"Nahrungsmittelmaschinen und Maschinen für kosmetische oder pharmazeutische Erzeugnisse"},"Nahrungsmittelmaschinen und Maschinen für kosmetische oder pharmazeutische Erzeugnisse","Foodstuffs machinery and machinery for cosmetics or pharmaceutical products","Français"]
["2.1.","EN ISO 14159:2008",{"$f":"INDEX(Table_Standards[#This Row],1,Language_select+3)","v":"Sicherheit von Maschinen — Hygieneanforderungen an die Gestaltung von Maschinen"},"Sicherheit von Maschinen — Hygieneanforderungen an die Gestaltung von Maschinen","Safety of machinery - Hygiene requirements for the design of machinery","Sécurité des machines — Prescriptions relatives à l’hygiène lors de la conception des machines"]
[null,"---",{"$f":"INDEX(Table_Standards[#This Row],1,Language_select+3)","v":" "}," "," "," "]
[]
[null,"Abgelöste EN Normen","zurückgezogen"]
["Spalte2","Nummer","Spalte1","Deutsch","English","Français"]
[null,"EN 1760-1:1997+A1:2009",{"$f":"INDEX(Table_Standards_Old[#This Row],1,Language_select+3)","v":"Sicherheit von Maschinen — Druckempfindliche Schutzeinrichtungen —  Teil 1: Allgemeine Leitsätze für die Gestaltung und Prüfung von Schaltmatten  und Schaltplatten"},"Sicherheit von Maschinen — Druckempfindliche Schutzeinrichtungen —  Teil 1: Allgemeine Leitsätze für die Gestaltung und Prüfung von Schaltmatten  und Schaltplatten","Safety of machinery - Pressure sensitive protective devices - Part 1: General principles for the design and testing of pressure sensitive mats and pressure sensitive floors","Français"]
[null,"EN 1760-2:2001+A1:2009",{"$f":"INDEX(Table_Standards_Old[#This Row],1,Language_select+3)","v":"Sicherheit von Maschinen — Druckempfindliche Schutzeinrichtungen —  Teil 2: Allgemeine Leitsätze für die Gestaltung und Prüfung von Schaltleisten  und Schaltstangen"},"Sicherheit von Maschinen — Druckempfindliche Schutzeinrichtungen —  Teil 2: Allgemeine Leitsätze für die Gestaltung und Prüfung von Schaltleisten  und Schaltstangen","Safety of machinery - Pressure sensitive protective devices - Part 2: General principles for the design and testing of pressure sensitive edges and pressure sensitive bars","Français"]
[null,"EN 1760-3:2004+A1:2009",{"$f":"INDEX(Table_Standards_Old[#This Row],1,Language_select+3)","v":"Sicherheit von Maschinen — Druckempfindliche Schutzeinrichtungen —  Teil 3: Allgemeine Leitsätze für die Gestaltung und Prüfung von  Schaltpuffern, Schaltflächen, Schaltleinen und ähnlichen Einrichtungen"},"Sicherheit von Maschinen — Druckempfindliche Schutzeinrichtungen —  Teil 3: Allgemeine Leitsätze für die Gestaltung und Prüfung von  Schaltpuffern, Schaltflächen, Schaltleinen und ähnlichen Einrichtungen","Safety of machinery - Pressure sensitive protective devices - Part 3: General principles for the design and testing of pressure sensitive bumpers, plates, wires and similar devices","Français"]
[null,"EN ISO 11252:2008",{"$f":"INDEX(Table_Standards_Old[#This Row],1,Language_select+3)","v":"Laser und Laseranlagen — Lasergerät — Mindestanforderungen an die  Dokumentation"},"Laser und Laseranlagen — Lasergerät — Mindestanforderungen an die  Dokumentation","Lasers and laser-related equipment - Laser device - Minimum requirements for documentation (ISO 11252:2004)","Français"]
[null,"EN 1088:1995+A2:2008",{"$f":"INDEX(Table_Standards_Old[#This Row],1,Language_select+3)","v":"Sicherheit von Maschinen — Verriegelungseinrichtungen in Verbindung mit trennenden Schutzeinrichtungen — Leitsätze für Gestaltung und Auswahl"},"Sicherheit von Maschinen — Verriegelungseinrichtungen in Verbindung mit trennenden Schutzeinrichtungen — Leitsätze für Gestaltung und Auswahl","Safety of machinery - Interlocking devices associated with guards - Principles for design and selection","Français"]
[null,"EN 60204-1:2006",{"$f":"INDEX(Table_Standards_Old[#This Row],1,Language_select+3)","v":"Sicherheit von Maschinen — Elektrische Ausrüstung von Maschinen — Teil 1: Allgemeine Anforderungen (CENELEC)"},"Sicherheit von Maschinen — Elektrische Ausrüstung von Maschinen — Teil 1: Allgemeine Anforderungen (CENELEC)","Safety of machinery - Electrical equipment of machines - Part 1: General requirements IEC 60204-1:2005 (Modified)","Français"]
[null,"EN 62061:2005",{"$f":"INDEX(Table_Standards_Old[#This Row],1,Language_select+3)","v":"Sicherheit von Maschinen — Funktionale Sicherheit sicherheitsbezogener  elektrischer, elektronischer und programmierbarer elektronischer  Steuerungssysteme"},"Sicherheit von Maschinen — Funktionale Sicherheit sicherheitsbezogener  elektrischer, elektronischer und programmierbarer elektronischer  Steuerungssysteme","Safety of machinery - Functional safety of safety-related electrical, electronic and programmable electronic control systems IEC 62061:2005","Français"]
[null,"EN 61496-1:2004",{"$f":"INDEX(Table_Standards_Old[#This Row],1,Language_select+3)","v":"Sicherheit von Maschinen — Berührungslos wirkende Schutzeinrichtungen  — Teil 1: Allgemeine Anforderungen und Prüfungen"},"Sicherheit von Maschinen — Berührungslos wirkende Schutzeinrichtungen  — Teil 1: Allgemeine Anforderungen und Prüfungen","Safety of machinery - Electro-sensitive protective equipment - Part 1: General requirements and tests IEC 61496-1:2004 (Modified)","Français"]
[null,"EN 61496-1:2004/A1:2008",{"$f":"INDEX(Table_Standards_Old[#This Row],1,Language_select+3)","v":"Sicherheit von Maschinen — Berührungslos wirkende Schutzeinrichtungen  — Teil 1: Allgemeine Anforderungen und Prüfungen"},"Sicherheit von Maschinen — Berührungslos wirkende Schutzeinrichtungen  — Teil 1: Allgemeine Anforderungen und Prüfungen","Safety of machinery - Electro-sensitive protective equipment - Part 1: General requirements and tests IEC 61496-1:2004 (Modified)","Français"]
[null,"EN 50223:2010",{"$f":"INDEX(Table_Standards_Old[#This Row],1,Language_select+3)","v":"Stationäre elektrostatische Flockanlagen für entzündbaren Flock —  Sicherheitsanforderungen"},"Stationäre elektrostatische Flockanlagen für entzündbaren Flock —  Sicherheitsanforderungen","Stationary electrostatic application equipment for ignitable flock material - Safety requirements","Français"]
[null,"EN 30326-1:1994",{"$f":"INDEX(Table_Standards_Old[#This Row],1,Language_select+3)","v":"Mechanische Schwingungen — Laborverfahren zur Bewertung der  Schwingungen von Fahrzeugsitzen — Grundlegende Anforderungen"},"Mechanische Schwingungen — Laborverfahren zur Bewertung der  Schwingungen von Fahrzeugsitzen — Grundlegende Anforderungen","Mechanical vibration - Laboratory method for evaluating vehicle seat vibration - Part 1: Basic requirements (ISO 10326-1:1992)","Français"]
[null,"EN 30326-1:1994+A1:2007",{"$f":"INDEX(Table_Standards_Old[#This Row],1,Language_select+3)","v":"Mechanische Schwingungen — Laborverfahren zur Bewertung der  Schwingungen von Fahrzeugsitzen — Grundlegende Anforderungen"},"Mechanische Schwingungen — Laborverfahren zur Bewertung der  Schwingungen von Fahrzeugsitzen — Grundlegende Anforderungen","Mechanical vibration - Laboratory method for evaluating vehicle seat vibration - Part 1: Basic requirements ","Français"]
[null,"EN ISO 14122-1:2001",{"$f":"INDEX(Table_Standards_Old[#This Row],1,Language_select+3)","v":"Sicherheit von Maschinen — Ortsfeste Zugänge zu maschinellen Anlagen  — Teil 1: Wahl eines ortsfesten Zugangs zwischen zwei Ebenen"},"Sicherheit von Maschinen — Ortsfeste Zugänge zu maschinellen Anlagen  — Teil 1: Wahl eines ortsfesten Zugangs zwischen zwei Ebenen","Safety of machinery - Permanent means of access to machinery - Part 1: Choice of fixed means of access between two levels (ISO 14122-1:2001)","Français"]
[null,"EN ISO 14122-2:2001",{"$f":"INDEX(Table_Standards_Old[#This Row],1,Language_select+3)","v":"Sicherheit von Maschinen — Ortsfeste Zugänge zu maschinellen Anlagen  — Teil 2: Arbeitsbühnen und Laufstege"},"Sicherheit von Maschinen — Ortsfeste Zugänge zu maschinellen Anlagen  — Teil 2: Arbeitsbühnen und Laufstege","Safety of machinery - Permanent means of access to machinery - Part 2: Working platforms and walkways (ISO 14122- 2:2001)","Français"]
[null,"EN ISO 14122-3:2001",{"$f":"INDEX(Table_Standards_Old[#This Row],1,Language_select+3)","v":"Sicherheit von Maschinen — Ortsfeste Zugänge zu maschinellen Anlagen  — Teil 3: Treppen, Treppenleitern und Geländer"},"Sicherheit von Maschinen — Ortsfeste Zugänge zu maschinellen Anlagen  — Teil 3: Treppen, Treppenleitern und Geländer","Safety of machinery - Permanent means of access to machinery - Part 3: Stairs, stepladders and guard-rails (ISO 14122- 3:2001)","Français"]
[null,"EN ISO 14122-4:2004",{"$f":"INDEX(Table_Standards_Old[#This Row],1,Language_select+3)","v":"Sicherheit von Maschinen — Ortsfeste Zugänge zu maschinellen Anlagen  — Teil 4: Ortsfeste Steigleitern"},"Sicherheit von Maschinen — Ortsfeste Zugänge zu maschinellen Anlagen  — Teil 4: Ortsfeste Steigleitern","Safety of machinery - Permanent means of access to machinery - Part 4: Fixed ladders (ISO 14122-4:2004)","Français"]
[null,"EN ISO 13849-1:2008",{"$f":"INDEX(Table_Standards_Old[#This Row],1,Language_select+3)","v":"Sicherheit von Maschinen — Sicherheitsbezogene Teile von Steuerungen  — Teil 1: Allgemeine Gestaltungsleitsätze"},"Sicherheit von Maschinen — Sicherheitsbezogene Teile von Steuerungen  — Teil 1: Allgemeine Gestaltungsleitsätze","Safety of machinery - Safety-related parts of control systems - Part 1: General principles for design (ISO 13849-1:2006)","Sécurité des machines — Parties des systèmes de commande relatives à la sécurité — Partie 1: Principes généraux de conception"]
[null,"EN ISO 13849-1:2008/AC:2009",{"$f":"INDEX(Table_Standards_Old[#This Row],1,Language_select+3)","v":"Sicherheit von Maschinen — Sicherheitsbezogene Teile von Steuerungen  — Teil 1: Allgemeine Gestaltungsleitsätze"},"Sicherheit von Maschinen — Sicherheitsbezogene Teile von Steuerungen  — Teil 1: Allgemeine Gestaltungsleitsätze","Safety of machinery - Safety-related parts of control systems - Part 1: General principles for design (ISO 13849-1:2006)","Sécurité des machines — Parties des systèmes de commande relatives à la sécurité — Partie 1: Principes généraux de conception"]
[null,"EN ISO 13849-2:2012",{"$f":"INDEX(Table_Standards_Old[#This Row],1,Language_select+3)","v":"Sicherheit von Maschinen — Sicherheitsbezogene Teile von Steuerungen  — Teil 2: Validierung"},"Sicherheit von Maschinen — Sicherheitsbezogene Teile von Steuerungen  — Teil 2: Validierung","Safety of machinery - Safety-related parts of control systems - Part 2: Validation","Sécurité des machines — Parties des systèmes de commande relatives à la sécurité — Partie 2: Validation"]
[null,"EN ISO 13850:2008",{"$f":"INDEX(Table_Standards_Old[#This Row],1,Language_select+3)","v":"Sicherheit von Maschinen — Not-Halt — Gestaltungsleitsätze"},"Sicherheit von Maschinen — Not-Halt — Gestaltungsleitsätze","Safety of machinery - Emergency stop - Principles for design (ISO 13850:2006)","Sécurité des machines — Arrêt d’urgence — Principes de conception"]
[null,"EN 953:1997+A1:2009",{"$f":"INDEX(Table_Standards_Old[#This Row],1,Language_select+3)","v":"Sicherheit von Maschinen — Trennende Schutzeinrichtungen — Allgemeine  Anforderungen an Gestaltung und Bau von feststehenden und  beweglichen trennenden Schutzeinrichtungen"},"Sicherheit von Maschinen — Trennende Schutzeinrichtungen — Allgemeine  Anforderungen an Gestaltung und Bau von feststehenden und  beweglichen trennenden Schutzeinrichtungen","Safety of machinery - Guards - General requirements for the design and construction of fixed and movable guards","Sécurité des machines — Protecteurs — Prescriptions générales pour la conception et la construction des protecteurs fixes et mobiles"]
[null,"EN 626-1:1994+A1:2008",{"$f":"INDEX(Table_Standards_Old[#This Row],1,Language_select+3)","v":"Sicherheit von Maschinen — Reduzierung des Gesundheitsrisikos durch  Gefahrstoffe, die von Maschinen ausgehen —  Teil 1: Grundsätze und Festlegungen für Maschinenhersteller"},"Sicherheit von Maschinen — Reduzierung des Gesundheitsrisikos durch  Gefahrstoffe, die von Maschinen ausgehen —  Teil 1: Grundsätze und Festlegungen für Maschinenhersteller","Safety of machinery - Reduction of risks to health from hazardous substances emitted by machinery - Part 1: Principles and specifications for machinery manufacturers","Français"]
[null,"EN 626-2:1996+A1:2008",{"$f":"INDEX(Table_Standards_Old[#This Row],1,Language_select+3)","v":"Sicherheit von Maschinen — Reduzierung des Gesundheitsrisikos durch  Gefahrstoffe, die von Maschinen ausgehen —  Teil 2: Methodik beim Aufstellen von Überprüfungsverfahren"},"Sicherheit von Maschinen — Reduzierung des Gesundheitsrisikos durch  Gefahrstoffe, die von Maschinen ausgehen —  Teil 2: Methodik beim Aufstellen von Überprüfungsverfahren","Safety of machinery - Reduction of risk to health from hazardous substances emitted by machinery - Part 2: Methodology leading to verification procedures","Français"]
[null,"EN ISO 14122-1:2001/A1:2010",{"$f":"INDEX(Table_Standards_Old[#This Row],1,Language_select+3)","v":"Sicherheit von Maschinen — Ortsfeste Zugänge zu maschinellen Anlagen  — Teil 1: Wahl eines ortsfesten Zugangs zwischen zwei Ebenen"},"Sicherheit von Maschinen — Ortsfeste Zugänge zu maschinellen Anlagen  — Teil 1: Wahl eines ortsfesten Zugangs zwischen zwei Ebenen","Safety of machinery - Permanent means of access to machinery - Part 1: Choice of fixed means of access between two levels","Français"]
[null,"EN ISO 14122-2:2001/A1:2010",{"$f":"INDEX(Table_Standards_Old[#This Row],1,Language_select+3)","v":"Sicherheit von Maschinen — Ortsfeste Zugänge zu maschinellen Anlagen  — Teil 2: Arbeitsbühnen und Laufstege"},"Sicherheit von Maschinen — Ortsfeste Zugänge zu maschinellen Anlagen  — Teil 2: Arbeitsbühnen und Laufstege","Safety of machinery - Permanent means of access to machinery - Part 2: Working platforms and walkways","Français"]
[null,"EN ISO 14122-3:2001/A1:2010",{"$f":"INDEX(Table_Standards_Old[#This Row],1,Language_select+3)","v":"Sicherheit von Maschinen — Ortsfeste Zugänge zu maschinellen Anlagen  — Teil 3: Treppen, Treppenleitern und Geländer"},"Sicherheit von Maschinen — Ortsfeste Zugänge zu maschinellen Anlagen  — Teil 3: Treppen, Treppenleitern und Geländer","Safety of machinery - Permanent means of access to machinery - Part 3: Stairs, stepladders and guard-rails","Français"]
[null,"EN ISO 14122-4:2004/AC:2010",{"$f":"INDEX(Table_Standards_Old[#This Row],1,Language_select+3)","v":"Sicherheit von Maschinen — Ortsfeste Zugänge zu maschinellen Anlagen  — Teil 4: Ortsfeste Steigleitern"},"Sicherheit von Maschinen — Ortsfeste Zugänge zu maschinellen Anlagen  — Teil 4: Ortsfeste Steigleitern","Safety of machinery - Permanent means of access to machinery - Part 4: Fixed ladders","Français"]
[null,"EN 13478:2001+A1:2008",{"$f":"INDEX(Table_Standards_Old[#This Row],1,Language_select+3)","v":"Sicherheit von Maschinen — Brandschutz"},"Sicherheit von Maschinen — Brandschutz","Safety of machinery - Fire prevention and protection","Sécurité des machines — Prévention et protection contre l’incendie"]
[]
[null,"Eigene Normen (C-Normen / Werksnormen / …)"]
["GSA","Nummer","Bezeichnung","Deutsch","English","Français"]
[null,"EN ISO 12100:2010","Sicherheit von Maschinen - Allgemeine Gestaltungsleitsätze - Risikobeurteilung und Risikominderung ","Sicherheit von Maschinen - Allgemeine Gestaltungsleitsätze - Risikobeurteilung und Risikominderung ","Safety of machinery - General principles for design - Risk assessment and risk reduction","Français"]
[null,"EN ISO 10218-1:2011","Industrieroboter – Sicherheitanforderungen – Teil 1: Roboter","Industrieroboter – Sicherheitanforderungen – Teil 1: Roboter","Robots and robotic devices - Safety requirements for industrial robots - Part 1: Robots (ISO 10218-1:2011)","Français"]
[null,"EN ISO 11252:2013","Laser und Laseranlagen — Lasergerät — Mindestanforderungen an die  Dokumentation","Laser und Laseranlagen — Lasergerät — Mindestanforderungen an die  Dokumentation","Lasers and laser-related equipment - Laser device - Minimum requirements for documentation (ISO 11252:2004)","Français"]
[null,"EN 12549:1999+A1:2008","Akustik — Geräuschmessverfahren für Eintreibgeräte — Verfahren der  Genauigkeitsklasse 2","Akustik — Geräuschmessverfahren für Eintreibgeräte — Verfahren der  Genauigkeitsklasse 2","Acoustics - Noise test code for fastener driving tools - Engineering method","Français"]
[null,"EN ISO 15744:2008","Handgehaltene, nicht elektrisch betriebene Maschinen — Geräuschmessverfahren  — Verfahren der Genauigkeitsklasse 2","Handgehaltene, nicht elektrisch betriebene Maschinen — Geräuschmessverfahren  — Verfahren der Genauigkeitsklasse 2","Hand-held non-electric power tools - Noise measurement code - Engineering method (grade 2) (ISO 15744:2002)","Français"]
[null,"ISO 13849-1:2015-12","Sicherheit von Maschinen — Sicherheitsbezogene Teile von Steuerungen  — Teil 1: Allgemeine Gestaltungsleitsätze","Sicherheit von Maschinen — Sicherheitsbezogene Teile von Steuerungen  — Teil 1: Allgemeine Gestaltungsleitsätze","Safety of machinery - Safety-related parts of control systems - Part 1: General principles for design (ISO 13849-1:2006)","Français"]
[null,null,"Deutsch","Deutsch","English","Français"]
[null,"EN ISO 16231-1:2013",{"$f":"INDEX(Table_Standards_Own[#This Row],1,Language_select+3)","v":"Selbstfahrende Maschinen in der Landwirtschaft — Bewertung der Stabilität — Teil 1: Richtlinien"},"Selbstfahrende Maschinen in der Landwirtschaft — Bewertung der Stabilität — Teil 1: Richtlinien","Self-propelled agricultural machinery - Assessment of stability - Part 1: Principles","Français"]
[null,null,{"$f":"INDEX(Table_Standards_Own[#This Row],1,Language_select+3)","v":"Deutsch"},"Deutsch","English","Français"]
[null,null,{"$f":"INDEX(Table_Standards_Own[#This Row],1,Language_select+3)","v":"Deutsch"},"Deutsch","English","Français"]
[null,null,{"$f":"INDEX(Table_Standards_Own[#This Row],1,Language_select+3)","v":"Deutsch"},"Deutsch","English","Français"]

{"sheet":"EN ISO 12100","index":4,"n_rows":101,"n_cols":5,"rows_kept":101,"cut":false,"hidden":false,"merged":[[3,1,21,1],[3,0,21,0],[22,1,31,1],[22,0,31,0],[89,1,99,1],[89,0,99,0],[78,1,88,1],[78,0,88,0],[0,0,0,4],[59,1,64,1],[59,0,64,0],[65,1,77,1],[65,0,77,0],[32,1,38,1],[32,0,38,0],[39,1,50,1],[39,0,50,0],[51,1,58,1],[51,0,58,0],[1,2,1,3]]}
["Gefährdungen EN ISO 12100 Tabelle B.1"]
[null,null,"Gefährdungsbeispiele"]
["Nr.","Art oder Gruppe","Ursprung","Mögliche Auswirkungen","Abschnitt Bezug"]
[1,"Mechanische Gefährdungen","---","---","---"]
[null,null,"Beschleunigung/Abbremsung;","Überfahren werden;","6.2.2.1"]
[null,null,"spitze Teile;","Weggeschleudert werden;","6.2.2.2"]
[null,null,"Annäherung eines sich bewegenden Teils an ein feststehendes Teil;","Quetschen;","6.2.3 a)"]
[null,null,"schneidende Teile;","Schneiden oder Abschneiden;","6.2.3 b)"]
[null,null,"elastische Elemente;","Einziehen oder Fangen;","6.2.6"]
[null,null,"herab fallende Gegenstände;","Erfassen;","6.2.10"]
[null,null,"Schwerkraft;","Reiben oder Abschürfen;","6.3.1"]
[null,null,"Höhe gegenüber dem Boden;","Stoß;","6.3.2"]
[null,null,"Hochdruck;","Eindringen von unter Druck stehenden Medien;","6.3.3"]
[null,null,"fehlende Standfestigkeit/-sicherheit;","Scheren;","6.3.5.2"]
[null,null,"kinetische Energie;","Ausrutschen, Stolpern und Stürzen;","6.3.5.4"]
[null,null,"Beweglichkeit der Maschine;","Durchstich oder Einstich;","6.3.5.5"]
[null,null,"sich bewegende Teile;","Ersticken.","6.3.5.6"]
[null,null,"rotierende Teile;",null,"6.4.1"]
[null,null,"raue, rutschige Oberfläche;",null,"6.4.3"]
[null,null,"scharfe Kanten;",null,"6.4.4"]
[null,null,"gespeicherte Energie;",null,"6.4.5"]
[null,null,"Vakuum."]
[2,"Elektrische Gefährdungen","---","---","---"]
[null,null,"Lichtbogen;","Verbrennung;","6.2.9"]
[null,null,"elektromagnetische Vorgänge;","chemische Reaktionen;","6.3.2"]
[null,null,"elektrostatische Vorgänge;","Auswirkungen auf medizinische Implantate;","6.3.3.2"]
[null,null,"spannungsführende Teile;","tödlicher Stromschlag;","6.3.5.4"]
[null,null,"unzureichender Abstand zu unter Hochspannung stehenden Teilen;","Stürzen, Weggeschleudert werden;","6.4.4"]
[null,null,"Überlast;","Feuer;","6.4.5"]
[null,null,"Teile, die im Fehlerzustand spannungsführend geworden sind;","Herausschleudern von geschmolzenen Teilen;"]
[null,null,"Kurzschluss;","(elektrischer) Schlag."]
[null,null,"Wärmestrahlung."]
[3,"Thermische Gefährdungen","---","---","---"]
[null,null,"Explosion;","Verbrennung;","6.2.4 b)"]
[null,null,"Flamme;","Dehydrierung;","6.2.8 c)"]
[null,null,"Objekte oder Materialien hoher oder niedriger Temperatur;","Unbehagen;","6.3.2.7"]
[null,null,"Strahlung von Wärmequellen","Erfrierung;","6.3.3.2.1"]
[null,null,null,"Verletzungen durch Strahlung von Wärmequellen;","6.3.4.5"]
[null,null,null,"Verbrühung."]
[4,"Gefährdungen durch Lärm","---","---","---"]
[null,null,"Kavitationsvorgänge;","Unbehagen;","6.2.2.2"]
[null,null,"Abluftsystem;","Bewusstseinsverlust;","6.2.3 c)"]
[null,null,"mit hoher Geschwindigkeit austretendes Gas;","Gleichgewichtsstörung;","6.2.4 c)"]
[null,null,"Herstellungsprozess (Stanzen, Schneiden usw.);","bleibender Gehörverlust;","6.2.8 c)"]
[null,null,"bewegliche Teile;","Stress;","6.3.1"]
[null,null,"reibende Flächen;","Tinnitus (Ohrensausen);","6.3.2.1 b)"]
[null,null,"mit Unwucht rotierende Teile;","Ermüdung;","6.3.2.5.1"]
[null,null,"pfeifende Pneumatik-Einrichtungen;","alle weiteren (z. B. mechanischen, elektrischen) Probleme als Folge einer Störung der Sprach-kommunikation oder einer Störung akustischer Signale","6.3.3.2.1"]
[null,null,"verschlissene Teile",null,"6.3.4.2"]
[null,null,null,null,"6.4.3"]
[null,null,null,null,"6.4.5.1 b) und c)"]
[5,"Gefährdungen durch Vibration","---","---","---"]
[null,null,"Kavitationsvorgänge;","Unbehagen;","6.2.2.2"]
[null,null,"Fehlausrichtung sich bewegender Teile;","Erkrankungen der unteren Wirbelsäule;","6.2.3 c)"]
[null,null,"bewegliche Ausrüstung;","neurologische Erkrankung;","6.2.8 c)"]
[null,null,"reibende Flächen;","Knochengelenkschaden;","6.3.3.2.1"]
[null,null,"mit Unwucht rotierende Teile;","Wirbelsäulenverletzung;","6.3.4.3"]
[null,null,"schwingende Ausrüstung;","Gefäßerkrankung","6.4.5.1 c)"]
[null,null,"verschlissene Teile"]
[6,"Gefährdungen durch Strahlung","---","---","---"]
[null,null,"ionisierende Strahlungsquelle;","Verbrennung;","6.2.2.2"]
[null,null,"niederfrequente elektromagnetische Strahlung;","Augen- und Hautschädigung;","6.2.3 c)"]
[null,null,"optische Strahlung (infrarot, sichtbar und ultraviolett), einschließlich Laserstrahlen;","Auswirkungen auf die Fortpflanzungsfähigkeit;","6.3.3.2.1"]
[null,null,"hochfrequente elektromagnetische Strahlung","Mutation;","6.3.4.5"]
[null,null,null,"Kopfschmerzen, Schlaflosigkeit usw.","6.4.5.1 c)"]
[7,"Gefährdungen durch Materialien und Substanzen","---","---","---"]
[null,null,"Aerosol;","Atembeschwerden, Ersticken;","6.2.2.2"]
[null,null,"biologische und mikrobiologische (virale oder bakterielle) Substanz;","Krebs;","6.2.3 b)"]
[null,null,"Brennstoff;","Korrosion;","6.2.3 c)"]
[null,null,"Staub;","Auswirkungen auf die Fortpflanzungsfähigkeit;","6.2.4 a)"]
[null,null,"Explosivstoff;","Explosion;","6.2.4 b)"]
[null,null,"Fasern;","Feuer;","6.3.1"]
[null,null,"feuergefährliches Material;","Infektion;","6.3.3.2.1"]
[null,null,"Flüssigkeit;","Veränderung des Erbguts;","6.3.4.4"]
[null,null,"Dämpfe;","Vergiftung;","6.4.5.1 c)"]
[null,null,"Gas;","Sensibilisierung","6.4.5.1 g)"]
[null,null,"Nebel;"]
[null,null,"Oxidationsmittel"]
[8,"Ergonomische Gefährdungen","---","---","---"]
[null,null,"Zugang;","Unbehagen;","6.2.2.1"]
[null,null,"Gestaltung oder Anordnung von Anzeigen und optischen Displays;","Ermüdung;","6.2.7"]
[null,null,"Gestaltung, Anordnung oder Erkennung von Steuerungseinrichtungen;","Störungen des Bewegungsapparates;","6.2.8"]
[null,null,"Anstrengung;","Stress;","6.2.11.8"]
[null,null,"Flackern, Blenden, Schattenbildung und stroboskopische Effekte;","alle weiteren (z. B. mechanischen, elektrischen) Probleme als Folge menschlichen Fehlverhaltens","6.3.2.1"]
[null,null,"örtliche Beleuchtung;",null,"6.3.3.2.1"]
[null,null,"psychische Überbelastung/ Unterforderung;"]
[null,null,"Körperhaltung;"]
[null,null,"sich wiederholende Tätigkeiten;"]
[null,null,"Sichtbarkeit"]
[9,"Gefährdungen im Zusammenhang mit der Einsatzumgebung der Maschine","---","---","---"]
[null,null,"Staub und Nebel;","Verbrennung;","6.2.6"]
[null,null,"elektromagnetische Störungen;","leichte Erkrankungen;","6.2.11.11"]
[null,null,"Blitzschlag;","Ausrutschen, Stürzen;","6.3.2.1"]
[null,null,"Feuchtigkeit;","Ersticken;","6.4.5.1 b)"]
[null,null,"Verunreinigungen;","alle weiteren Probleme, die als Folge der Auswirkungen der Gefährdungsquellen an der Maschine oder an Teilen der Maschine auftreten."]
[null,null,"Schnee;"]
[null,null,"Temperatur;"]
[null,null,"Wasser;"]
[null,null,"Wind;"]
[null,null,"Sauerstoffmangel"]
[10,"Kombination von Gefährdungen","z. B. sich wiederholende Tätigkeit + Anstrengung + hohe Umgebungstemperatur","z. B. Dehydrierung, Bewusstseinsverlust, Hitzeschock"]

{"sheet":"Sprache","index":5,"n_rows":550,"n_cols":6,"rows_kept":550,"cut":false,"hidden":false,"merged":[]}
["1","Deutsch","English","Français"]
[{"$f":"INDEX(Table_Language[#This Row],1,Language_select+1)","v":"Blatt Risikobeurteilung"},"Blatt Risikobeurteilung","Sheet Risk Assessment","Français"]
[{"$f":"INDEX(Table_Language[#This Row],1,Language_select+1)","v":"Laufende Nummer der Gefährdung"},"Laufende Nummer der Gefährdung","Identifying Number of the hazard","Français"]
[{"$f":"INDEX(Table_Language[#This Row],1,Language_select+1)","v":"Haupt"},"Haupt","Main","Français"]
[{"$f":"INDEX(Table_Language[#This Row],1,Language_select+1)","v":"Unter"},"Unter","Sub","Français"]
[{"$f":"INDEX(Table_Language[#This Row],1,Language_select+1)","v":"grundlegende Sicherheits- und Gesundheitsschutzanforderungen"},"grundlegende Sicherheits- und Gesundheitsschutzanforderungen","Essential health and safety requirements","Français"]
[{"$f":"INDEX(Table_Language[#This Row],1,Language_select+1)","v":"Nr."},"Nr.","No.","Français"]
[{"$f":"INDEX(Table_Language[#This Row],1,Language_select+1)","v":"Bezeichnung"},"Bezeichnung","Title","Français"]
[{"$f":"INDEX(Table_Language[#This Row],1,Language_select+1)","v":"Original (x=Zeile kann nicht gelöscht werden)"},"Original (x=Zeile kann nicht gelöscht werden)","Original (x=line can not be deleted)","Français"]
[{"$f":"INDEX(Table_Language[#This Row],1,Language_select+1)","v":"Gefährdung vorhanden"},"Gefährdung vorhanden","Hazard exists","Français"]
[{"$f":"INDEX(Table_Language[#This Row],1,Language_select+1)","v":"Hinweis:\n\nx = trifft zu\n? = muss noch entschieden werden\n- = trifft nicht zu"},"Hinweis:\n\nx = trifft zu\n? = muss noch entschieden werden\n- = trifft nicht zu","Information:\n\nx = is applied\n? = to be decided\n- = not applied","Français"]
[{"$f":"INDEX(Table_Language[#This Row],1,Language_select+1)","v":"Inhalt bereits abgedeckt?"},"Inhalt bereits abgedeckt?","Content already covered?","Français"]
[{"$f":"INDEX(Table_Language[#This Row],1,Language_select+1)","v":"Hinweis:\n\nx = Inhalt ist abgedeckt / erledigt\nLeer = muss behandelt werden"},"Hinweis:\n\nx = Inhalt ist abgedeckt / erledigt\nLeer = muss behandelt werden","Information:\n\nx = content is covered / done\nempty = must be considered in EHSR","Français"]
[{"$f":"INDEX(Table_Language[#This Row],1,Language_select+1)","v":"Norm-Typ"},"Norm-Typ","Standard type","Français"]
[{"$f":"INDEX(Table_Language[#This Row],1,Language_select+1)","v":"Hinweis:\n\n1 = C-Norm\n2 = B1-Norm\n3 = B2-Norm\n4 = A-Norm"},"Hinweis:\n\n1 = C-Norm\n2 = B1-Norm\n3 = B2-Norm\n4 = A-Norm","Information:\n\n1 = C-Standard\n2 = B1-Standard\n3 = B2-Standard\n4 = A-Standard","Français"]
[{"$f":"INDEX(Table_Language[#This Row],1,Language_select+1)","v":"Gefährdungen nach (harmonisierter) Norm"},"Gefährdungen nach (harmonisierter) Norm","Hazard according to (harmonized) standard","Français"]
[{"$f":"INDEX(Table_Language[#This Row],1,Language_select+1)","v":"Norm Nummer"},"Norm Nummer","Standard number","Français"]
[{"$f":"INDEX(Table_Language[#This Row],1,Language_select+1)","v":"Norm Titel"},"Norm Titel","Standard title","Français"]
[{"$f":"INDEX(Table_Language[#This Row],1,Language_select+1)","v":"Abschnitt / Detail"},"Abschnitt / Detail","Subclause","Français"]
[{"$f":"INDEX(Table_Language[#This Row],1,Language_select+1)","v":"Norminhalt (eingekürzt und bearbeitet)"},"Norminhalt (eingekürzt und bearbeitet)","Standard's content (short form)","Français"]
[{"$f":"INDEX(Table_Language[#This Row],1,Language_select+1)","v":"Ursprung"},"Ursprung","Origin","Français"]
[{"$f":"INDEX(Table_Language[#This Row],1,Language_select+1)","v":"mögliche Auswirkung"},"mögliche Auswirkung","Potential consequences","Français"]
[{"$f":"INDEX(Table_Language[#This Row],1,Language_select+1)","v":"Ort / Gefahrbereich / Position in Zeichnung"},"Ort / Gefahrbereich / Position in Zeichnung","Place / hazard zone / position in drawing","Français"]
[{"$f":"INDEX(Table_Language[#This Row],1,Language_select+1)","v":"Gefährdung / Gefährdungssituation"},"Gefährdung / Gefährdungssituation","Hazard / hazardous situation","Français",null,"entfallen"]
[{"$f":"INDEX(Table_Language[#This Row],1,Language_select+1)","v":"Gefährdete Personen"},"Gefährdete Personen","Person in danger","Français"]
[{"$f":"INDEX(Table_Language[#This Row],1,Language_select+1)","v":"Lebensphase (nach EN ISO 12100, Tabelle B.3)"},"Lebensphase (nach EN ISO 12100, Tabelle B.3)","Phase of life cycle (acc. to EN ISO 12100, Table B.3)","Français"]
[{"$f":"INDEX(Table_Language[#This Row],1,Language_select+1)","v":"Alle"},"Alle","All","Français"]
[{"$f":"INDEX(Table_Language[#This Row],1,Language_select+1)","v":"Transport"},"Transport","Transport","Français"]
[{"$f":"INDEX(Table_Language[#This Row],1,Language_select+1)","v":"Montage und Installation\nInbetriebnahme"},"Montage und Installation\nInbetriebnahme","Assembly and installation\nCommissioning","Français"]
[{"$f":"INDEX(Table_Language[#This Row],1,Language_select+1)","v":"Einrichten\nEinlernen (Teachen)/ Programmieren und/oder Umrüsten"},"Einrichten\nEinlernen (Teachen)/ Programmieren und/oder Umrüsten","Setting\nTeaching/programming\nand/or process changeover","Français"]
[{"$f":"INDEX(Table_Language[#This Row],1,Language_select+1)","v":"Betrieb"},"Betrieb","Operation","Français"]
[{"$f":"INDEX(Table_Language[#This Row],1,Language_select+1)","v":"Reinigung\nInstandhaltung"},"Reinigung\nInstandhaltung","Cleaning\nMaintenance","Français"]
[{"$f":"INDEX(Table_Language[#This Row],1,Language_select+1)","v":"Fehlersuche und -beseitigung"},"Fehlersuche und -beseitigung","Fault-finding/\nTroubleshooting","Français"]
[{"$f":"INDEX(Table_Language[#This Row],1,Language_select+1)","v":"Demontage\nAußer Betrieb nehmen"},"Demontage\nAußer Betrieb nehmen","Dismantling\nDisabling","Français"]
[{"$f":"INDEX(Table_Language[#This Row],1,Language_select+1)","v":"Risiko- einschätzung"},"Risiko- einschätzung","Risk Assessment","Français"]
[{"$f":"INDEX(Table_Language[#This Row],1,Language_select+1)","v":"Hinweis:\nHier ist der Graph der EN ISO 13849-1 abgebildet. Sie können diesen durch einen beliebigen Graphen Ihrer Wahl ersetzen.\nSchwere der Verletzung S1 und S2\nS1 – leicht (üblicherweise reversible Verletzung)\nS2 – ernst (üblicherweise irreversible Verletzung einschließlich Tod)\nHäufigkeit und/oder Dauer der Gefährdungsexposition F1 und F2\nF1 – selten bis weniger häufig und/oder die Dauer der Gefährdungsexposition ist kurz\nF2 – häufig bis dauernd und/oder die Dauer der Gefährdungsexposition ist lang\nMöglichkeit zur Vermeidung der Gefährdung P1 und P2\nP1 – möglich unter bestimmten Bedingungen,\nP2 – kaum möglich\nW1 – unwahrscheinlich (mit Begründung im Kommentar!)\nW2 – normale Wahrscheinlichkeit "},"Hinweis:\nHier ist der Graph der EN ISO 13849-1 abgebildet. Sie können diesen durch einen beliebigen Graphen Ihrer Wahl ersetzen.\nSchwere der Verletzung S1 und S2\nS1 – leicht (üblicherweise reversible Verletzung)\nS2 – ernst (üblicherweise irreversible Verletzung einschließlich Tod)\nHäufigkeit und/oder Dauer der Gefährdungsexposition F1 und F2\nF1 – selten bis weniger häufig und/oder die Dauer der Gefährdungsexposition ist kurz\nF2 – häufig bis dauernd und/oder die Dauer der Gefährdungsexposition ist lang\nMöglichkeit zur Vermeidung der Gefährdung P1 und P2\nP1 – möglich unter bestimmten Bedingungen,\nP2 – kaum möglich\nW1 – unwahrscheinlich (mit Begründung im Kommentar!)\nW2 – normale Wahrscheinlichkeit ","Information:\nThis is from the graph of the EN ISO 13849-1.\nYou can change this to any graph of your choice.\nS – severity of injury\nS1 – slight (normally reversible injury)\nS2 – serious (normally irreversible injury or death)\nF – frequency and/or exposure to hazard\nF1 – seldom-to-less-often and/or exposure time is short\nF2 – frequent-to-continuous and/or exposure time is long\nP – possibility of avoiding hazard or limiting harm\nP1 – possible under specific conditions\nP2 – scarcely possible\nO – probability of occurrence of a hazardous event\nO1 – low (with justification in commentary!)\nO2 – normal","Français"]
[{"$f":"INDEX(Table_Language[#This Row],1,Language_select+1)","v":"S"},"S","S","Français"]
[{"$f":"INDEX(Table_Language[#This Row],1,Language_select+1)","v":"F"},"F","F","Français"]
[{"$f":"INDEX(Table_Language[#This Row],1,Language_select+1)","v":"P"},"P","P","Français"]
[{"$f":"INDEX(Table_Language[#This Row],1,Language_select+1)","v":"Risiko"},"Risiko","Risk","Français"]
[{"$f":"INDEX(Table_Language[#This Row],1,Language_select+1)","v":"Risikominimierung"},"Risikominimierung","risk reduction","Français"]
[{"$f":"INDEX(Table_Language[#This Row],1,Language_select+1)","v":"konstruktiv"},"konstruktiv","design and construction","Français"]
[{"$f":"INDEX(Table_Language[#This Row],1,Language_select+1)","v":"sicherheitstechnisch"},"sicherheitstechnisch","protective measures","Français"]
[{"$f":"INDEX(Table_Language[#This Row],1,Language_select+1)","v":"informativ"},"informativ","information","Français"]
[{"$f":"INDEX(Table_Language[#This Row],1,Language_select+1)","v":"Beschreibung der Risikominderung"},"Beschreibung der Risikominderung","description of the risk reduction","Français"]
[{"$f":"INDEX(Table_Language[#This Row],1,Language_select+1)","v":"angewandte technische Spezifikation / harmonisierte B / C Norm"},"angewandte technische Spezifikation / harmonisierte B / C Norm","applied technical standards / harmonised B / C standard","Français"]
[{"$f":"INDEX(Table_Language[#This Row],1,Language_select+1)","v":"Titel"},"Titel","Title","Français"]
[{"$f":"INDEX(Table_Language[#This Row],1,Language_select+1)","v":"Fundstelle in Norm"},"Fundstelle in Norm","Subclause of the Standard","Français"]
[{"$f":"INDEX(Table_Language[#This Row],1,Language_select+1)","v":"technischer Bericht / Prüfergebnis"},"technischer Bericht / Prüfergebnis","technical report / test result","Français"]
[{"$f":"INDEX(Table_Language[#This Row],1,Language_select+1)","v":"Risiko- einschätzung"},"Risiko- einschätzung","Risk Assessment","Français"]
[{"$f":"INDEX(Table_Language[#This Row],1,Language_select+1)","v":"S"},"S","S","Français"]
[{"$f":"INDEX(Table_Language[#This Row],1,Language_select+1)","v":"F"},"F","F","Français"]
[{"$f":"INDEX(Table_Language[#This Row],1,Language_select+1)","v":"P"},"P","P","Français"]
[{"$f":"INDEX(Table_Language[#This Row],1,Language_select+1)","v":"Risiko"},"Risiko","Risk","Français"]
[{"$f":"INDEX(Table_Language[#This Row],1,Language_select+1)","v":"Weitere Reduzierung notwendig?"},"Weitere Reduzierung notwendig?","Further reduction of the risk necessary?","Français"]
[{"$f":"INDEX(Table_Language[#This Row],1,Language_select+1)","v":"Hinweis:\nx = trifft zu (weitere Reduzierung notwendig)\n- = keine weitere Reduzierung notwendig"},"Hinweis:\nx = trifft zu (weitere Reduzierung notwendig)\n- = keine weitere Reduzierung notwendig","Information:\nx = applies (further reduction needed)\n- = no further reduction necessary","Français"]
[{"$f":"INDEX(Table_Language[#This Row],1,Language_select+1)","v":"Kommentar"},"Kommentar","Comment","Français"]
[{"$f":"INDEX(Table_Language[#This Row],1,Language_select+1)","v":"Bearbeiter"},"Bearbeiter","Person in charge","Français"]
[{"$f":"INDEX(Table_Language[#This Row],1,Language_select+1)","v":"Datum der letzten Änderung"},"Datum der letzten Änderung","Date of last change","Français"]
[{"$f":"INDEX(Table_Language[#This Row],1,Language_select+1)","v":"Gefährdung ist behandelt?"},"Gefährdung ist behandelt?","Hazard is covered?","Français"]
[{"$f":"INDEX(Table_Language[#This Row],1,Language_select+1)","v":"Hinweis:\nx = behandelt / betrachtet, Zeile ist fertig\n- = Nicht behandelt / betrachtet, Zeile muss noch bearbeitet werden"},"Hinweis:\nx = behandelt / betrachtet, Zeile ist fertig\n- = Nicht behandelt / betrachtet, Zeile muss noch bearbeitet werden","Information:\nx = covered / line is finished\n- = not completely covered, more work needed in this line","Français"]
[{"$f":"INDEX(Table_Language[#This Row],1,Language_select+1)","v":"Gruppenfeld"},"Gruppenfeld","Group fields","Français"]
[{"$f":"INDEX(Table_Language[#This Row],1,Language_select+1)","v":"Einfügen / Löschen von Zeilen"},"Einfügen / Löschen von Zeilen","Adding / deleting rows","Français"]
[{"$f":"INDEX(Table_Language[#This Row],1,Language_select+1)","v":"Tabellenblätter"},"Tabellenblätter","Worksheets","Français"]
[{"$f":"INDEX(Table_Language[#This Row],1,Language_select+1)","v":"Projektdaten"},"Projektdaten","Project data","Données projet"]
[{"$f":"INDEX(Table_Language[#This Row],1,Language_select+1)","v":"Risikobeurteilung"},"Risikobeurteilung","Risk Assessment","Évaluation des risques "]
[{"$f":"INDEX(Table_Language[#This Row],1,Language_select+1)","v":"B-Normen"},"B-Normen","B-Standards","B-Norme"]
[{"$f":"INDEX(Table_Language[#This Row],1,Language_select+1)","v":"EN ISO 12100"},"EN ISO 12100","EN ISO 12100","EN ISO 12100"]
[{"$f":"INDEX(Table_Language[#This Row],1,Language_select+1)","v":"Sprache"},"Sprache","Language","Langue"]
[{"$f":"INDEX(Table_Language[#This Row],1,Language_select+1)","v":"Eigene Zellen"},"Eigene Zellen","Own Cells","Propre élément"]
[{"$f":"INDEX(Table_Language[#This Row],1,Language_select+1)","v":"Kontrollkästchen"},"Kontrollkästchen","Check Boxes","Français"]
[{"$f":"INDEX(Table_Language[#This Row],1,Language_select+1)","v":"Privat"},"Privat","privately","Français"]
[{"$f":"INDEX(Table_Language[#This Row],1,Language_select+1)","v":"Gewerbe, industrieller Einsatz"},"Gewerbe, industrieller Einsatz","Commercial, industrial application","Français"]
[{"$f":"INDEX(Table_Language[#This Row],1,Language_select+1)","v":"Anhang VIII"},"Anhang VIII","Annex VIII","Français"]
[{"$f":"INDEX(Table_Language[#This Row],1,Language_select+1)","v":"Anhang IX"},"Anhang IX","Annex IX","Français"]
[{"$f":"INDEX(Table_Language[#This Row],1,Language_select+1)","v":"Anhang X"},"Anhang X","Annex X","Français"]
[{"$f":"INDEX(Table_Language[#This Row],1,Language_select+1)","v":"notifizierte Stelle eingeschaltet"},"notifizierte Stelle eingeschaltet","notified body used","Français"]
[{"$f":"INDEX(Table_Language[#This Row],1,Language_select+1)","v":"Text Box"},"Text Box","Text Box","Français"]
[{"$f":"INDEX(Table_Language[#This Row],1,Language_select+1)","v":"Anleitung auf www.maschinenrichtlinie.de"},"Anleitung auf www.maschinenrichtlinie.de","Instructions of use at www.maschinenrichtlinie.com","Instruction de service sur www.maschinenrichtlinie.com"]
[{"$f":"INDEX(Table_Language[#This Row],1,Language_select+1)","v":"MBT Risikobeurteilung nach maschinenrichtlinie.de\n© MBT Mechtersheimer GbR\nVersion "},"MBT Risikobeurteilung nach maschinenrichtlinie.de\n© MBT Mechtersheimer GbR\nVersion ","MBT Risk assessment based on maschinenrichtlinie.com\n© MBT Mechtersheimer GbR\nVersion ","MBT Évaluation des risques basé sur maschinenrichtlinie.com\n© MBT Mechtersheimer GbR\nVersion "]
[{"$f":"INDEX(Table_Language[#This Row],1,Language_select+1)","v":"Lizenz:\nCC BY 3.0 DE\nNamensnennung 3.0 Deutschland"},"Lizenz:\nCC BY 3.0 DE\nNamensnennung 3.0 Deutschland","License:\nCC BY 3.0 DE\nNamensnennung 3.0 Deutschland","Licence:\nCC BY 3.0 DE\nNamensnennung 3.0 Deutschland"]
[{"$f":"INDEX(Table_Language[#This Row],1,Language_select+1)","v":"GSA"},"GSA","EHSR","Français"]
[{"$f":"INDEX(Table_Language[#This Row],1,Language_select+1)","v":"Allgemeines"},"Allgemeines","General remarks","Français"]
[{"$f":"INDEX(Table_Language[#This Row],1,Language_select+1)","v":"Grundsätze für die Integration der Sicherheit"},"Grundsätze für die Integration der Sicherheit","Principles of safety integration","Français"]
[{"$f":"INDEX(Table_Language[#This Row],1,Language_select+1)","v":"Materialien und Produkte"},"Materialien und Produkte","Materials and products","Français"]
[{"$f":"INDEX(Table_Language[#This Row],1,Language_select+1)","v":"Beleuchtung"},"Beleuchtung","Lighting","Français"]
[{"$f":"INDEX(Table_Language[#This Row],1,Language_select+1)","v":"Konstruktion der Maschine im Hinblick auf die Handhabung"},"Konstruktion der Maschine im Hinblick auf die Handhabung","Design of machinery to facilitate its handling","Français"]
[{"$f":"INDEX(Table_Language[#This Row],1,Language_select+1)","v":"Ergonomie"},"Ergonomie","Ergonomics","Français"]
[{"$f":"INDEX(Table_Language[#This Row],1,Language_select+1)","v":"Bedienungsplätze"},"Bedienungsplätze","Operating positions","Français"]
[{"$f":"INDEX(Table_Language[#This Row],1,Language_select+1)","v":"Sitze"},"Sitze","Seating","Français"]
[{"$f":"INDEX(Table_Language[#This Row],1,Language_select+1)","v":"Steuerungen und Befehlseinrichtungen"},"Steuerungen und Befehlseinrichtungen","Control systems","Français"]
[{"$f":"INDEX(Table_Language[#This Row],1,Language_select+1)","v":"Sicherheit und Zuverlässigkeit von Steuerungen "},"Sicherheit und Zuverlässigkeit von Steuerungen ","Safety and reliability of control systems","Français"]
[{"$f":"INDEX(Table_Language[#This Row],1,Language_select+1)","v":"Stellteile "},"Stellteile ","Control devices","Français"]
[{"$f":"INDEX(Table_Language[#This Row],1,Language_select+1)","v":"Ingangsetzen "},"Ingangsetzen ","Starting","Français"]
[{"$f":"INDEX(Table_Language[#This Row],1,Language_select+1)","v":"Stillsetzen "},"Stillsetzen ","Stopping","Français"]
[{"$f":"INDEX(Table_Language[#This Row],1,Language_select+1)","v":"Normales Stillsetzen "},"Normales Stillsetzen ","Normal stop","Français"]
[{"$f":"INDEX(Table_Language[#This Row],1,Language_select+1)","v":"Betriebsbedingtes Stillsetzen "},"Betriebsbedingtes Stillsetzen ","Operational stop","Français"]
[{"$f":"INDEX(Table_Language[#This Row],1,Language_select+1)","v":"Stillsetzen im Notfall "},"Stillsetzen im Notfall ","Emergency stop","Français"]
[{"$f":"INDEX(Table_Language[#This Row],1,Language_select+1)","v":"Gesamtheit von Maschinen "},"Gesamtheit von Maschinen ","Assembly of machinery","Français"]
[{"$f":"INDEX(Table_Language[#This Row],1,Language_select+1)","v":"Wahl der Steuerungs- oder Betriebsarten "},"Wahl der Steuerungs- oder Betriebsarten ","Selection of control or operating modes","Français"]
[{"$f":"INDEX(Table_Language[#This Row],1,Language_select+1)","v":"Störung der Energieversorgung "},"Störung der Energieversorgung ","Failure of the power supply","Français"]
[{"$f":"INDEX(Table_Language[#This Row],1,Language_select+1)","v":"Schutzmaßnahmen gegen mechanische Gefährdungen "},"Schutzmaßnahmen gegen mechanische Gefährdungen ","Protection against mechanical hazards","Français"]
[{"$f":"INDEX(Table_Language[#This Row],1,Language_select+1)","v":"Risiko des Verlusts der Standsicherheit "},"Risiko des Verlusts der Standsicherheit ","Risk of loss of stability","Français"]
[{"$f":"INDEX(Table_Language[#This Row],1,Language_select+1)","v":"Bruchrisiko beim Betrieb "},"Bruchrisiko beim Betrieb ","Risk of break-up during operation","Français"]
[{"$f":"INDEX(Table_Language[#This Row],1,Language_select+1)","v":"Risiken durch herabfallende oder herausgeschleuderte Gegenstände "},"Risiken durch herabfallende oder herausgeschleuderte Gegenstände ","Risks due to falling or ejected objects","Français"]
[{"$f":"INDEX(Table_Language[#This Row],1,Language_select+1)","v":"Risiken durch Oberflächen, Kanten und Ecken "},"Risiken durch Oberflächen, Kanten und Ecken ","Risks due to surfaces, edges or angles","Français"]
[{"$f":"INDEX(Table_Language[#This Row],1,Language_select+1)","v":"Risiken durch mehrfach kombinierte Maschinen "},"Risiken durch mehrfach kombinierte Maschinen ","Risks related to combined machinery","Français"]
[{"$f":"INDEX(Table_Language[#This Row],1,Language_select+1)","v":"Risiken durch Änderung der Verwendungsbedingungen "},"Risiken durch Änderung der Verwendungsbedingungen ","Risks related to variations in operating conditions","Français"]
[{"$f":"INDEX(Table_Language[#This Row],1,Language_select+1)","v":"Risiken durch bewegliche Teile "},"Risiken durch bewegliche Teile ","Risks related to moving parts","Français"]
[{"$f":"INDEX(Table_Language[#This Row],1,Language_select+1)","v":"Wahl der Schutzeinrichtungen gegen Risiken durch bewegliche Teile "},"Wahl der Schutzeinrichtungen gegen Risiken durch bewegliche Teile ","Choice of protection against risks arising from moving parts","Français"]
[{"$f":"INDEX(Table_Language[#This Row],1,Language_select+1)","v":"Bewegliche Teile der Kraftübertragung "},"Bewegliche Teile der Kraftübertragung ","Moving transmission parts","Français"]
[{"$f":"INDEX(Table_Language[#This Row],1,Language_select+1)","v":"Bewegliche Teile, die am Arbeitsprozess beteiligt sind "},"Bewegliche Teile, die am Arbeitsprozess beteiligt sind ","Moving parts involved in the process","Français"]
[{"$f":"INDEX(Table_Language[#This Row],1,Language_select+1)","v":"Risiko unkontrollierter Bewegungen "},"Risiko unkontrollierter Bewegungen ","Risks of uncontrolled movements","Français"]
[{"$f":"INDEX(Table_Language[#This Row],1,Language_select+1)","v":"Anforderungen an Schutzeinrichtungen "},"Anforderungen an Schutzeinrichtungen ","Required characteristics of guards and protective devices","Français"]
[{"$f":"INDEX(Table_Language[#This Row],1,Language_select+1)","v":"Allgemeine Anforderungen "},"Allgemeine Anforderungen ","General requirements","Français"]
[{"$f":"INDEX(Table_Language[#This Row],1,Language_select+1)","v":"Besondere Anforderungen an trennende Schutzeinrichtungen "},"Besondere Anforderungen an trennende Schutzeinrichtungen ","Special requirements for guards","Français"]
[{"$f":"INDEX(Table_Language[#This Row],1,Language_select+1)","v":"Feststehende trennende Schutzeinrichtungen "},"Feststehende trennende Schutzeinrichtungen ","Fixed guards","Français"]
[{"$f":"INDEX(Table_Language[#This Row],1,Language_select+1)","v":"Bewegliche trennende Schutzeinrichtungen mit Verriegelung "},"Bewegliche trennende Schutzeinrichtungen mit Verriegelung ","Interlocking movable guards","Français"]
[{"$f":"INDEX(Table_Language[#This Row],1,Language_select+1)","v":"Zugangsbeschränkende verstellbare Schutzeinrichtungen "},"Zugangsbeschränkende verstellbare Schutzeinrichtungen ","Adjustable guards restricting access","Français"]
[{"$f":"INDEX(Table_Language[#This Row],1,Language_select+1)","v":"Besondere Anforderungen an nichttrennende Schutzeinrichtungen "},"Besondere Anforderungen an nichttrennende Schutzeinrichtungen ","Special requirements for protective devices","Français"]
[{"$f":"INDEX(Table_Language[#This Row],1,Language_select+1)","v":"Risiken durch sonstige Gefährdungen "},"Risiken durch sonstige Gefährdungen ","Risks due to other hazards","Français"]
[{"$f":"INDEX(Table_Language[#This Row],1,Language_select+1)","v":"Elektrische Energieversorgung "},"Elektrische Energieversorgung ","Electricity supply","Français"]
[{"$f":"INDEX(Table_Language[#This Row],1,Language_select+1)","v":"Statische Elektrizität "},"Statische Elektrizität ","Static electricity","Français"]
[{"$f":"INDEX(Table_Language[#This Row],1,Language_select+1)","v":"Nichtelektrische Energieversorgung "},"Nichtelektrische Energieversorgung ","Energy supply other than electricity","Français"]
[{"$f":"INDEX(Table_Language[#This Row],1,Language_select+1)","v":"Montagefehler "},"Montagefehler ","Errors of fitting","Français"]
[{"$f":"INDEX(Table_Language[#This Row],1,Language_select+1)","v":"Extreme Temperaturen "},"Extreme Temperaturen ","Extreme temperatures","Français"]
[{"$f":"INDEX(Table_Language[#This Row],1,Language_select+1)","v":"Brand "},"Brand ","Fire","Français"]
[{"$f":"INDEX(Table_Language[#This Row],1,Language_select+1)","v":"Explosion "},"Explosion ","Explosion","Français"]
[{"$f":"INDEX(Table_Language[#This Row],1,Language_select+1)","v":"Lärm "},"Lärm ","Noise","Français"]
[{"$f":"INDEX(Table_Language[#This Row],1,Language_select+1)","v":"Vibrationen "},"Vibrationen ","Vibrations","Français"]
[{"$f":"INDEX(Table_Language[#This Row],1,Language_select+1)","v":"Strahlung "},"Strahlung ","Radiation","Français"]
[{"$f":"INDEX(Table_Language[#This Row],1,Language_select+1)","v":"Strahlung von außen "},"Strahlung von außen ","External radiation","Français"]
[{"$f":"INDEX(Table_Language[#This Row],1,Language_select+1)","v":"Laserstrahlung "},"Laserstrahlung ","Laser radiation","Français"]
[{"$f":"INDEX(Table_Language[#This Row],1,Language_select+1)","v":"Emission gefährlicher Werkstoffe und Substanzen "},"Emission gefährlicher Werkstoffe und Substanzen ","Emissions of hazardous materials and substances","Français"]
[{"$f":"INDEX(Table_Language[#This Row],1,Language_select+1)","v":"Risiko, in einer Maschine eingeschlossen zu werden"},"Risiko, in einer Maschine eingeschlossen zu werden","Risk of being trapped in a machine","Français"]
[{"$f":"INDEX(Table_Language[#This Row],1,Language_select+1)","v":"Ausrutsch-, Stolper- und Sturzrisiko "},"Ausrutsch-, Stolper- und Sturzrisiko ","Risk of slipping, tripping or falling","Français"]
[{"$f":"INDEX(Table_Language[#This Row],1,Language_select+1)","v":"Blitzschlag "},"Blitzschlag ","Lightning","Français"]
[{"$f":"INDEX(Table_Language[#This Row],1,Language_select+1)","v":"Instandhaltung "},"Instandhaltung ","Maintenance","Français"]
[{"$f":"INDEX(Table_Language[#This Row],1,Language_select+1)","v":"Wartung der Maschine "},"Wartung der Maschine ","Machinery maintenance","Français"]
[{"$f":"INDEX(Table_Language[#This Row],1,Language_select+1)","v":"Zugang zu den Bedienungsständen und den Eingriffspunkten für die Instandhaltung "},"Zugang zu den Bedienungsständen und den Eingriffspunkten für die Instandhaltung ","Access to operating positions and servicing points","Français"]
[{"$f":"INDEX(Table_Language[#This Row],1,Language_select+1)","v":"Trennung von den Energiequellen "},"Trennung von den Energiequellen ","Isolation of energy sources","Français"]
[{"$f":"INDEX(Table_Language[#This Row],1,Language_select+1)","v":"Eingriffe des Bedienungspersonals "},"Eingriffe des Bedienungspersonals ","Operator intervention","Français"]
[{"$f":"INDEX(Table_Language[#This Row],1,Language_select+1)","v":"Reinigung innen liegender Maschinenteile "},"Reinigung innen liegender Maschinenteile ","Cleaning of internal parts","Français"]
[{"$f":"INDEX(Table_Language[#This Row],1,Language_select+1)","v":"Informationen "},"Informationen ","Information","Français"]
[{"$f":"INDEX(Table_Language[#This Row],1,Language_select+1)","v":"Informationen und Warnhinweise an der Maschine "},"Informationen und Warnhinweise an der Maschine ","Information and warnings on the machinery","Français"]
[{"$f":"INDEX(Table_Language[#This Row],1,Language_select+1)","v":"Informationen und Informationseinrichtungen "},"Informationen und Informationseinrichtungen ","Information and information devices","Français"]
[{"$f":"INDEX(Table_Language[#This Row],1,Language_select+1)","v":"Warneinrichtungen "},"Warneinrichtungen ","Warning devices","Français"]
[{"$f":"INDEX(Table_Language[#This Row],1,Language_select+1)","v":"Warnung vor Restrisiken "},"Warnung vor Restrisiken ","Warning of residual risks","Français"]
[{"$f":"INDEX(Table_Language[#This Row],1,Language_select+1)","v":"Kennzeichnung der Maschinen "},"Kennzeichnung der Maschinen ","Marking of machinery","Français"]
[{"$f":"INDEX(Table_Language[#This Row],1,Language_select+1)","v":"Betriebsanleitung "},"Betriebsanleitung ","Instructions","Français"]
[{"$f":"INDEX(Table_Language[#This Row],1,Language_select+1)","v":"Allgemeine Grundsätze für die Abfassung der Betriebsanleitung "},"Allgemeine Grundsätze für die Abfassung der Betriebsanleitung ","General principles for the drafting of instructions","Français"]
[{"$f":"INDEX(Table_Language[#This Row],1,Language_select+1)","v":"Inhalt der Betriebsanleitung "},"Inhalt der Betriebsanleitung ","Contents of the instructions","Français"]
[{"$f":"INDEX(Table_Language[#This Row],1,Language_select+1)","v":"Verkaufsprospekte"},"Verkaufsprospekte","Sales literature","Français"]
[{"$f":"INDEX(Table_Language[#This Row],1,Language_select+1)","v":"Bestimmte Maschinengattungen"},"Bestimmte Maschinengattungen","Supplementary essential health and safety requirements for certain categories of machinery","Français"]
[{"$f":"INDEX(Table_Language[#This Row],1,Language_select+1)","v":"Nahrungsmittelmaschinen und Maschinen für kosmetische oder pharmazeutische Erzeugnisse"},"Nahrungsmittelmaschinen und Maschinen für kosmetische oder pharmazeutische Erzeugnisse","Foodstuffs machinery and machinery for cosmetics or pharmaceutical products","Français"]
[{"$f":"INDEX(Table_Language[#This Row],1,Language_select+1)","v":"Allgemeines"},"Allgemeines","General","Français"]
[{"$f":"INDEX(Table_Language[#This Row],1,Language_select+1)","v":"Betriebsanleitung"},"Betriebsanleitung","Instructions","Français"]
[{"$f":"INDEX(Table_Language[#This Row],1,Language_select+1)","v":"handgehaltene und/oder handgeführte tragbare Maschinen"},"handgehaltene und/oder handgeführte tragbare Maschinen","Portable hand-held and/or hand-guided machinery","Français"]
[{"$f":"INDEX(Table_Language[#This Row],1,Language_select+1)","v":"Allgemeines"},"Allgemeines","General","Français"]
[{"$f":"INDEX(Table_Language[#This Row],1,Language_select+1)","v":"Betriebsanleitung"},"Betriebsanleitung","Instructions","Français"]
[{"$f":"INDEX(Table_Language[#This Row],1,Language_select+1)","v":"Tragbare Befestigungsgeräte und andere Schussgeräte"},"Tragbare Befestigungsgeräte und andere Schussgeräte","Portable fixing and other impact machinery","Français"]
[{"$f":"INDEX(Table_Language[#This Row],1,Language_select+1)","v":"Allgemeines"},"Allgemeines","General","Français"]
[{"$f":"INDEX(Table_Language[#This Row],1,Language_select+1)","v":"Betriebsanleitung"},"Betriebsanleitung","Instructions","Français"]
[{"$f":"INDEX(Table_Language[#This Row],1,Language_select+1)","v":"Maschinen zur Bearbeitung von Holz und von Werkstoffen mit ähnlichen physikalischen Eigenschaften"},"Maschinen zur Bearbeitung von Holz und von Werkstoffen mit ähnlichen physikalischen Eigenschaften","Machinery for working wood and material with similar physical characteristics","Français"]
[{"$f":"INDEX(Table_Language[#This Row],1,Language_select+1)","v":"Maschinen zur Ausbringung von Pestiziden"},"Maschinen zur Ausbringung von Pestiziden","Machinery for pesticide application","Français"]
[{"$f":"INDEX(Table_Language[#This Row],1,Language_select+1)","v":"Begriffsbestimmung"},"Begriffsbestimmung","Definitions","Français"]
[{"$f":"INDEX(Table_Language[#This Row],1,Language_select+1)","v":"Allgemeines"},"Allgemeines","General","Français"]
[{"$f":"INDEX(Table_Language[#This Row],1,Language_select+1)","v":"Bedienung und Überwachung"},"Bedienung und Überwachung","Controls and monitoring","Français"]
[{"$f":"INDEX(Table_Language[#This Row],1,Language_select+1)","v":"Füllung und Entleerung"},"Füllung und Entleerung","Filling and emptying","Français"]
[{"$f":"INDEX(Table_Language[#This Row],1,Language_select+1)","v":"Ausbringung von Pestiziden"},"Ausbringung von Pestiziden","Application of pesticides","Français"]
[{"$f":"INDEX(Table_Language[#This Row],1,Language_select+1)","v":"Ausbringungsrate"},"Ausbringungsrate","Application rate","Français"]
[{"$f":"INDEX(Table_Language[#This Row],1,Language_select+1)","v":"Verteilung, Anlagerung und Abdrift von Pestiziden"},"Verteilung, Anlagerung und Abdrift von Pestiziden","Distribution, deposition and drift of pesticide","Français"]
[{"$f":"INDEX(Table_Language[#This Row],1,Language_select+1)","v":"Prüfungen"},"Prüfungen","Tests","Français"]
[{"$f":"INDEX(Table_Language[#This Row],1,Language_select+1)","v":"Unbeabsichtigte Freisetzungen während und nach der Abschaltung"},"Unbeabsichtigte Freisetzungen während und nach der Abschaltung","Losses during stoppage","Français"]
[{"$f":"INDEX(Table_Language[#This Row],1,Language_select+1)","v":"Wartung"},"Wartung","Maintenance","Français"]
[{"$f":"INDEX(Table_Language[#This Row],1,Language_select+1)","v":"Reinigung"},"Reinigung","Cleaning","Français"]
[{"$f":"INDEX(Table_Language[#This Row],1,Language_select+1)","v":"Instandhaltung"},"Instandhaltung","Servicing","Français"]
[{"$f":"INDEX(Table_Language[#This Row],1,Language_select+1)","v":"Kontrollen"},"Kontrollen","Inspections","Français"]
[{"$f":"INDEX(Table_Language[#This Row],1,Language_select+1)","v":"Kennzeichnung von Düsen, Sieben und Filtern"},"Kennzeichnung von Düsen, Sieben und Filtern","Marking of nozzles, strainers and filters","Français"]
[{"$f":"INDEX(Table_Language[#This Row],1,Language_select+1)","v":"Angabe des verwendeten Pestizids"},"Angabe des verwendeten Pestizids","Indication of pesticide in use","Français"]
[{"$f":"INDEX(Table_Language[#This Row],1,Language_select+1)","v":"Betriebsanleitung"},"Betriebsanleitung","Instructions","Français"]
[{"$f":"INDEX(Table_Language[#This Row],1,Language_select+1)","v":"Beweglichkeit von Maschinen"},"Beweglichkeit von Maschinen","Supplementary essential health and safety requirements to offset hazards due to the mobility of machinery","Français"]
[{"$f":"INDEX(Table_Language[#This Row],1,Language_select+1)","v":"Allgemeines"},"Allgemeines","General","Français"]
[{"$f":"INDEX(Table_Language[#This Row],1,Language_select+1)","v":"Begriffsbestimmungen"},"Begriffsbestimmungen","Definitions","Français"]
[{"$f":"INDEX(Table_Language[#This Row],1,Language_select+1)","v":"Bedienerplätze"},"Bedienerplätze","Work positions","Français"]
[{"$f":"INDEX(Table_Language[#This Row],1,Language_select+1)","v":"Fahrerplatz"},"Fahrerplatz","Driving position","Français"]
[{"$f":"INDEX(Table_Language[#This Row],1,Language_select+1)","v":"Sitze"},"Sitze","Seating","Français"]
[{"$f":"INDEX(Table_Language[#This Row],1,Language_select+1)","v":"Plätze für andere Personen"},"Plätze für andere Personen","Positions for other persons","Français"]
[{"$f":"INDEX(Table_Language[#This Row],1,Language_select+1)","v":"Steuerung"},"Steuerung","Control systems","Français"]
[{"$f":"INDEX(Table_Language[#This Row],1,Language_select+1)","v":"Stellteile"},"Stellteile","Control devices","Français"]
[{"$f":"INDEX(Table_Language[#This Row],1,Language_select+1)","v":"Ingangsetzen/Verfahren"},"Ingangsetzen/Verfahren","Starting/moving","Français"]
[{"$f":"INDEX(Table_Language[#This Row],1,Language_select+1)","v":"Stillsetzen/Bremsen"},"Stillsetzen/Bremsen","Travelling function","Français"]
[{"$f":"INDEX(Table_Language[#This Row],1,Language_select+1)","v":"Verfahren mitgängergeführter Maschinen"},"Verfahren mitgängergeführter Maschinen","Movement of pedestrian-controlled machinery","Français"]
[{"$f":"INDEX(Table_Language[#This Row],1,Language_select+1)","v":"Störung des Steuerkreises"},"Störung des Steuerkreises","Control circuit failure","Français"]
[{"$f":"INDEX(Table_Language[#This Row],1,Language_select+1)","v":"Schutzmaßnahmen gegen mechanische Gefährdungen"},"Schutzmaßnahmen gegen mechanische Gefährdungen","Protection against mechanical hazards","Français"]
[{"$f":"INDEX(Table_Language[#This Row],1,Language_select+1)","v":"Unkontrollierte Bewegungen"},"Unkontrollierte Bewegungen","Uncontrolled movements","Français"]
[{"$f":"INDEX(Table_Language[#This Row],1,Language_select+1)","v":"Bewegliche Übertragungselemente"},"Bewegliche Übertragungselemente","Moving transmission parts","Français"]
[{"$f":"INDEX(Table_Language[#This Row],1,Language_select+1)","v":"Überrollen und Umkippen"},"Überrollen und Umkippen","Roll-over and tip-over","Français"]
[{"$f":"INDEX(Table_Language[#This Row],1,Language_select+1)","v":"Herabfallende Gegenstände"},"Herabfallende Gegenstände","Falling objects","Français"]
[{"$f":"INDEX(Table_Language[#This Row],1,Language_select+1)","v":"Zugänge"},"Zugänge","Means of access","Français"]
[{"$f":"INDEX(Table_Language[#This Row],1,Language_select+1)","v":"Anhängevorrichtungen"},"Anhängevorrichtungen","Towing devices","Français"]
[{"$f":"INDEX(Table_Language[#This Row],1,Language_select+1)","v":"Kraftübertragung zwischen einer selbstfahrenden Maschine (oder einer Zugmaschine) und einer angetriebenen Maschine"},"Kraftübertragung zwischen einer selbstfahrenden Maschine (oder einer Zugmaschine) und einer angetriebenen Maschine","Transmission of power between self-propelled machinery (or tractor) and recipient machinery","Français"]
[{"$f":"INDEX(Table_Language[#This Row],1,Language_select+1)","v":"Schutzmaßnahmen gegen sonstige Gefährdungen"},"Schutzmaßnahmen gegen sonstige Gefährdungen","Protection against other hazards","Français"]
[{"$f":"INDEX(Table_Language[#This Row],1,Language_select+1)","v":"Batterien"},"Batterien","Batteries","Français"]
[{"$f":"INDEX(Table_Language[#This Row],1,Language_select+1)","v":"Brand"},"Brand","Fire","Français"]
[{"$f":"INDEX(Table_Language[#This Row],1,Language_select+1)","v":"Emission von gefährlichen Stoffen"},"Emission von gefährlichen Stoffen","Emissions of hazardous substances","Français"]
[{"$f":"INDEX(Table_Language[#This Row],1,Language_select+1)","v":"Informationen und Angaben"},"Informationen und Angaben","Information and indications","Français"]
[{"$f":"INDEX(Table_Language[#This Row],1,Language_select+1)","v":"Zeichen, Signaleinrichtungen und Warnhinweise"},"Zeichen, Signaleinrichtungen und Warnhinweise","Signs, signals and warnings","Français"]
[{"$f":"INDEX(Table_Language[#This Row],1,Language_select+1)","v":"Kennzeichnung"},"Kennzeichnung","Marking","Français"]
[{"$f":"INDEX(Table_Language[#This Row],1,Language_select+1)","v":"Betriebsanleitung"},"Betriebsanleitung","Instructions","Français"]
[{"$f":"INDEX(Table_Language[#This Row],1,Language_select+1)","v":"Vibrationen"},"Vibrationen","Vibrations","Français"]
[{"$f":"INDEX(Table_Language[#This Row],1,Language_select+1)","v":"Mehrere Verwendungsmöglichkeiten"},"Mehrere Verwendungsmöglichkeiten","Multiple uses","Français"]
[{"$f":"INDEX(Table_Language[#This Row],1,Language_select+1)","v":"durch Hebevorgänge bedingten Gefährdungen"},"durch Hebevorgänge bedingten Gefährdungen","Supplementary essential health and safety requirements to offset hazards due to lifting operations","Français"]
[{"$f":"INDEX(Table_Language[#This Row],1,Language_select+1)","v":"Allgemeines"},"Allgemeines","General","Français"]
[{"$f":"INDEX(Table_Language[#This Row],1,Language_select+1)","v":"Begriffsbestimmungen"},"Begriffsbestimmungen","Definitions","Français"]
[{"$f":"INDEX(Table_Language[#This Row],1,Language_select+1)","v":"Schutzmaßnahmen gegen mechanische Gefährdungen"},"Schutzmaßnahmen gegen mechanische Gefährdungen","Protection against mechanical hazards","Français"]
[{"$f":"INDEX(Table_Language[#This Row],1,Language_select+1)","v":"Risiken durch mangelnde Standsicherheit"},"Risiken durch mangelnde Standsicherheit","Risks due to lack of stability","Français"]
[{"$f":"INDEX(Table_Language[#This Row],1,Language_select+1)","v":"An Führungen oder auf Laufbahnen fahrende Maschinen"},"An Führungen oder auf Laufbahnen fahrende Maschinen","Machinery running on guide rails and rail tracks","Français"]
[{"$f":"INDEX(Table_Language[#This Row],1,Language_select+1)","v":"Festigkeit"},"Festigkeit","Mechanical strength","Français"]
[{"$f":"INDEX(Table_Language[#This Row],1,Language_select+1)","v":"Rollen, Trommeln, Scheiben, Seile und Ketten"},"Rollen, Trommeln, Scheiben, Seile und Ketten","Pulleys, drums, wheels, ropes and chains","Français"]
[{"$f":"INDEX(Table_Language[#This Row],1,Language_select+1)","v":"Lastaufnahmemittel und ihre Bauteile"},"Lastaufnahmemittel und ihre Bauteile","Lifting accessories and their components","Français"]
[{"$f":"INDEX(Table_Language[#This Row],1,Language_select+1)","v":"Bewegungsbegrenzung"},"Bewegungsbegrenzung","Control of movements","Français"]
[{"$f":"INDEX(Table_Language[#This Row],1,Language_select+1)","v":"Bewegungen von Lasten während der Benutzung"},"Bewegungen von Lasten während der Benutzung","Movements of loads during handling","Français"]
[{"$f":"INDEX(Table_Language[#This Row],1,Language_select+1)","v":"Maschinen, die feste Ladestellen anfahren"},"Maschinen, die feste Ladestellen anfahren","Machinery serving fixed landings","Français"]
[{"$f":"INDEX(Table_Language[#This Row],1,Language_select+1)","v":"Bewegungen des Lastträgers"},"Bewegungen des Lastträgers","Movements of the carrier","Français"]
[{"$f":"INDEX(Table_Language[#This Row],1,Language_select+1)","v":"Zugang zum Lastträger"},"Zugang zum Lastträger","Access to the carrier","Français"]
[{"$f":"INDEX(Table_Language[#This Row],1,Language_select+1)","v":"Risiken durch Kontakt mit dem bewegten Lastträger"},"Risiken durch Kontakt mit dem bewegten Lastträger","Risks due to contact with the moving carrier","Français"]
[{"$f":"INDEX(Table_Language[#This Row],1,Language_select+1)","v":"Risiken durch vom Lastträger herabstürzende Lasten"},"Risiken durch vom Lastträger herabstürzende Lasten","Risk due to the load falling off the carrier","Français"]
[{"$f":"INDEX(Table_Language[#This Row],1,Language_select+1)","v":"Ladestellen"},"Ladestellen","Landings","Français"]
[{"$f":"INDEX(Table_Language[#This Row],1,Language_select+1)","v":"Zwecktauglichkeit"},"Zwecktauglichkeit","Fitness for purpose","Français"]
[{"$f":"INDEX(Table_Language[#This Row],1,Language_select+1)","v":"Anforderungen an Maschinen, die nicht durch menschliche Kraft angetrieben werden"},"Anforderungen an Maschinen, die nicht durch menschliche Kraft angetrieben werden","Requirements for machinery whose power source is other than manual effort","Français"]
[{"$f":"INDEX(Table_Language[#This Row],1,Language_select+1)","v":"Bewegungssteuerung"},"Bewegungssteuerung","Control of movements","Français"]
[{"$f":"INDEX(Table_Language[#This Row],1,Language_select+1)","v":"Belastungsbegrenzung"},"Belastungsbegrenzung","Loading control","Français"]
[{"$f":"INDEX(Table_Language[#This Row],1,Language_select+1)","v":"Seilgeführte Einrichtungen"},"Seilgeführte Einrichtungen","Installations guided by ropes","Français"]
[{"$f":"INDEX(Table_Language[#This Row],1,Language_select+1)","v":"Informationen und Kennzeichnung"},"Informationen und Kennzeichnung","Information and markings","Français"]
[{"$f":"INDEX(Table_Language[#This Row],1,Language_select+1)","v":"Ketten, Seile und Gurte"},"Ketten, Seile und Gurte","Chains, ropes and webbing","Français"]
[{"$f":"INDEX(Table_Language[#This Row],1,Language_select+1)","v":"Lastaufnahmemittel"},"Lastaufnahmemittel","Lifting accessories","Français"]
[{"$f":"INDEX(Table_Language[#This Row],1,Language_select+1)","v":"Maschinen zum Heben von Lasten"},"Maschinen zum Heben von Lasten","Lifting machinery","Français"]
[{"$f":"INDEX(Table_Language[#This Row],1,Language_select+1)","v":"Betriebsanleitung"},"Betriebsanleitung","Instructions","Français"]
[{"$f":"INDEX(Table_Language[#This Row],1,Language_select+1)","v":"Lastaufnahmemittel"},"Lastaufnahmemittel","Lifting accessories","Français"]
[{"$f":"INDEX(Table_Language[#This Row],1,Language_select+1)","v":"Maschinen zum Heben von Lasten"},"Maschinen zum Heben von Lasten","Lifting machinery","Français"]
[{"$f":"INDEX(Table_Language[#This Row],1,Language_select+1)","v":"zum Einsatz unter Tage bestimmte Maschinen"},"zum Einsatz unter Tage bestimmte Maschinen","Supplementary essential health and safety requirements for machinery intended for underground work","Français"]
[{"$f":"INDEX(Table_Language[#This Row],1,Language_select+1)","v":"Risiken durch mangelnde Standsicherheit"},"Risiken durch mangelnde Standsicherheit","Risks due to lack of stability","Français"]
[{"$f":"INDEX(Table_Language[#This Row],1,Language_select+1)","v":"Bewegungsfreiheit"},"Bewegungsfreiheit","Movement","Français"]
[{"$f":"INDEX(Table_Language[#This Row],1,Language_select+1)","v":"Stellteile"},"Stellteile","Control devices","Français"]
[{"$f":"INDEX(Table_Language[#This Row],1,Language_select+1)","v":"Anhalten der Fahrbewegung"},"Anhalten der Fahrbewegung","Stopping","Français"]
[{"$f":"INDEX(Table_Language[#This Row],1,Language_select+1)","v":"Brand"},"Brand","Fire","Français"]
[{"$f":"INDEX(Table_Language[#This Row],1,Language_select+1)","v":"Emission von Abgasen"},"Emission von Abgasen","Exhaust emissions","Français"]
[{"$f":"INDEX(Table_Language[#This Row],1,Language_select+1)","v":"durch das Heben von Personen bedingte Gefährdungen"},"durch das Heben von Personen bedingte Gefährdungen","Supplementary essential health and safety requirements for machinery presenting particular hazards due to the lifting of persons","Français"]
[{"$f":"INDEX(Table_Language[#This Row],1,Language_select+1)","v":"Allgemeines"},"Allgemeines","General","Français"]
[{"$f":"INDEX(Table_Language[#This Row],1,Language_select+1)","v":"Festigkeit"},"Festigkeit","Mechanical strength","Français"]
[{"$f":"INDEX(Table_Language[#This Row],1,Language_select+1)","v":"Belastungsbegrenzung bei nicht durch menschliche Kraft angetriebenen Maschinen"},"Belastungsbegrenzung bei nicht durch menschliche Kraft angetriebenen Maschinen","Loading control for machinery moved by power other than human strength","Français"]
[{"$f":"INDEX(Table_Language[#This Row],1,Language_select+1)","v":"Stellteile"},"Stellteile","Control devices","Français"]
[{"$f":"INDEX(Table_Language[#This Row],1,Language_select+1)","v":"Risiken für in oder auf dem Lastträger befindliche Personen"},"Risiken für in oder auf dem Lastträger befindliche Personen","Risks to persons in or on the carrier","Français"]
[{"$f":"INDEX(Table_Language[#This Row],1,Language_select+1)","v":"Risiken durch Bewegungen des Lastträgers"},"Risiken durch Bewegungen des Lastträgers","Risks due to movements of the carrier","Français"]
[{"$f":"INDEX(Table_Language[#This Row],1,Language_select+1)","v":"Risiko des Sturzes aus dem Lastträger"},"Risiko des Sturzes aus dem Lastträger","Risk of persons falling from the carrier","Français"]
[{"$f":"INDEX(Table_Language[#This Row],1,Language_select+1)","v":"Risiken durch auf den Lastträger herabfallende Gegenstände"},"Risiken durch auf den Lastträger herabfallende Gegenstände","Risk due to objects falling on the carrier","Français"]
[{"$f":"INDEX(Table_Language[#This Row],1,Language_select+1)","v":"Maschinen, die feste Haltestellen anfahren"},"Maschinen, die feste Haltestellen anfahren","Machinery serving fixed landings","Français"]
[{"$f":"INDEX(Table_Language[#This Row],1,Language_select+1)","v":"Risiken für in oder auf dem Lastträger befindliche Personen"},"Risiken für in oder auf dem Lastträger befindliche Personen","Risks to persons in or on the carrier","Français"]
[{"$f":"INDEX(Table_Language[#This Row],1,Language_select+1)","v":"Befehlseinrichtungen an den Haltestellen"},"Befehlseinrichtungen an den Haltestellen","Controls at landings","Français"]
[{"$f":"INDEX(Table_Language[#This Row],1,Language_select+1)","v":"Zugang zum Lastträger"},"Zugang zum Lastträger","Access to the carrier","Français"]
[{"$f":"INDEX(Table_Language[#This Row],1,Language_select+1)","v":"Kennzeichnung"},"Kennzeichnung","Markings","Français"]
[{"$f":"INDEX(Table_Language[#This Row],1,Language_select+1)","v":"Nachrichten Box"},"Nachrichten Box","Message Box","Français"]
[{"$f":"INDEX(Table_Language[#This Row],1,Language_select+1)","v":"Diese Zeile können Sie nicht löschen.\n\nDies ist eine Überschrift."},"Diese Zeile können Sie nicht löschen.\n\nDies ist eine Überschrift.","This row can not be deleted.\n\nThis is a headline.","Français"]
[{"$f":"INDEX(Table_Language[#This Row],1,Language_select+1)","v":"Diese Zeile können Sie nicht löschen.\n\nWenn diese GSA nicht zutrifft, löschen Sie bitte das X aus Spalte \"GSA trifft zu\" und blenden die Zeile über den Filter aus."},"Diese Zeile können Sie nicht löschen.\n\nWenn diese GSA nicht zutrifft, löschen Sie bitte das X aus Spalte \"GSA trifft zu\" und blenden die Zeile über den Filter aus.","This row can not be deleted.\n\nIf the EHSR is not applicable, delete the X from column \"applying EHSR\" and use the filter function to hide this line.","Français"]
[{"$f":"INDEX(Table_Language[#This Row],1,Language_select+1)","v":"Alle Daten in der ausgewählten Zeile werden gelöscht. Sind Sie sicher?"},"Alle Daten in der ausgewählten Zeile werden gelöscht. Sind Sie sicher?","All entries from the selected line will be deleted. Are you sure?","Français"]
[{"$f":"INDEX(Table_Language[#This Row],1,Language_select+1)","v":"Projektdaten"},"Projektdaten","Project data","Données projet"]
[{"$f":"INDEX(Table_Language[#This Row],1,Language_select+1)","v":"Bezeichnung der Maschine:"},"Bezeichnung der Maschine:","Commercial name of the Machinery:","Français"]
[{"$f":"INDEX(Table_Language[#This Row],1,Language_select+1)","v":"Maschinentyp:"},"Maschinentyp:","Machinery type:","Français"]
[{"$f":"INDEX(Table_Language[#This Row],1,Language_select+1)","v":"Seriennummer:"},"Seriennummer:","Serial number:","Français"]
[{"$f":"INDEX(Table_Language[#This Row],1,Language_select+1)","v":"allgemeine Beschreibung der Maschine:"},"allgemeine Beschreibung der Maschine:","General description of the machinery:","Français"]
[{"$f":"INDEX(Table_Language[#This Row],1,Language_select+1)","v":"Konformitätsbewertungsverfahren:"},"Konformitätsbewertungsverfahren:","Procedures for assessing the conformity:","Français"]
[{"$f":"INDEX(Table_Language[#This Row],1,Language_select+1)","v":"notifizierte Stelle:"},"notifizierte Stelle:","Notified body:","Français"]
[{"$f":"INDEX(Table_Language[#This Row],1,Language_select+1)","v":"Projektleiter:"},"Projektleiter:","Project leader:","Français"]
[{"$f":"INDEX(Table_Language[#This Row],1,Language_select+1)","v":"Konstrukteur mechanisch:"},"Konstrukteur mechanisch:","Mechanical designer:","Français"]
[{"$f":"INDEX(Table_Language[#This Row],1,Language_select+1)","v":"Konstrukteur elektrisch:"},"Konstrukteur elektrisch:","Electrical designer:","Français"]
[{"$f":"INDEX(Table_Language[#This Row],1,Language_select+1)","v":"Konstrukteur Steuerung:"},"Konstrukteur Steuerung:","Control system designer:","Français"]
[{"$f":"INDEX(Table_Language[#This Row],1,Language_select+1)","v":"Konstrukteur Medien:"},"Konstrukteur Medien:","Communication medium designer:","Français"]
[{"$f":"INDEX(Table_Language[#This Row],1,Language_select+1)","v":"Dokumentationsbevollmächtigter:"},"Dokumentationsbevollmächtigter:","Authorised person to compile the technical file:","Français"]
[{"$f":"INDEX(Table_Language[#This Row],1,Language_select+1)","v":"Hinweis:\n\nName / Unternehmen / Funktion"},"Hinweis:\n\nName / Unternehmen / Funktion","Information:\n\nName / Company / Position","Français"]
[{"$f":"INDEX(Table_Language[#This Row],1,Language_select+1)","v":"Hinweis:\nNach Anhang II 1. A. 2. / 1. B. 2.\nName / Unternehmen / Funktion"},"Hinweis:\nNach Anhang II 1. A. 2. / 1. B. 2.\nName / Unternehmen / Funktion","Information:\naccording to annex II 1. A. 2. / 1. B. 2.\nName / Company / Position","Français"]
[{"$f":"INDEX(Table_Language[#This Row],1,Language_select+1)","v":"Bestimmungsgemäße Verwendung:"},"Bestimmungsgemäße Verwendung:","Intended use","Français"]
[{"$f":"INDEX(Table_Language[#This Row],1,Language_select+1)","v":"Vernünftigerweise vorhersehbare Fehlanwendung (unter Berücksichtigung von Kundenrückmeldungen und bekannten Unfallgeschichten):"},"Vernünftigerweise vorhersehbare Fehlanwendung (unter Berücksichtigung von Kundenrückmeldungen und bekannten Unfallgeschichten):","Reasonably foreseeable misuse (considering customer feedback and known history of accidents)","Français"]
[{"$f":"INDEX(Table_Language[#This Row],1,Language_select+1)","v":"Betriebsarten:"},"Betriebsarten:","Operating modes:","Français"]
[{"$f":"INDEX(Table_Language[#This Row],1,Language_select+1)","v":"Beschreibung der verschiedenen Betriebsarten und Darstellung der ggf. unterschiedlichen Schutzmaßnahmen."},"Beschreibung der verschiedenen Betriebsarten und Darstellung der ggf. unterschiedlichen Schutzmaßnahmen.","Description of the different modes of operation and protective measures.","Français"]
[{"$f":"INDEX(Table_Language[#This Row],1,Language_select+1)","v":"Einsatzbereich:"},"Einsatzbereich:","Field of application:","Français"]
[{"$f":"INDEX(Table_Language[#This Row],1,Language_select+1)","v":"Räumliche Grenzen "},"Räumliche Grenzen ","Space limits","Français"]
[{"$f":"INDEX(Table_Language[#This Row],1,Language_select+1)","v":"Bewegungsraum, Platzbedarf von Personen, die mit der Maschine umgehen, z.B. während Betrieb und Instandhaltung"},"Bewegungsraum, Platzbedarf von Personen, die mit der Maschine umgehen, z.B. während Betrieb und Instandhaltung","the range of movement, space requirements for persons interacting with the machine, such as during operation and maintenance","Français"]
[{"$f":"INDEX(Table_Language[#This Row],1,Language_select+1)","v":"Schnittstelle(n): Mensch / Energieversorgung - Mensch / Maschine"},"Schnittstelle(n): Mensch / Energieversorgung - Mensch / Maschine","operator–machine interface, machine–power supply interface","Français"]
[{"$f":"INDEX(Table_Language[#This Row],1,Language_select+1)","v":"Übersichtszeichnung inkl. Stückliste"},"Übersichtszeichnung inkl. Stückliste","Overview drawing including parts list","Français"]
[{"$f":"INDEX(Table_Language[#This Row],1,Language_select+1)","v":"Hinweis:\n\nDateiname / Version / Datum / Kapitel /  Seitenzahl"},"Hinweis:\n\nDateiname / Version / Datum / Kapitel /  Seitenzahl","Information:\n\nFilename / Version / Date / Chapter / Page number","Français"]
[{"$f":"INDEX(Table_Language[#This Row],1,Language_select+1)","v":"Lasten-/Pflichtenheft"},"Lasten-/Pflichtenheft","Requirement/design specifications","Français"]
[{"$f":"INDEX(Table_Language[#This Row],1,Language_select+1)","v":"technische Leistungsbeschreibung "},"technische Leistungsbeschreibung ","Technical specifications","Français"]
[{"$f":"INDEX(Table_Language[#This Row],1,Language_select+1)","v":"Beschreibung zu Aufbau und Komponenten in der Betriebsanleitung Kap. xxx"},"Beschreibung zu Aufbau und Komponenten in der Betriebsanleitung Kap. xxx","Description on setup and components in the manual chapter XXX","Français"]
[{"$f":"INDEX(Table_Language[#This Row],1,Language_select+1)","v":"technische Daten in der Betriebsanleitung Kap. xxx"},"technische Daten in der Betriebsanleitung Kap. xxx","Technical data in the manual chapter XXX","Français"]
[{"$f":"INDEX(Table_Language[#This Row],1,Language_select+1)","v":"Zeitliche Grenzen "},"Zeitliche Grenzen ","Time limits","Français"]
[{"$f":"INDEX(Table_Language[#This Row],1,Language_select+1)","v":"Grenzen der Lebensdauer der Maschine / einzelner Bauteile, bei bestimmungsgemäßer Verwendung und vorhersehbarer Fehlanwendung"},"Grenzen der Lebensdauer der Maschine / einzelner Bauteile, bei bestimmungsgemäßer Verwendung und vorhersehbarer Fehlanwendung","the life limit of the machinery and/or of some of its components, taking into account its intended use and reasonably foreseeable\nmisuse","Français"]
[{"$f":"INDEX(Table_Language[#This Row],1,Language_select+1)","v":"Empfohlene Wartungsintervalle"},"Empfohlene Wartungsintervalle","recommended service intervals","Français"]
[{"$f":"INDEX(Table_Language[#This Row],1,Language_select+1)","v":"Hinweis:\n\ngewöhnlich 20 Jahre"},"Hinweis:\n\ngewöhnlich 20 Jahre","Information:\n\nusually 20 years","Français"]
[{"$f":"INDEX(Table_Language[#This Row],1,Language_select+1)","v":"Lebensdauer der Maschine"},"Lebensdauer der Maschine","Lifecycle of the machine","Français"]
[{"$f":"INDEX(Table_Language[#This Row],1,Language_select+1)","v":"Lebensdauer der Verschleißteile (Liste)"},"Lebensdauer der Verschleißteile (Liste)","Lifecycle of the wear parts (list)","Français"]
[{"$f":"INDEX(Table_Language[#This Row],1,Language_select+1)","v":"Empfohlene Wartungsintervalle (Liste)"},"Empfohlene Wartungsintervalle (Liste)","Recommended maintenance intervals (list)","Français"]
[{"$f":"INDEX(Table_Language[#This Row],1,Language_select+1)","v":"Weitere Grenzen"},"Weitere Grenzen","Other limits","Français"]
[{"$f":"INDEX(Table_Language[#This Row],1,Language_select+1)","v":"Eigenschaften der zu bearbeitenden Materialien"},"Eigenschaften der zu bearbeitenden Materialien","properties of the material(s) to be processed","Français"]
[{"$f":"INDEX(Table_Language[#This Row],1,Language_select+1)","v":"erforderlicher Reinlichkeitsgrad"},"erforderlicher Reinlichkeitsgrad","housekeeping — the level of cleanliness required","Français"]
[{"$f":"INDEX(Table_Language[#This Row],1,Language_select+1)","v":"Mindest- / Höchsttemperatur in der Umgebung / in der Maschine"},"Mindest- / Höchsttemperatur in der Umgebung / in der Maschine","the recommended minimum and maximum temperatures, in the machine / environment","Français"]
[{"$f":"INDEX(Table_Language[#This Row],1,Language_select+1)","v":"Betrieb im Innenraum / Freien bei trockener / nasser Witterung und bei direkter / indirekter Sonneneinstrahlung"},"Betrieb im Innenraum / Freien bei trockener / nasser Witterung und bei direkter / indirekter Sonneneinstrahlung","operation indoors or outdoors, in dry / wet weather, in direct / indirect sunlight","Français"]
[{"$f":"INDEX(Table_Language[#This Row],1,Language_select+1)","v":"Staub / Nässeverträglich"},"Staub / Nässeverträglich","tolerance to dust and wet","Français"]
[{"$f":"INDEX(Table_Language[#This Row],1,Language_select+1)","v":"etc."},"etc.","etc.","Français"]
[{"$f":"INDEX(Table_Language[#This Row],1,Language_select+1)","v":"Materialien die verarbeitet werden (Liste mit Gefährdungen)"},"Materialien die verarbeitet werden (Liste mit Gefährdungen)","Materials being processed (list with hazards)","Français"]
[{"$f":"INDEX(Table_Language[#This Row],1,Language_select+1)","v":"erforderlicher Reinlichkeitsgrad"},"erforderlicher Reinlichkeitsgrad","necessary degree of cleanliness","Français"]
[{"$f":"INDEX(Table_Language[#This Row],1,Language_select+1)","v":"Hinweis:\n\nausfüllen / Besenrein / Reinraum / etc."},"Hinweis:\n\nausfüllen / Besenrein / Reinraum / etc.","Information:\n\nfill out / swept / clean room / etc.","Français"]
[{"$f":"INDEX(Table_Language[#This Row],1,Language_select+1)","v":"Mindest- / Höchsttemperatur in der Umgebung"},"Mindest- / Höchsttemperatur in der Umgebung","Minimum / maximum temperature in the environment","Français"]
[{"$f":"INDEX(Table_Language[#This Row],1,Language_select+1)","v":"Mindest- / Höchsttemperatur in der Maschine"},"Mindest- / Höchsttemperatur in der Maschine","Minimum / maximum temperature in the machine","Français"]
[{"$f":"INDEX(Table_Language[#This Row],1,Language_select+1)","v":"Hinweis:\n\nz.B. -10°C bis 70°C"},"Hinweis:\n\nz.B. -10°C bis 70°C","Information:\n\ne.g. -10°C to 70°C","Français"]
[{"$f":"INDEX(Table_Language[#This Row],1,Language_select+1)","v":"Betrieb im Innenraum / Freien "},"Betrieb im Innenraum / Freien ","Operation indoors / outdoors","Français"]
[{"$f":"INDEX(Table_Language[#This Row],1,Language_select+1)","v":"Hinweis:\n\nInnenraum / im Freien"},"Hinweis:\n\nInnenraum / im Freien","Information:\n\nindoors / outdoors","Français"]
[{"$f":"INDEX(Table_Language[#This Row],1,Language_select+1)","v":"bei trockener / nasser Witterung"},"bei trockener / nasser Witterung","at dry / wet weather","Français"]
[{"$f":"INDEX(Table_Language[#This Row],1,Language_select+1)","v":"bei direkter / indirekter Sonneneinstrahlung"},"bei direkter / indirekter Sonneneinstrahlung","at direct / indirect sunlight","Français"]
[{"$f":"INDEX(Table_Language[#This Row],1,Language_select+1)","v":"Staub / Nässeverträglich"},"Staub / Nässeverträglich","Tolerance to dust and wet","Français"]
[{"$f":"INDEX(Table_Language[#This Row],1,Language_select+1)","v":"Hinweis:\n\nAngabe IP Schutzklasse / IP Schutzklassen für einzelne Bereiche"},"Hinweis:\n\nAngabe IP Schutzklasse / IP Schutzklassen für einzelne Bereiche","Information:\n\nIP protection class / IP protection class of single parts","Français"]
[{"$f":"INDEX(Table_Language[#This Row],1,Language_select+1)","v":"Unterlieferantenmatrix "},"Unterlieferantenmatrix ","Subcontractors","Français"]
[{"$f":"INDEX(Table_Language[#This Row],1,Language_select+1)","v":"-       Lieferumfang der Hauptbaugruppen (z. B. Maschinenkomponenten, Mechanik, Elektrik, Hydraulik, Pneumatik)"},"-       Lieferumfang der Hauptbaugruppen (z. B. Maschinenkomponenten, Mechanik, Elektrik, Hydraulik, Pneumatik)","delivery of main assembly (e.g. machinery-components, mechanics, electrics, hydraulic, pneumatic) ","Français"]
[{"$f":"INDEX(Table_Language[#This Row],1,Language_select+1)","v":"Lieferant:"},"Lieferant:","Supplier:","Français"]
[{"$f":"INDEX(Table_Language[#This Row],1,Language_select+1)","v":"Mechanik:"},"Mechanik:","Mechanics:","Français"]
[{"$f":"INDEX(Table_Language[#This Row],1,Language_select+1)","v":"·        Stahlbau"},"·        Stahlbau","·        Steelwork","Français"]
[{"$f":"INDEX(Table_Language[#This Row],1,Language_select+1)","v":"·        Ortsfeste Zugänge (Treppen, Leitern, Podeste)"},"·        Ortsfeste Zugänge (Treppen, Leitern, Podeste)","·        stationary access (stairs, ladders, platform)","Français"]
[{"$f":"INDEX(Table_Language[#This Row],1,Language_select+1)","v":"Elektrik:"},"Elektrik:","electrics","Français"]
[{"$f":"INDEX(Table_Language[#This Row],1,Language_select+1)","v":"·        Schaltschrank inkl. SPS "},"·        Schaltschrank inkl. SPS ","·        control box incl. PLC","Français"]
[{"$f":"INDEX(Table_Language[#This Row],1,Language_select+1)","v":"Hydraulik:"},"Hydraulik:","Hydraulic:","Français"]
[{"$f":"INDEX(Table_Language[#This Row],1,Language_select+1)","v":"·        Hydraulikaggregat, Zylinder, Ventile"},"·        Hydraulikaggregat, Zylinder, Ventile","·        Hydraulic unit, cylinder, valve","Français"]
[{"$f":"INDEX(Table_Language[#This Row],1,Language_select+1)","v":"Pneumatik:"},"Pneumatik:","Pneumatic:","Français"]
[{"$f":"INDEX(Table_Language[#This Row],1,Language_select+1)","v":"·        Zylinder, Ventile"},"·        Zylinder, Ventile","·        cylinder, valve","Français"]
[{"$f":"INDEX(Table_Language[#This Row],1,Language_select+1)","v":"Medienanschlüsse:"},"Medienanschlüsse:","Fluid connection:","Français"]
[{"$f":"INDEX(Table_Language[#This Row],1,Language_select+1)","v":"·        Anschlüsse für Kühlwasser, Gase, etc."},"·        Anschlüsse für Kühlwasser, Gase, etc.","·        Connection for cooling water, gas and so on","Français"]
[{"$f":"INDEX(Table_Language[#This Row],1,Language_select+1)","v":"Die folgende Tabelle basiert auf der EN ISO 12100:2010"},"Die folgende Tabelle basiert auf der EN ISO 12100:2010","Basis of the given table is the EN ISO 12100:2010","Français"]
[{"$f":"INDEX(Table_Language[#This Row],1,Language_select+1)","v":"Lebensphasen"},"Lebensphasen","Phase of machine life cycle","Français"]
[{"$f":"INDEX(Table_Language[#This Row],1,Language_select+1)","v":"Aufgabenbeispiele des Bedienungspersonals"},"Aufgabenbeispiele des Bedienungspersonals","Examples of tasks","Français"]
[{"$f":"INDEX(Table_Language[#This Row],1,Language_select+1)","v":"Erforderliche Qualifikation des "},"Erforderliche Qualifikation des ","qualification required for ","Français"]
[{"$f":"INDEX(Table_Language[#This Row],1,Language_select+1)","v":"Bedienungspersonals [i])"},"Bedienungspersonals [i])","Operator  [i])","Français"]
[{"$f":"INDEX(Table_Language[#This Row],1,Language_select+1)","v":"Laie"},"Laie","non-professional operator","Français"]
[{"$f":"INDEX(Table_Language[#This Row],1,Language_select+1)","v":"Geschultes/ unterwiesenes "},"Geschultes/ unterwiesenes ","skilled / trained","Français"]
[{"$f":"INDEX(Table_Language[#This Row],1,Language_select+1)","v":"Personal [ii])"},"Personal [ii])","persons [ii])","Français"]
[{"$f":"INDEX(Table_Language[#This Row],1,Language_select+1)","v":"Fachkraft [iii])"},"Fachkraft [iii])","specialist [iii])","Français"]
[{"$f":"INDEX(Table_Language[#This Row],1,Language_select+1)","v":"1. Transport "},"1. Transport ","1. Transport","Français"]
[{"$f":"INDEX(Table_Language[#This Row],1,Language_select+1)","v":"-     Anheben;"},"-     Anheben;","-     Lifting","Français"]
[{"$f":"INDEX(Table_Language[#This Row],1,Language_select+1)","v":"-     Beladen;"},"-     Beladen;","-     Loading","Français"]
[{"$f":"INDEX(Table_Language[#This Row],1,Language_select+1)","v":"-     Verpacken;"},"-     Verpacken;","-     Packing","Français"]
[{"$f":"INDEX(Table_Language[#This Row],1,Language_select+1)","v":"-     Transportieren;"},"-     Transportieren;","-     Transportation","Français"]
[{"$f":"INDEX(Table_Language[#This Row],1,Language_select+1)","v":"-     Entladen;"},"-     Entladen;","-     Unloading","Français"]
[{"$f":"INDEX(Table_Language[#This Row],1,Language_select+1)","v":"-     Auspacken der Maschine oder von Maschinenteilen"},"-     Auspacken der Maschine oder von Maschinenteilen","-     Unpacking","Français"]
[{"$f":"INDEX(Table_Language[#This Row],1,Language_select+1)","v":"2. Zusammenbau und Installation/ Inbetriebnahme "},"2. Zusammenbau und Installation/ Inbetriebnahme ","2. Assembly and installation","Français"]
[{"$f":"INDEX(Table_Language[#This Row],1,Language_select+1)","v":"-     Einstellungen an der Maschine und deren Bauteilen; "},"-     Einstellungen an der Maschine und deren Bauteilen; ","-     Adjustments of the machine and its components","Français"]
[{"$f":"INDEX(Table_Language[#This Row],1,Language_select+1)","v":"-     Zusammenbau der Maschine; "},"-     Zusammenbau der Maschine; ","-     Assembly of the machine","Français"]
[{"$f":"INDEX(Table_Language[#This Row],1,Language_select+1)","v":"-     Anschluss an die Entsorgungsanlage (z.B. Abluftsystem, Abwasseranlage); "},"-     Anschluss an die Entsorgungsanlage (z.B. Abluftsystem, Abwasseranlage); ","-     Connecting to disposal system (for example, exhaust system, waste water installation)","Français"]
[{"$f":"INDEX(Table_Language[#This Row],1,Language_select+1)","v":"-     Anschluss an die Energieversorgung (z.B. Stromversorgung, Druckluft);"},"-     Anschluss an die Energieversorgung (z.B. Stromversorgung, Druckluft);","-     Connecting to power supply (for example, electric power supply, compressed air)","Français"]
[{"$f":"INDEX(Table_Language[#This Row],1,Language_select+1)","v":"-     Vorführung;"},"-     Vorführung;","-     Demonstration","Français"]
[{"$f":"INDEX(Table_Language[#This Row],1,Language_select+1)","v":"-     Beschicken, Befüllen, Einbringen von Hilfsflüssigkeiten (z.B. Schmierstoff, Fett, Klebstoff); "},"-     Beschicken, Befüllen, Einbringen von Hilfsflüssigkeiten (z.B. Schmierstoff, Fett, Klebstoff); ","-     Feeding, filling, loading of ancillary fluids (for example, lubricant, grease, glue)","Français"]
[{"$f":"INDEX(Table_Language[#This Row],1,Language_select+1)","v":"-     Anbringen von Schutzgittern; "},"-     Anbringen von Schutzgittern; ","-     Fencing","Français"]
[{"$f":"INDEX(Table_Language[#This Row],1,Language_select+1)","v":"-     Befestigen, Verankern; "},"-     Befestigen, Verankern; ","-     Fixing, anchoring","Français"]
[{"$f":"INDEX(Table_Language[#This Row],1,Language_select+1)","v":"-     Vorbereitungen für die Installation (z B. Fundamente, Schwingungsdämpfer);"},"-     Vorbereitungen für die Installation (z B. Fundamente, Schwingungsdämpfer);","-     Preparations for the installation (for example, foundations, vibration isolators)","Français"]
[{"$f":"INDEX(Table_Language[#This Row],1,Language_select+1)","v":"-     Betrieb der Maschine ohne Last; "},"-     Betrieb der Maschine ohne Last; ","-     Running the machine without load","Français"]
[{"$f":"INDEX(Table_Language[#This Row],1,Language_select+1)","v":"-     Prüfung;"},"-     Prüfung;","-     Testing","Français"]
[{"$f":"INDEX(Table_Language[#This Row],1,Language_select+1)","v":"-     Versuche unter Last oder Höchstlast "},"-     Versuche unter Last oder Höchstlast ","-     Trials with load or maximum load","Français"]
[{"$f":"INDEX(Table_Language[#This Row],1,Language_select+1)","v":"3. Verwendung"},"3. Verwendung","3. Usage","Français"]
[{"$f":"INDEX(Table_Language[#This Row],1,Language_select+1)","v":"3a Einrichten/ Einlernen (Teachen)/ Programmieren und/oder Umrüsten"},"3a Einrichten/ Einlernen (Teachen)/ Programmieren und/oder Umrüsten","3a Setting Teaching/programming and/or process changeover","Français"]
[{"$f":"INDEX(Table_Language[#This Row],1,Language_select+1)","v":"-     Einstellen und Einrichten von Schutzeinrichtungen und weiteren Bauteilen;"},"-     Einstellen und Einrichten von Schutzeinrichtungen und weiteren Bauteilen;","-     Adjustment and setting of protective devices and other components","Français"]
[{"$f":"INDEX(Table_Language[#This Row],1,Language_select+1)","v":"-     Einstellen und Einrichten oder Überprüfen der funktionalen Parameter der Maschine (z.B. Geschwindigkeit, Druck, Kraft, Fahrbegrenzungen);"},"-     Einstellen und Einrichten oder Überprüfen der funktionalen Parameter der Maschine (z.B. Geschwindigkeit, Druck, Kraft, Fahrbegrenzungen);","-     Adjustment and setting or verification of functional parameters of the machine (for example, speed, pressure, force, travelling limits)","Français"]
[{"$f":"INDEX(Table_Language[#This Row],1,Language_select+1)","v":"-     Festklemmen/Befestigen des Werkstückes;"},"-     Festklemmen/Befestigen des Werkstückes;","-     Clamping/fastening the workpiece","Français"]
[{"$f":"INDEX(Table_Language[#This Row],1,Language_select+1)","v":"-     Beschicken, Befüllen, Einbringen der Rohstoffe;"},"-     Beschicken, Befüllen, Einbringen der Rohstoffe;","-     Feeding, filling, loading of raw material","Français"]
[{"$f":"INDEX(Table_Language[#This Row],1,Language_select+1)","v":"-     Funktionsprüfungen, Versuche;"},"-     Funktionsprüfungen, Versuche;","-     Functional test, trials","Français"]
[{"$f":"INDEX(Table_Language[#This Row],1,Language_select+1)","v":"-     Einsetzen oder Auswechseln von Werkzeugen, Werkzeugeinstellung;"},"-     Einsetzen oder Auswechseln von Werkzeugen, Werkzeugeinstellung;","-     Mounting or changing tools, tool-setting","Français"]
[{"$f":"INDEX(Table_Language[#This Row],1,Language_select+1)","v":"-     Überprüfen der Programmierung;"},"-     Überprüfen der Programmierung;","-     Programming verification","Français"]
[{"$f":"INDEX(Table_Language[#This Row],1,Language_select+1)","v":"-     Überprüfen des Endproduktes "},"-     Überprüfen des Endproduktes ","-     Verification of the final product","Français"]
[{"$f":"INDEX(Table_Language[#This Row],1,Language_select+1)","v":"3b Betrieb"},"3b Betrieb","3b Operation","Français"]
[{"$f":"INDEX(Table_Language[#This Row],1,Language_select+1)","v":"-     Festklemmen/Befestigen des Werkstückes;"},"-     Festklemmen/Befestigen des Werkstückes;","-     Clamping/fastening the workpiece","Français"]
[{"$f":"INDEX(Table_Language[#This Row],1,Language_select+1)","v":"-     Steuerung/Inspektion;"},"-     Steuerung/Inspektion;","-     Control/inspection","Français"]
[{"$f":"INDEX(Table_Language[#This Row],1,Language_select+1)","v":"-     Antreiben der Maschine;"},"-     Antreiben der Maschine;","-     Driving the machine","Français"]
[{"$f":"INDEX(Table_Language[#This Row],1,Language_select+1)","v":"-     Beschicken, Befüllen, Einbringen der Rohstoffe;"},"-     Beschicken, Befüllen, Einbringen der Rohstoffe;","-     Feeding, filling, loading of raw material","Français"]
[{"$f":"INDEX(Table_Language[#This Row],1,Language_select+1)","v":"-     manuelles Beladen/Entladen;"},"-     manuelles Beladen/Entladen;","-     Manual loading/unloading","Français"]
[{"$f":"INDEX(Table_Language[#This Row],1,Language_select+1)","v":"-     geringfügige Einstellungs- und Einrichtvorgänge bei den Funktionsparametern der Maschine (z.B. Geschwindigkeit, Druck, Kraft, Fahrbegrenzungen);"},"-     geringfügige Einstellungs- und Einrichtvorgänge bei den Funktionsparametern der Maschine (z.B. Geschwindigkeit, Druck, Kraft, Fahrbegrenzungen);","-     Minor adjustments and setting of functional parameters of the machine (for example, speed, pressure, force, travel limits)","Français"]
[{"$f":"INDEX(Table_Language[#This Row],1,Language_select+1)","v":"-     geringfügige Eingriffe während des Betriebs (z.B. Entnahme von Abfallprodukten, Beseitigen von Blockierungen, lokale Reinigung);"},"-     geringfügige Eingriffe während des Betriebs (z.B. Entnahme von Abfallprodukten, Beseitigen von Blockierungen, lokale Reinigung);","-     Minor interventions during operation (for example, removing waste material, eliminating jams, local cleaning)","Français"]
[{"$f":"INDEX(Table_Language[#This Row],1,Language_select+1)","v":"-     Betreiben der manuellen Steuerungseinrichtungen;"},"-     Betreiben der manuellen Steuerungseinrichtungen;","-     Operating manual controls","Français"]
[{"$f":"INDEX(Table_Language[#This Row],1,Language_select+1)","v":"-    Neustarten der Maschine nach Stillsetzen/ Unterbrechung;"},"-    Neustarten der Maschine nach Stillsetzen/ Unterbrechung;","-     Restarting the machine after stopping/interruption","Français"]
[{"$f":"INDEX(Table_Language[#This Row],1,Language_select+1)","v":"-     Überwachen;"},"-     Überwachen;","-     Supervision","Français"]
[{"$f":"INDEX(Table_Language[#This Row],1,Language_select+1)","v":"-     Überprüfen des Endproduktes "},"-     Überprüfen des Endproduktes ","-     Verification of the final product","Français"]
[{"$f":"INDEX(Table_Language[#This Row],1,Language_select+1)","v":"  3c Wartung/ Instandhaltung"},"  3c Wartung/ Instandhaltung","3c Cleaning / Maintenance","Français"]
[{"$f":"INDEX(Table_Language[#This Row],1,Language_select+1)","v":"-     Einstellungen;"},"-     Einstellungen;","-     Adjustments","Français"]
[{"$f":"INDEX(Table_Language[#This Row],1,Language_select+1)","v":"-     Reinigung, Desinfektion;"},"-     Reinigung, Desinfektion;","-     Cleaning, disinfection","Français"]
[{"$f":"INDEX(Table_Language[#This Row],1,Language_select+1)","v":"-     Demontage/Ausbau von Teilen, Bauteilen,"},"-     Demontage/Ausbau von Teilen, Bauteilen,","-     Dismantling/removal of parts, components, devices of the machine","Français"]
[{"$f":"INDEX(Table_Language[#This Row],1,Language_select+1)","v":"-     Einrichtungen der Maschine;"},"-     Einrichtungen der Maschine;","-     Setup of the Machine","Français"]
[{"$f":"INDEX(Table_Language[#This Row],1,Language_select+1)","v":"-     „Housekeeping“;"},"-     „Housekeeping“;","-     Housekeeping","Français"]
[{"$f":"INDEX(Table_Language[#This Row],1,Language_select+1)","v":"-     Energietrennung und -ableitung;"},"-     Energietrennung und -ableitung;","-     Isolation and energy dissipation","Français"]
[{"$f":"INDEX(Table_Language[#This Row],1,Language_select+1)","v":"-     Schmieren;"},"-     Schmieren;","-     Lubrication","Français"]
[{"$f":"INDEX(Table_Language[#This Row],1,Language_select+1)","v":"-     Austausch von Werkzeugen;"},"-     Austausch von Werkzeugen;","-     Replacement of tools","Français"]
[{"$f":"INDEX(Table_Language[#This Row],1,Language_select+1)","v":"-     Austausch von Verschleißteilen;"},"-     Austausch von Verschleißteilen;","-     Replacement of worn parts","Français"]
[{"$f":"INDEX(Table_Language[#This Row],1,Language_select+1)","v":"-     erneutes Einrichten;"},"-     erneutes Einrichten;","-     Resetting","Français"]
[{"$f":"INDEX(Table_Language[#This Row],1,Language_select+1)","v":"-     Nachfüllen von Betriebsflüssigkeiten;"},"-     Nachfüllen von Betriebsflüssigkeiten;","-     Restoring fluid levels","Français"]
[{"$f":"INDEX(Table_Language[#This Row],1,Language_select+1)","v":"-     Überprüfen von Teilen, Bauteilen, Einrichtungen der Maschine "},"-     Überprüfen von Teilen, Bauteilen, Einrichtungen der Maschine ","-     Verification of parts, components, devices of the machine","Français"]
[{"$f":"INDEX(Table_Language[#This Row],1,Language_select+1)","v":"  3d Fehlersuche und Fehlerbeseitigung"},"  3d Fehlersuche und Fehlerbeseitigung","3d Fault-finding/ Troubleshooting","Français"]
[{"$f":"INDEX(Table_Language[#This Row],1,Language_select+1)","v":"-     Einstellungen;"},"-     Einstellungen;","-     Adjustments","Français"]
[{"$f":"INDEX(Table_Language[#This Row],1,Language_select+1)","v":"-     Demontage/Ausbau von Teilen, Bauteilen, Einrichtungen der Maschine;"},"-     Demontage/Ausbau von Teilen, Bauteilen, Einrichtungen der Maschine;","-     Dismantling/removal of parts, components, devices of the machine","Français"]
[{"$f":"INDEX(Table_Language[#This Row],1,Language_select+1)","v":"-     Fehlersuche;"},"-     Fehlersuche;","-     Fault-finding","Français"]
[{"$f":"INDEX(Table_Language[#This Row],1,Language_select+1)","v":"-     Energietrennung und -ableitung;"},"-     Energietrennung und -ableitung;","-     Isolation and energy dissipation","Français"]
[{"$f":"INDEX(Table_Language[#This Row],1,Language_select+1)","v":"-     Wiederanlauf nach Ausfall der Steuerungseinrichtungen und Schutzeinrichtungen;"},"-     Wiederanlauf nach Ausfall der Steuerungseinrichtungen und Schutzeinrichtungen;","-     Recovering from control and protective devices failure","Français"]
[{"$f":"INDEX(Table_Language[#This Row],1,Language_select+1)","v":"-     Wiederanlauf nach Blockierung;"},"-     Wiederanlauf nach Blockierung;","-     Recovering from jam","Français"]
[{"$f":"INDEX(Table_Language[#This Row],1,Language_select+1)","v":"-     Reparaturen;"},"-     Reparaturen;","-     Repairing","Français"]
[{"$f":"INDEX(Table_Language[#This Row],1,Language_select+1)","v":"-     Ersatz von Teilen, Bauteilen, Einrichtungen der Maschine;"},"-     Ersatz von Teilen, Bauteilen, Einrichtungen der Maschine;","-     Replacement of parts, components, devices of the machine","Français"]
[{"$f":"INDEX(Table_Language[#This Row],1,Language_select+1)","v":"-     Rettung gefangener Personen;"},"-     Rettung gefangener Personen;","-     Rescue of trapped persons","Français"]
[{"$f":"INDEX(Table_Language[#This Row],1,Language_select+1)","v":"-     erneutes Einrichten;"},"-     erneutes Einrichten;","-     Resetting","Français"]
[{"$f":"INDEX(Table_Language[#This Row],1,Language_select+1)","v":"-     Überprüfen von Teilen, Bauteilen, Einrichtungen der Maschine "},"-     Überprüfen von Teilen, Bauteilen, Einrichtungen der Maschine ","-     Verification of parts, components, devices of the machine","Français"]
[{"$f":"INDEX(Table_Language[#This Row],1,Language_select+1)","v":"  4.  Außerbetriebnahme/ Demontage"},"  4.  Außerbetriebnahme/ Demontage","4. Dismantling / Disabling","Français"]
[{"$f":"INDEX(Table_Language[#This Row],1,Language_select+1)","v":"-     Abtrennen von der Energieversorgung und Energieableitung;"},"-     Abtrennen von der Energieversorgung und Energieableitung;","-     Disconnection and energy dissipation","Français"]
[{"$f":"INDEX(Table_Language[#This Row],1,Language_select+1)","v":"-     Demontage;"},"-     Demontage;","-     Dismantling","Français"]
[{"$f":"INDEX(Table_Language[#This Row],1,Language_select+1)","v":"-     Anheben;"},"-     Anheben;","-     Lifting","Français"]
[{"$f":"INDEX(Table_Language[#This Row],1,Language_select+1)","v":"-     Beladen;"},"-     Beladen;","-     Loading","Français"]
[{"$f":"INDEX(Table_Language[#This Row],1,Language_select+1)","v":"-     Verpacken;"},"-     Verpacken;","-     Packing","Français"]
[{"$f":"INDEX(Table_Language[#This Row],1,Language_select+1)","v":"-     Transportieren;"},"-     Transportieren;","-     Transportation","Français"]
[{"$f":"INDEX(Table_Language[#This Row],1,Language_select+1)","v":"-     Entladen "},"-     Entladen ","-     Unloading","Français"]
[{"$f":"INDEX(Table_Language[#This Row],1,Language_select+1)","v":"Maschinenrichtlinie 2006/42/EG, Anhang I, Nr. 1.1.1 d: \"Bedienungspersonal\" die Person bzw. die Personen, die für Installation, Betrieb, Einrichten, Wartung, Reinigung, Reparatur oder Transport von Maschinen zuständig sind."},"Maschinenrichtlinie 2006/42/EG, Anhang I, Nr. 1.1.1 d: \"Bedienungspersonal\" die Person bzw. die Personen, die für Installation, Betrieb, Einrichten, Wartung, Reinigung, Reparatur oder Transport von Maschinen zuständig sind.","Machinery Directive, Annex I, No. 1.1.1 d: \"operator\" means the person or persons installing, operating, adjusting, maintaining, cleaning, repairing or moving machinery","Français"]
[{"$f":"INDEX(Table_Language[#This Row],1,Language_select+1)","v":"Analog DIN VDE 0105-100: Als geschulte/unterwiesene Person gilt eine Person, die über die ihr übertragenen Aufgaben und die möglichen Gefahren bei unsachgemäßem Verhalten unterrichtet und erforderlichenfalls angelernt wurde. Auch über die notwendigen Schutzeinrichtungen und Schutzmaßnahmen wurde sie belehrt. Zu schulendes, anzulernendes, einzuweisendes oder im Rahmen einer allgemeinen Ausbildung befindliches Personal darf nur unter ständiger Aufsicht einer erfahrenen Person tätig werden."},"Analog DIN VDE 0105-100: Als geschulte/unterwiesene Person gilt eine Person, die über die ihr übertragenen Aufgaben und die möglichen Gefahren bei unsachgemäßem Verhalten unterrichtet und erforderlichenfalls angelernt wurde. Auch über die notwendigen Schutzeinrichtungen und Schutzmaßnahmen wurde sie belehrt. Zu schulendes, anzulernendes, einzuweisendes oder im Rahmen einer allgemeinen Ausbildung befindliches Personal darf nur unter ständiger Aufsicht einer erfahrenen Person tätig werden.","Analogue DIN VDE 0105-100: Skilled / trained personnel are persons who have been instructed and trained in the duties with which they are entrusted and the risks which may arise from incorrect behaviour. They also have been advised on the necessary protective devices and precautions. Personal which must be trained or instructed or which is in a general training is only allowed to perform under permanent control of a skilled person.","Français"]
[{"$f":"INDEX(Table_Language[#This Row],1,Language_select+1)","v":"Analog DIN VDE 0105-100: Als Fachkraft wird eine Person bezeichnet, die auf Grund ihrer fachlichen Ausbildung, Kenntnisse und Erfahrungen die ihr übertragenen Arbeiten beurteilen und mögliche Gefahren erkennen kann. Weiterhin besitzt sie Kenntnis über die einschlägigen Bestimmungen."},"Analog DIN VDE 0105-100: Als Fachkraft wird eine Person bezeichnet, die auf Grund ihrer fachlichen Ausbildung, Kenntnisse und Erfahrungen die ihr übertragenen Arbeiten beurteilen und mögliche Gefahren erkennen kann. Weiterhin besitzt sie Kenntnis über die einschlägigen Bestimmungen.","Analogue DIN VDE 0105-100: A specialist is a qualified person, which based on professional training, knowledge and experience is able to assess assigned duties and will be aware of possible risks. Furthermore this person knows the relevant regulations.","Français"]
[{"$f":"INDEX(Table_Language[#This Row],1,Language_select+1)","v":"Normenliste"},"Normenliste","List of Standards","Français"]
[{"$f":"INDEX(Table_Language[#This Row],1,Language_select+1)","v":"Aktualisieren"},"Aktualisieren","Refresh","Français"]
[{"$f":"INDEX(Table_Language[#This Row],1,Language_select+1)","v":"Nummer"},"Nummer","Number","Français"]
[{"$f":"INDEX(Table_Language[#This Row],1,Language_select+1)","v":"Titel"},"Titel","Title","Français"]
[{"$f":"INDEX(Table_Language[#This Row],1,Language_select+1)","v":"Version 2.1"},"Version 2.1","Version 2.1","Version 2.1"]
[{"$f":"INDEX(Table_Language[#This Row],1,Language_select+1)","v":"Beurteilen Sie erst, ob eine \"weitere Reduzierung notwendig\" ist."},"Beurteilen Sie erst, ob eine \"weitere Reduzierung notwendig\" ist.","Please asses first, whether \"further reduction of the risk\" is necessary.","Français"]
[{"$f":"INDEX(Table_Language[#This Row],1,Language_select+1)","v":"Bitte erteilen Sie der Gefährdung erst eine Hauptnummer."},"Bitte erteilen Sie der Gefährdung erst eine Hauptnummer.","Please assign a main number to this hazard.","Français"]
[{"$f":"INDEX(Table_Language[#This Row],1,Language_select+1)","v":"Bitte erteilen Sie der Gefährdung erst eine Unternummer."},"Bitte erteilen Sie der Gefährdung erst eine Unternummer.","Please assign a sub number to this hazard.","Français"]
[{"$f":"INDEX(Table_Language[#This Row],1,Language_select+1)","v":"Da eine \"weitere Reduzierung notwendig\" ist, müssen Sie zum Abschließen der Zeile erst eine Folgemaßnahme mit neuer Unternummer (diese Unternummer +1) anlegen."},"Da eine \"weitere Reduzierung notwendig\" ist, müssen Sie zum Abschließen der Zeile erst eine Folgemaßnahme mit neuer Unternummer (diese Unternummer +1) anlegen.","Since a \"further reduction of the risk\" is necessary, you need to create a follow up risk reduction, using the same main number and a new sub number (this lines number +1).","Français"]
[{"$f":"INDEX(Table_Language[#This Row],1,Language_select+1)","v":"Version 2.2"},"Version 2.2","Version 2.2","Version 2.2"]
[{"$f":"INDEX(Table_Language[#This Row],1,Language_select+1)","v":"Achtung:\nHiermit löschen Sie die Historie über alle Einträge im Tabellenblatt.\nMöchten Sie dies durchführen?"},"Achtung:\nHiermit löschen Sie die Historie über alle Einträge im Tabellenblatt.\nMöchten Sie dies durchführen?","Attention:\nHereby you are deleting the history of all entries in this table.\nDo you want to continue?","Français"]
[{"$f":"INDEX(Table_Language[#This Row],1,Language_select+1)","v":"Für diese Zelle existiert noch keine Historie, bzw. die Historie wurde gelöscht."},"Für diese Zelle existiert noch keine Historie, bzw. die Historie wurde gelöscht.","For this cell, no history exists yet, or the history has been deleted.","Français"]
[{"$f":"INDEX(Table_Language[#This Row],1,Language_select+1)","v":"Sicherheitsfunktion (bei steuerungstechnischer Lösung)"},"Sicherheitsfunktion (bei steuerungstechnischer Lösung)","Safety function (if protective measures are applied)","Français"]
[{"$f":"INDEX(Table_Language[#This Row],1,Language_select+1)","v":"SISTEMA-Datei"},"SISTEMA-Datei","SISTEMA-File","Français"]
[{"$f":"INDEX(Table_Language[#This Row],1,Language_select+1)","v":"Risikobeurteilung Log"},"Risikobeurteilung Log","Risk assessment Log","Évaluation des risques Log"]
[{"$f":"INDEX(Table_Language[#This Row],1,Language_select+1)","v":"Aggressive Umgebungsbedingungen"},"Aggressive Umgebungsbedingungen","Aggressive environmental conditions","Français"]
[{"$f":"INDEX(Table_Language[#This Row],1,Language_select+1)","v":"etc."},"etc.","etc.","Français"]
[{"$f":"INDEX(Table_Language[#This Row],1,Language_select+1)","v":"Version 2.2.5"},"Version 2.2.5","Version 2.2.5","Version 2.2.5"]
[{"$f":"INDEX(Table_Language[#This Row],1,Language_select+1)","v":"Hersteller:"},"Hersteller:","Manufacturer:","Français"]
[{"$f":"INDEX(Table_Language[#This Row],1,Language_select+1)","v":"Anschrift des Herstellers:"},"Anschrift des Herstellers:","Address of the manufacturer:","Français"]
[{"$f":"INDEX(Table_Language[#This Row],1,Language_select+1)","v":"Version dieses Gesamtdokuments:"},"Version dieses Gesamtdokuments:","Version of the complete document:","Français"]
[{"$f":"INDEX(Table_Language[#This Row],1,Language_select+1)","v":"Datum der letzten Änderung:"},"Datum der letzten Änderung:","Date of last change:","Français"]
[{"$f":"INDEX(Table_Language[#This Row],1,Language_select+1)","v":"Version 2.3.4.2"},"Version 2.3.4.2","Version 2.3.4.2","Version 2.3.4.2"]
[{"$f":"INDEX(Table_Language[#This Row],1,Language_select+1)","v":"Verifikations-/ Validierungsdatei"},"Verifikations-/ Validierungsdatei","Verification-/ Validationfile","Français"]
[{"$f":"INDEX(Table_Language[#This Row],1,Language_select+1)","v":"Version 2.4"},"Version 2.4","Version 2.4","Version 2.4"]
[{"$f":"INDEX(Table_Language[#This Row],1,Language_select+1)","v":"W"},"W","O","O"]
[{"$f":"INDEX(Table_Language[#This Row],1,Language_select+1)","v":"W"},"W","O","O"]
[{"$f":"INDEX(Table_Language[#This Row],1,Language_select+1)","v":"Einstellungen"},"Einstellungen","Setup","Configuration"]
[{"$f":"INDEX(Table_Language[#This Row],1,Language_select+1)","v":"Achtung:\nNach Anhang I \"Allgemeine Grundsätze\" Nr. 2 gilt:\n\nFür Maschinen gelten die in \n   Nummer 1.1.2 aufgeführten Grundsätze für die Integration der Sicherheit sowie die in den \n   Nummern 1.7.3 und 1.7.4 aufgeführten Verpflichtungen in Bezug auf die Kennzeichnung der Maschine und die Betriebsanleitung auf jeden Fall."},"Achtung:\nNach Anhang I \"Allgemeine Grundsätze\" Nr. 2 gilt:\n\nFür Maschinen gelten die in \n   Nummer 1.1.2 aufgeführten Grundsätze für die Integration der Sicherheit sowie die in den \n   Nummern 1.7.3 und 1.7.4 aufgeführten Verpflichtungen in Bezug auf die Kennzeichnung der Maschine und die Betriebsanleitung auf jeden Fall.","Attention:\nAccording to Annex I \"General Principles\" No 2:\n\nFor machinery in any event, the principles of safety integration referred to in \n   section 1.1.2 \nand the obligations concerning marking of machinery and instructions referred to in \n   sections 1.7.3 and 1.7.4 \napply.","Attention:\nConformément à Annexe I \"Principes Généraux\" No 2:\n\nAux machine, en tout état de cause, les principes d'intégration de la sécurité visés section 1.1.2 et les obligations concernant le marquage des machines et la notice d'instructions visées sections 1.7.3 et 1.7.4 s'appliquent."]
[{"$f":"INDEX(Table_Language[#This Row],1,Language_select+1)","v":"Abbrechen"},"Abbrechen","cancel","annuler"]
[{"$f":"INDEX(Table_Language[#This Row],1,Language_select+1)","v":"Übernehmen"},"Übernehmen","apply","accepter"]
[{"$f":"INDEX(Table_Language[#This Row],1,Language_select+1)","v":"Sprache"},"Sprache","language","langue"]
[{"$f":"INDEX(Table_Language[#This Row],1,Language_select+1)","v":"Allgemein"},"Allgemein","general","général"]
[{"$f":"INDEX(Table_Language[#This Row],1,Language_select+1)","v":"sichtbare Spalten"},"sichtbare Spalten","visible columns","visible colonne"]
[{"$f":"INDEX(Table_Language[#This Row],1,Language_select+1)","v":"Log löschen"},"Log löschen","delete log","purger log"]
[{"$f":"INDEX(Table_Language[#This Row],1,Language_select+1)","v":"Baujahr:"},"Baujahr:","year of construction:","Français"]
[{"$f":"INDEX(Table_Language[#This Row],1,Language_select+1)","v":"Version 2.4.1 alpha"},"Version 2.4.1 alpha","Version 2.4.1 alpha","Version 2.4.1 alpha"]
[{"$f":"INDEX(Table_Language[#This Row],1,Language_select+1)","v":"Sprache der Zeile"},"Sprache der Zeile","Language of row","Français"]
[{"$f":"INDEX(Table_Language[#This Row],1,Language_select+1)","v":"Version 2.5 (Druckversion)"},"Version 2.5 (Druckversion)","Version 2.5 (Print version)","Version 2.5"]
[{"$f":"INDEX(Table_Language[#This Row],1,Language_select+1)","v":"Word-Datei der Risikobeurteilung erstellen"},"Word-Datei der Risikobeurteilung erstellen","Create Word file from risk assessment","Français"]
[{"$f":"INDEX(Table_Language[#This Row],1,Language_select+1)","v":"Gefährdung ist von der Norm abgedeckt?"},"Gefährdung ist von der Norm abgedeckt?","Hazard is covered by the standard?","Français"]
[{"$f":"INDEX(Table_Language[#This Row],1,Language_select+1)","v":"Alle"},"Alle","All","Français"]
[{"$f":"INDEX(Table_Language[#This Row],1,Language_select+1)","v":"Transport"},"Transport","Transport","Français"]
[{"$f":"INDEX(Table_Language[#This Row],1,Language_select+1)","v":"Montage und Installation, Inbetriebnahme"},"Montage und Installation, Inbetriebnahme","Assembly and installation, Commissioning","Français"]
[{"$f":"INDEX(Table_Language[#This Row],1,Language_select+1)","v":"Einrichten, Einlernen (Teachen)/ Programmieren und/oder Umrüsten"},"Einrichten, Einlernen (Teachen)/ Programmieren und/oder Umrüsten","Setting, Teaching/programming and/or process changeover","Français"]
[{"$f":"INDEX(Table_Language[#This Row],1,Language_select+1)","v":"Betrieb"},"Betrieb","Operation","Français"]
[{"$f":"INDEX(Table_Language[#This Row],1,Language_select+1)","v":"Reinigung, Instandhaltung"},"Reinigung, Instandhaltung","Cleaning, Maintenance","Français"]
[{"$f":"INDEX(Table_Language[#This Row],1,Language_select+1)","v":"Fehlersuche und -beseitigung"},"Fehlersuche und -beseitigung","Fault-finding/Troubleshooting","Français"]
[{"$f":"INDEX(Table_Language[#This Row],1,Language_select+1)","v":"Demontage, Außer Betrieb nehmen"},"Demontage, Außer Betrieb nehmen","Dismantling, Disabling","Français"]
[{"$f":"INDEX(Table_Language[#This Row],1,Language_select+1)","v":"trifft zu"},"trifft zu","applies","Français"]
[{"$f":"INDEX(Table_Language[#This Row],1,Language_select+1)","v":"muss noch entschieden werden"},"muss noch entschieden werden","to be decided","Français"]
[{"$f":"INDEX(Table_Language[#This Row],1,Language_select+1)","v":"Inhalt ist abgedeckt / erledigt"},"Inhalt ist abgedeckt / erledigt","content is covered / done","Français"]
[{"$f":"INDEX(Table_Language[#This Row],1,Language_select+1)","v":"muss weiter behandelt werden"},"muss weiter behandelt werden","must be further considered in EHSR","Français"]
[{"$f":"INDEX(Table_Language[#This Row],1,Language_select+1)","v":"keine weitere Reduzierung notwendig"},"keine weitere Reduzierung notwendig","no further reduction necessary","Français"]
[{"$f":"INDEX(Table_Language[#This Row],1,Language_select+1)","v":"BITTE ANGABEN MACHEN!"},"BITTE ANGABEN MACHEN!","PLEASE PROVIDE INFORMATION!","Français"]
[{"$f":"INDEX(Table_Language[#This Row],1,Language_select+1)","v":"behandelt / betrachtet, GSA-Punkt ist fertig"},"behandelt / betrachtet, GSA-Punkt ist fertig","covered / EHSR is finished","Français"]
[{"$f":"INDEX(Table_Language[#This Row],1,Language_select+1)","v":"Nicht behandelt / betrachtet, GSA-Punkt muss noch bearbeitet werden"},"Nicht behandelt / betrachtet, GSA-Punkt muss noch bearbeitet werden","not completely covered, more work needed at this EHSR","Français"]
[{"$f":"INDEX(Table_Language[#This Row],1,Language_select+1)","v":"Risikoeinschätzung vor Risikominimierung:"},"Risikoeinschätzung vor Risikominimierung:","Risk Estimation before Risk Reduction","Français"]
[{"$f":"INDEX(Table_Language[#This Row],1,Language_select+1)","v":"Schwere der Verletzung (S)"},"Schwere der Verletzung (S)","severity of injury (S)","Français"]
[{"$f":"INDEX(Table_Language[#This Row],1,Language_select+1)","v":"Häufigkeit (F)"},"Häufigkeit (F)","frequency (F)","Français"]
[{"$f":"INDEX(Table_Language[#This Row],1,Language_select+1)","v":"Möglichkeit der Vermeidung (P)"},"Möglichkeit der Vermeidung (P)","possibility of avoiding (P)","Français"]
[{"$f":"INDEX(Table_Language[#This Row],1,Language_select+1)","v":"Wahrscheinlichkeit (W)"},"Wahrscheinlichkeit (W)","probability of occurrence (O)","Français"]
[{"$f":"INDEX(Table_Language[#This Row],1,Language_select+1)","v":"Schutzmaßnahme"},"Schutzmaßnahme","protective measure","Français"]
[{"$f":"INDEX(Table_Language[#This Row],1,Language_select+1)","v":"Risikoeinschätzung nach Risikominimierung:"},"Risikoeinschätzung nach Risikominimierung:","Risk Estimation after Risk Reduction","Français"]
[{"$f":"INDEX(Table_Language[#This Row],1,Language_select+1)","v":"1 – Startpunkt der Risikobewertung\nL – niedriges Risiko\nH – hohes Risiko\nPLr – erforderlicher Performance Level\n\nS – Schwere der Verletzung S1 und S2\nS1 – leicht (üblicherweise reversible Verletzung)\nS2 – ernst (üblicherweise irreversible Verletzung einschließlich Tod)\n\nF – Häufigkeit und/oder Dauer der Gefährdungsexposition F1 und F2\nF1 – selten bis weniger häufig und/oder die Dauer der Gefährdungsexposition ist kurz\nF2 – häufig bis dauernd und/oder die Dauer der Gefährdungsexposition ist lang\n\nP – Möglichkeit zur Vermeidung der Gefährdung P1 und P2\nP1 – möglich unter bestimmten Bedingungen,\nP2 – kaum möglich\n\nW – Eintrittswahrscheinlichkeit eines Gefährdungsereignisses\nW1 – unwahrscheinlich (mit Begründung im Kommentar!)\nW2 – normale Wahrscheinlichkeit"},"1 – Startpunkt der Risikobewertung\nL – niedriges Risiko\nH – hohes Risiko\nPLr – erforderlicher Performance Level\n\nS – Schwere der Verletzung S1 und S2\nS1 – leicht (üblicherweise reversible Verletzung)\nS2 – ernst (üblicherweise irreversible Verletzung einschließlich Tod)\n\nF – Häufigkeit und/oder Dauer der Gefährdungsexposition F1 und F2\nF1 – selten bis weniger häufig und/oder die Dauer der Gefährdungsexposition ist kurz\nF2 – häufig bis dauernd und/oder die Dauer der Gefährdungsexposition ist lang\n\nP – Möglichkeit zur Vermeidung der Gefährdung P1 und P2\nP1 – möglich unter bestimmten Bedingungen,\nP2 – kaum möglich\n\nW – Eintrittswahrscheinlichkeit eines Gefährdungsereignisses\nW1 – unwahrscheinlich (mit Begründung im Kommentar!)\nW2 – normale Wahrscheinlichkeit","1 – starting point for evaluation of safety function’s contribution to risk reduction\nL – low contribution to risk reduction\nH – high contribution to risk reduction\nPLr – required performance level\n\nS – severity of injury\nS1 – slight (normally reversible injury)\nS2 – serious (normally irreversible injury or death)\n\nF – frequency and/or exposure to hazard\nF1 – seldom-to-less-often and/or exposure time is short\nF2 – frequent-to-continuous and/or exposure time is long\n\nP – possibility of avoiding hazard or limiting harm\nP1 – possible under specific conditions\nP2 – scarcely possible\n\nW – (O) probability of occurrence of a hazardous event\nW1 – (O1) low (with justification in commentary!)\nW2 – (O2) normal","Français"]
[{"$f":"INDEX(Table_Language[#This Row],1,Language_select+1)","v":"Version 2.5 (Änderungen in Blatt 1)"},"Version 2.5 (Änderungen in Blatt 1)","Version 2.5 (changes in part 1)","Version 2.5"]
[{"$f":"INDEX(Table_Language[#This Row],1,Language_select+1)","v":"bitte auswählen"},"bitte auswählen","please select","Français"]
[{"$f":"INDEX(Table_Language[#This Row],1,Language_select+1)","v":"Anhang VIII - Bewertung der Konformität mit interner Fertigungskontrolle"},"Anhang VIII - Bewertung der Konformität mit interner Fertigungskontrolle","Annex VIII - Assessment of conformity with internal checks on the manufacture of machinery","Français"]
[{"$f":"INDEX(Table_Language[#This Row],1,Language_select+1)","v":"Anhang IX - EG-Baumusterprüfung"},"Anhang IX - EG-Baumusterprüfung","Annex IX - EC type-examination","Français"]
[{"$f":"INDEX(Table_Language[#This Row],1,Language_select+1)","v":"Anhang X - Umfassende Qualitätssicherung"},"Anhang X - Umfassende Qualitätssicherung","Annex X - Full quality assurance","Français"]
[{"$f":"INDEX(Table_Language[#This Row],1,Language_select+1)","v":"Anhang VIII und IX"},"Anhang VIII und IX","Annex VIII and IX","Français"]
[{"$f":"INDEX(Table_Language[#This Row],1,Language_select+1)","v":"Anhang VIII und X"},"Anhang VIII und X","Annex VIII and X","Français"]
[{"$f":"INDEX(Table_Language[#This Row],1,Language_select+1)","v":"Anhang IX und X"},"Anhang IX und X","Annex IX and X","Français"]
[{"$f":"INDEX(Table_Language[#This Row],1,Language_select+1)","v":"Anhang VIII, IX und X"},"Anhang VIII, IX und X","Annex VIII, IX und X","Français"]
[{"$f":"INDEX(Table_Language[#This Row],1,Language_select+1)","v":"bitte auswählen"},"bitte auswählen","please select","Français"]
[{"$f":"INDEX(Table_Language[#This Row],1,Language_select+1)","v":"Privat"},"Privat","privately","Français"]
[{"$f":"INDEX(Table_Language[#This Row],1,Language_select+1)","v":"Gewerblich, industrieller Einsatz"},"Gewerblich, industrieller Einsatz","Commercial, industrial application","Français"]
[{"$f":"INDEX(Table_Language[#This Row],1,Language_select+1)","v":"Privat und gewerblich, industrieller Einsatz"},"Privat und gewerblich, industrieller Einsatz","privately and commercial, industrial application","Français"]
[{"$f":"INDEX(Table_Language[#This Row],1,Language_select+1)","v":"Risikobeurteilung erstellen"},"Risikobeurteilung erstellen","Create Riskassessment","Français"]
[{"$f":"INDEX(Table_Language[#This Row],1,Language_select+1)","v":"Sind Sie sicher, dass Sie den Druck starten möchten? Dies dauert erfahrungsgemäß einige Zeit.\nACHTUNG: Nur sichtbare Zeilen im Blatt \"Risikobeurteilung\" werden gedruckt."},"Sind Sie sicher, dass Sie den Druck starten möchten? Dies dauert erfahrungsgemäß einige Zeit.\nACHTUNG: Nur sichtbare Zeilen im Blatt \"Risikobeurteilung\" werden gedruckt.","Are you sure you want to start printing? This takes some time.\nATTENTION: Only visible lines in \"Risk Assessment\" will be printed.","Français"]
[{"$f":"INDEX(Table_Language[#This Row],1,Language_select+1)","v":"Word-Vorlage wurde nicht gefunden. Bitte kopieren Sie die dotm Datei in das Verzeichnis, in dem auch diese Risikobeurteilung liegt. Gesuchte Vorlage: "},"Word-Vorlage wurde nicht gefunden. Bitte kopieren Sie die dotm Datei in das Verzeichnis, in dem auch diese Risikobeurteilung liegt. Gesuchte Vorlage: ","Word template was not found. Please copy the file into the same directory as your risk assessment. Searching for file: ","Français"]
[{"$f":"INDEX(Table_Language[#This Row],1,Language_select+1)","v":"Eine Textmarke wurde in der Word-Berichtsvorlage nicht gefunden. Bitte prüfen Sie die Berichtsvorlage. Die Berichtserstellung wird abgebrochen."},"Eine Textmarke wurde in der Word-Berichtsvorlage nicht gefunden. Bitte prüfen Sie die Berichtsvorlage. Die Berichtserstellung wird abgebrochen.","A Bookmark is missing from the template. Please check your template. Printing has been cancelled.","Français"]
[{"$f":"INDEX(Table_Language[#This Row],1,Language_select+1)","v":"Report wurde erstellt.\nDie Worddatei finden Sie in Ihrer Taskleiste."},"Report wurde erstellt.\nDie Worddatei finden Sie in Ihrer Taskleiste.","Report is finished.\nYou can find the file in your taskbar.","Français"]
[{"$f":"INDEX(Table_Language[#This Row],1,Language_select+1)","v":"Version 2.5 (sonstiges)"},"Version 2.5 (sonstiges)","Version 2.5 (rest)","Version 2.5"]
[{"$f":"INDEX(Table_Language[#This Row],1,Language_select+1)","v":"bedingte Formatierung zurücksetzen"},"bedingte Formatierung zurücksetzen","reset conditional formats","Français"]
[{"$f":"INDEX(Table_Language[#This Row],1,Language_select+1)","v":"Version 2.5.2 (Fehlermeldung)"},"Version 2.5.2 (Fehlermeldung)","Version 2.5.2 (Error message)","Version 2.5.2"]
[{"$f":"INDEX(Table_Language[#This Row],1,Language_select+1)","v":"ACHTUNG:\nSie haben die Word-Vorlage noch nie per Hand geöffnet.\nMicrosoft verhindert dann hier das öffnen von Dateien aus dem Internet.\nBitte öffnen Sie die Datei einmal vorher in Word. (Word starten, dann \"Datei\" --> \"Öffnen\" --> Datei auswählen)\nDanach klicken Sie auf \"Bearbeitung aktivieren\" und schließen die Datei.\nDie Datei per Doppelklick zu öffnen könnte nicht ausreichen.\nDatei: "},"ACHTUNG:\nSie haben die Word-Vorlage noch nie per Hand geöffnet.\nMicrosoft verhindert dann hier das öffnen von Dateien aus dem Internet.\nBitte öffnen Sie die Datei einmal vorher in Word. (Word starten, dann \"Datei\" --> \"Öffnen\" --> Datei auswählen)\nDanach klicken Sie auf \"Bearbeitung aktivieren\" und schließen die Datei.\nDie Datei per Doppelklick zu öffnen könnte nicht ausreichen.\nDatei: ","ATTENTION:\nYou have not yet opened the downloaded Word file manually.\nMicrosoft will not open a file containing macros without your permission.\nPlease start Word and go to \"file\" --> \"open\" --> select file.\nAfterwards click on \"Enable Editing\" and close the file.\nDouble clicking the .DOTM File might not work.\nFile: ","Français"]
[{"$f":"INDEX(Table_Language[#This Row],1,Language_select+1)","v":"Fehler in Sub RB_Report"},"Fehler in Sub RB_Report","Error in Sub RB_Report","Français"]
[{"$f":"INDEX(Table_Language[#This Row],1,Language_select+1)","v":"\nFehlernummer: "},"\nFehlernummer: ","\nError Number: ","Français"]
[{"$f":"INDEX(Table_Language[#This Row],1,Language_select+1)","v":"\nFehlerbeschreibung: "},"\nFehlerbeschreibung: ","\nError Description: ","Français"]
[{"$f":"INDEX(Table_Language[#This Row],1,Language_select+1)","v":"Version 2.5.3 (Druck-Statusbar)"},"Version 2.5.3 (Druck-Statusbar)","Version 2.5.3 (Printing Statusbar)","Version 2.5.3"]
[{"$f":"INDEX(Table_Language[#This Row],1,Language_select+1)","v":"Ausdruck wird erstellt"},"Ausdruck wird erstellt","Printing in progress","Français"]
[{"$f":"INDEX(Table_Language[#This Row],1,Language_select+1)","v":"Projektdaten Items gedruckt:"},"Projektdaten Items gedruckt:","Project Data Items printed:","Français"]
[{"$f":"INDEX(Table_Language[#This Row],1,Language_select+1)","v":"Projektdaten Items insgesammt:"},"Projektdaten Items insgesammt:","Project Data Items to be printed:","Français"]
[{"$f":"INDEX(Table_Language[#This Row],1,Language_select+1)","v":"Risikobeurteilungspunkte gedruckt:"},"Risikobeurteilungspunkte gedruckt:","Lines printed:","Français"]
[{"$f":"INDEX(Table_Language[#This Row],1,Language_select+1)","v":"Risikobeurteilungspunkte insgesammt:"},"Risikobeurteilungspunkte insgesammt:","Lines to be printed:","Français"]
[{"$f":"INDEX(Table_Language[#This Row],1,Language_select+1)","v":"Bitte warten Sie, während der Ausdruck erstellt wird…"},"Bitte warten Sie, während der Ausdruck erstellt wird…","Please be patient during printing…","Français"]
[{"$f":"INDEX(Table_Language[#This Row],1,Language_select+1)","v":"Version 2.5.5"},"Version 2.5.5","Version 2.5.5","Version 2.5.5"]
[{"$f":"INDEX(Table_Language[#This Row],1,Language_select+1)","v":"Importiere Projektdaten, Risikobeurteilung und Eigene Normen"},"Importiere Projektdaten, Risikobeurteilung und Eigene Normen","Import Project data, Risk assessment and Own standards","Français"]
[{"$f":"INDEX(Table_Language[#This Row],1,Language_select+1)","v":"Ordner"},"Ordner","Folder","Français"]
[{"$f":"INDEX(Table_Language[#This Row],1,Language_select+1)","v":"Datei"},"Datei","File","Français"]
[{"$f":"INDEX(Table_Language[#This Row],1,Language_select+1)","v":"Auswählen"},"Auswählen","Select","Français"]
[{"$f":"INDEX(Table_Language[#This Row],1,Language_select+1)","v":"Importieren"},"Importieren","Import","Français"]
[{"$f":"INDEX(Table_Language[#This Row],1,Language_select+1)","v":"Version 2.5.6.2"},"Version 2.5.6.2","Version 2.5.6.2","Version 2.5.6.2"]
[{"$f":"INDEX(Table_Language[#This Row],1,Language_select+1)","v":"mehr verfügbar, Liste voll"},"mehr verfügbar, Liste voll","more available, list full","Français"]
[{"$f":"INDEX(Table_Language[#This Row],1,Language_select+1)","v":"Version 2.5.6.4"},"Version 2.5.6.4","Version 2.5.6.4","Version 2.5.6.4"]
[{"$f":"INDEX(Table_Language[#This Row],1,Language_select+1)","v":"Links auf alte Version löschen"},"Links auf alte Version löschen","delete links pointing to old version","Français"]
[{"$f":"INDEX(Table_Language[#This Row],1,Language_select+1)","v":"Version 2.5.6.5"},"Version 2.5.6.5","Version 2.5.6.5","Version 2.5.6.5"]
[{"$f":"INDEX(Table_Language[#This Row],1,Language_select+1)","v":"Gefährdungsereignis (Gefährdung / Gefährdungssituation)"},"Gefährdungsereignis (Gefährdung / Gefährdungssituation)","hazardous event (hazard / hazardous situation)","événement dangereux"]
[{"$f":"INDEX(Table_Language[#This Row],1,Language_select+1)","v":"mögliche Folgen"},"mögliche Folgen","potential consequences","Français"]
[{"$f":"INDEX(Table_Language[#This Row],1,Language_select+1)","v":"Version 2.6"},"Version 2.6","Version 2.6","Version 2.6"]
[{"$f":"INDEX(Table_Language[#This Row],1,Language_select+1)","v":"Richtlinie"},"Richtlinie","Directive","Français"]
[{"$f":"INDEX(Table_Language[#This Row],1,Language_select+1)","v":"Ist leere Überschrift"},"Ist leere Überschrift","is empty headline","Français"]
[{"$f":"INDEX(Table_Language[#This Row],1,Language_select+1)","v":"Alle auswählen"},"Alle auswählen","select all","Français"]
[{"$f":"INDEX(Table_Language[#This Row],1,Language_select+1)","v":"Keinen auswählen"},"Keinen auswählen","select none","Français"]
[{"$f":"INDEX(Table_Language[#This Row],1,Language_select+1)","v":0},null,null,"Français"]
[{"$f":"INDEX(Table_Language[#This Row],1,Language_select+1)","v":0},null,null,"Français"]
[{"$f":"INDEX(Table_Language[#This Row],1,Language_select+1)","v":0},null,null,"Français"]
[{"$f":"INDEX(Table_Language[#This Row],1,Language_select+1)","v":0},null,null,"Français"]
[{"$f":"INDEX(Table_Language[#This Row],1,Language_select+1)","v":0},null,null,"Français"]
[{"$f":"INDEX(Table_Language[#This Row],1,Language_select+1)","v":0},null,null,"Français"]
[{"$f":"INDEX(Table_Language[#This Row],1,Language_select+1)","v":0},null,null,"Français"]
[{"$f":"INDEX(Table_Language[#This Row],1,Language_select+1)","v":0},null,null,"Français"]
[{"$f":"INDEX(Table_Language[#This Row],1,Language_select+1)","v":0},null,null,"Français"]
[{"$f":"INDEX(Table_Language[#This Row],1,Language_select+1)","v":0},null,null,"Français"]
[{"$f":"INDEX(Table_Language[#This Row],1,Language_select+1)","v":0},null,null,"Français"]
[{"$f":"INDEX(Table_Language[#This Row],1,Language_select+1)","v":0},null,null,"Français"]
[{"$f":"INDEX(Table_Language[#This Row],1,Language_select+1)","v":0},null,null,"Français"]

{"sheet":"Eigene Zellen","index":6,"n_rows":6,"n_cols":4,"rows_kept":6,"cut":false,"hidden":false,"merged":[]}
["1","Deutsch","English","Français"]
[{"$f":"INDEX(Table_OwnEntries[#This Row],1,Language_select+1)","v":"Blatt Risikobeurteilung"},"Blatt Risikobeurteilung","Sheet Risk Assessment","Évaluation des risques "]
[{"$f":"INDEX(Table_OwnEntries[#This Row],1,Language_select+1)","v":"Eigener Eintrag"},"Eigener Eintrag","Own entry","Propre élément"]
[{"$f":"INDEX(Table_OwnEntries[#This Row],1,Language_select+1)","v":"Eigener Eintrag"},"Eigener Eintrag","Own entry","Propre élément"]
[{"$f":"INDEX(Table_OwnEntries[#This Row],1,Language_select+1)","v":"Projektdaten"},"Projektdaten","Project data","Données projet"]
[{"$f":"INDEX(Table_OwnEntries[#This Row],1,Language_select+1)","v":"Eigener Eintrag"},"Eigener Eintrag","Own entry","Propre élément"]

{"sheet":"Version","index":7,"n_rows":4,"n_cols":3,"rows_kept":4,"cut":false,"hidden":false,"merged":[]}
["Version","Deutsch","English"]
["2.6.0.2","Anleitung auf www.maschinenrichtlinie.de","Instructions of use at www.maschinenrichtlinie.com"]
[null,"MBT Risikobeurteilung nach maschinenrichtlinie.de\n© MBT Mechtersheimer GbR\nVersion ","MBT Risk assessment based on maschinenrichtlinie.com\n© MBT Mechtersheimer GbR\nVersion "]
[null,"Lizenz:\nCC BY 3.0 DE\nNamensnennung 3.0 Deutschland","License:\nCC BY 3.0 DE\nNamensnennung 3.0 Deutschland"]

{"sheet":"EHSR","index":8,"n_rows":184,"n_cols":5,"rows_kept":184,"cut":false,"hidden":false,"merged":[[0,3,2,3],[1,0,2,0],[1,1,1,2]]}
[null,null,null,{"$f":"Sprache!A535","v":"Ist leere Überschrift"}]
[{"$f":"Sprache!A534","v":"Richtlinie"},{"$f":"Sprache!A6","v":"grundlegende Sicherheits- und Gesundheitsschutzanforderungen"}]
[null,{"$f":"Sprache!A7","v":"Nr."},{"$f":"Sprache!A8","v":"Bezeichnung"}]
["Richtlinie","Nr.","Bezeichnung","Leere Überschrift","Link"]
["2006 / 42","1.1.",{"$f":"Sprache!A$83","v":"Allgemeines"},"x"]
["2006 / 42","1.1.2.",{"$f":"Sprache!A$84","v":"Grundsätze für die Integration der Sicherheit"},"","http://www.maschinenrichtlinie.de/maschinenrichtlinie/neue-mrl-2006-42-eg/sicherheits-anforderungen/fuer-alle-maschinen/integration-der-sicherheit/"]
["2006 / 42","1.1.3.",{"$f":"Sprache!A$85","v":"Materialien und Produkte"},"","http://www.maschinenrichtlinie.de/maschinenrichtlinie/neue-mrl-2006-42-eg/sicherheits-anforderungen/fuer-alle-maschinen/materialien-produkte/"]
["2006 / 42","1.1.4.",{"$f":"Sprache!A$86","v":"Beleuchtung"},"","http://www.maschinenrichtlinie.de/maschinenrichtlinie/neue-mrl-2006-42-eg/sicherheits-anforderungen/fuer-alle-maschinen/beleuchtung/"]
["2006 / 42","1.1.5.",{"$f":"Sprache!A$87","v":"Konstruktion der Maschine im Hinblick auf die Handhabung"},"","http://www.maschinenrichtlinie.de/maschinenrichtlinie/neue-mrl-2006-42-eg/sicherheits-anforderungen/fuer-alle-maschinen/115-konstruktion/"]
["2006 / 42","1.1.6.",{"$f":"Sprache!A$88","v":"Ergonomie"},"","http://www.maschinenrichtlinie.de/maschinenrichtlinie/neue-mrl-2006-42-eg/sicherheits-anforderungen/fuer-alle-maschinen/116-ergonomie/"]
["2006 / 42","1.1.7.",{"$f":"Sprache!A$89","v":"Bedienungsplätze"},"","http://www.maschinenrichtlinie.de/maschinenrichtlinie/neue-mrl-2006-42-eg/sicherheits-anforderungen/fuer-alle-maschinen/117-bedienungsplaetze/"]
["2006 / 42","1.1.8.",{"$f":"Sprache!A$90","v":"Sitze"},"","http://www.maschinenrichtlinie.de/maschinenrichtlinie/neue-mrl-2006-42-eg/sicherheits-anforderungen/fuer-alle-maschinen/118-sitze/"]
["2006 / 42","1.2.",{"$f":"Sprache!A$91","v":"Steuerungen und Befehlseinrichtungen"},"x","http://www.maschinenrichtlinie.de/maschinenrichtlinie/neue-mrl-2006-42-eg/sicherheits-anforderungen/fuer-alle-maschinen/steuerungen-befehlseinrichtung/"]
["2006 / 42","1.2.1.",{"$f":"Sprache!A$92","v":"Sicherheit und Zuverlässigkeit von Steuerungen "},"","http://www.maschinenrichtlinie.de/maschinenrichtlinie/neue-mrl-2006-42-eg/sicherheits-anforderungen/fuer-alle-maschinen/121-steuerungen/"]
["2006 / 42","1.2.2.",{"$f":"Sprache!A$93","v":"Stellteile "},"","http://www.maschinenrichtlinie.de/maschinenrichtlinie/neue-mrl-2006-42-eg/sicherheits-anforderungen/fuer-alle-maschinen/122-stellteile/"]
["2006 / 42","1.2.3.",{"$f":"Sprache!A$94","v":"Ingangsetzen "},"","http://www.maschinenrichtlinie.de/maschinenrichtlinie/neue-mrl-2006-42-eg/sicherheits-anforderungen/fuer-alle-maschinen/123-ingangsetzen/"]
["2006 / 42","1.2.4.",{"$f":"Sprache!A$95","v":"Stillsetzen "},"x"]
["2006 / 42","1.2.4.1.",{"$f":"Sprache!A$96","v":"Normales Stillsetzen "},"","http://www.maschinenrichtlinie.de/maschinenrichtlinie/neue-mrl-2006-42-eg/sicherheits-anforderungen/fuer-alle-maschinen/1241-normales-stillsetzen/"]
["2006 / 42","1.2.4.2.",{"$f":"Sprache!A$97","v":"Betriebsbedingtes Stillsetzen "},"","http://www.maschinenrichtlinie.de/maschinenrichtlinie/neue-mrl-2006-42-eg/sicherheits-anforderungen/fuer-alle-maschinen/betriebsbedingtes-stillsetzen/"]
["2006 / 42","1.2.4.3.",{"$f":"Sprache!A$98","v":"Stillsetzen im Notfall "},"","http://www.maschinenrichtlinie.de/maschinenrichtlinie/neue-mrl-2006-42-eg/sicherheits-anforderungen/fuer-alle-maschinen/stillsetzen-im-notfall/"]
["2006 / 42","1.2.4.4.",{"$f":"Sprache!A$99","v":"Gesamtheit von Maschinen "},"","http://www.maschinenrichtlinie.de/maschinenrichtlinie/neue-mrl-2006-42-eg/sicherheits-anforderungen/fuer-alle-maschinen/gesamtheit-von-maschinen/"]
["2006 / 42","1.2.5.",{"$f":"Sprache!A$100","v":"Wahl der Steuerungs- oder Betriebsarten "},"","http://www.maschinenrichtlinie.de/maschinenrichtlinie/neue-mrl-2006-42-eg/sicherheits-anforderungen/fuer-alle-maschinen/betriebsartenwahlschalter/"]
["2006 / 42","1.2.6.",{"$f":"Sprache!A$101","v":"Störung der Energieversorgung "},"","http://www.maschinenrichtlinie.de/maschinenrichtlinie/neue-mrl-2006-42-eg/sicherheits-anforderungen/fuer-alle-maschinen/energieversorgung/"]
["2006 / 42","1.3.",{"$f":"Sprache!A$102","v":"Schutzmaßnahmen gegen mechanische Gefährdungen "},"x"]
["2006 / 42","1.3.1.",{"$f":"Sprache!A$103","v":"Risiko des Verlusts der Standsicherheit "},"","http://www.maschinenrichtlinie.de/maschinenrichtlinie/neue-mrl-2006-42-eg/sicherheits-anforderungen/fuer-alle-maschinen/verlust-der-standsicherheit/"]
["2006 / 42","1.3.2.",{"$f":"Sprache!A$104","v":"Bruchrisiko beim Betrieb "},"","http://www.maschinenrichtlinie.de/maschinenrichtlinie/neue-mrl-2006-42-eg/sicherheits-anforderungen/fuer-alle-maschinen/bruchrisiko-beim-betrieb/"]
["2006 / 42","1.3.3.",{"$f":"Sprache!A$105","v":"Risiken durch herabfallende oder herausgeschleuderte Gegenstände "},"","http://www.maschinenrichtlinie.de/maschinenrichtlinie/neue-mrl-2006-42-eg/sicherheits-anforderungen/fuer-alle-maschinen/herabfallende-gegenstaende/"]
["2006 / 42","1.3.4.",{"$f":"Sprache!A$106","v":"Risiken durch Oberflächen, Kanten und Ecken "},"","http://www.maschinenrichtlinie.de/maschinenrichtlinie/neue-mrl-2006-42-eg/sicherheits-anforderungen/fuer-alle-maschinen/oberflaechen-kanten-ecken/"]
["2006 / 42","1.3.5.",{"$f":"Sprache!A$107","v":"Risiken durch mehrfach kombinierte Maschinen "},"","http://www.maschinenrichtlinie.de/maschinenrichtlinie/neue-mrl-2006-42-eg/sicherheits-anforderungen/fuer-alle-maschinen/mehrfach-kombinierte-maschinen/"]
["2006 / 42","1.3.6.",{"$f":"Sprache!A$108","v":"Risiken durch Änderung der Verwendungsbedingungen "},"","http://www.maschinenrichtlinie.de/maschinenrichtlinie/neue-mrl-2006-42-eg/sicherheits-anforderungen/fuer-alle-maschinen/verwendungsbedingungen/"]
["2006 / 42","1.3.7.",{"$f":"Sprache!A$109","v":"Risiken durch bewegliche Teile "},"","http://www.maschinenrichtlinie.de/maschinenrichtlinie/neue-mrl-2006-42-eg/sicherheits-anforderungen/fuer-alle-maschinen/risiken-durch-bewegliche-teile/"]
["2006 / 42","1.3.8.",{"$f":"Sprache!A$110","v":"Wahl der Schutzeinrichtungen gegen Risiken durch bewegliche Teile "},"x","http://www.maschinenrichtlinie.de/maschinenrichtlinie/neue-mrl-2006-42-eg/sicherheits-anforderungen/fuer-alle-maschinen/wahl-der-schutzeinrichtungen/"]
["2006 / 42","1.3.8.1.",{"$f":"Sprache!A$111","v":"Bewegliche Teile der Kraftübertragung "},"","http://www.maschinenrichtlinie.de/maschinenrichtlinie/neue-mrl-2006-42-eg/sicherheits-anforderungen/fuer-alle-maschinen/teile-der-kraftuebertragung.html"]
["2006 / 42","1.3.8.2.",{"$f":"Sprache!A$112","v":"Bewegliche Teile, die am Arbeitsprozess beteiligt sind "},"","http://www.maschinenrichtlinie.de/maschinenrichtlinie/neue-mrl-2006-42-eg/sicherheits-anforderungen/fuer-alle-maschinen/teile-arbeitsprozess-beteiligt.html"]
["2006 / 42","1.3.9.",{"$f":"Sprache!A$113","v":"Risiko unkontrollierter Bewegungen "},"","http://www.maschinenrichtlinie.de/maschinenrichtlinie/neue-mrl-2006-42-eg/sicherheits-anforderungen/fuer-alle-maschinen/unkontrollierte-bewegungen/"]
["2006 / 42","1.4.",{"$f":"Sprache!A$114","v":"Anforderungen an Schutzeinrichtungen "},"x"]
["2006 / 42","1.4.1.",{"$f":"Sprache!A$115","v":"Allgemeine Anforderungen "},"","http://www.maschinenrichtlinie.de/maschinenrichtlinie/neue-mrl-2006-42-eg/sicherheits-anforderungen/fuer-alle-maschinen/anforder-schutzeinrichtungen/"]
["2006 / 42","1.4.2.",{"$f":"Sprache!A$116","v":"Besondere Anforderungen an trennende Schutzeinrichtungen "},"x","http://www.maschinenrichtlinie.de/maschinenrichtlinie/neue-mrl-2006-42-eg/sicherheits-anforderungen/fuer-alle-maschinen/trennende-schutzeinrichtungen/"]
["2006 / 42","1.4.2.1.",{"$f":"Sprache!A$117","v":"Feststehende trennende Schutzeinrichtungen "},"","http://www.maschinenrichtlinie.de/maschinenrichtlinie/neue-mrl-2006-42-eg/sicherheits-anforderungen/fuer-alle-maschinen/feste-schutzeinrichtungen/"]
["2006 / 42","1.4.2.2.",{"$f":"Sprache!A$118","v":"Bewegliche trennende Schutzeinrichtungen mit Verriegelung "},"","http://www.maschinenrichtlinie.de/maschinenrichtlinie/neue-mrl-2006-42-eg/sicherheits-anforderungen/fuer-alle-maschinen/schutzeinrichtung-verriegelung/"]
["2006 / 42","1.4.2.3.",{"$f":"Sprache!A$119","v":"Zugangsbeschränkende verstellbare Schutzeinrichtungen "},"","http://www.maschinenrichtlinie.de/maschinenrichtlinie/neue-mrl-2006-42-eg/sicherheits-anforderungen/fuer-alle-maschinen/verstellbare-schutzeinrichtung/"]
["2006 / 42","1.4.3.",{"$f":"Sprache!A$120","v":"Besondere Anforderungen an nichttrennende Schutzeinrichtungen "},"","http://www.maschinenrichtlinie.de/maschinenrichtlinie/neue-mrl-2006-42-eg/sicherheits-anforderungen/fuer-alle-maschinen/nichttrennen-schutzeinrichtung/"]
["2006 / 42","1.5.",{"$f":"Sprache!A$121","v":"Risiken durch sonstige Gefährdungen "},"x"]
["2006 / 42","1.5.01.",{"$f":"Sprache!A$122","v":"Elektrische Energieversorgung "},"","http://www.maschinenrichtlinie.de/maschinenrichtlinie/neue-mrl-2006-42-eg/sicherheits-anforderungen/fuer-alle-maschinen/elektrische-energieversorgung/"]
["2006 / 42","1.5.02.",{"$f":"Sprache!A$123","v":"Statische Elektrizität "},"","http://www.maschinenrichtlinie.de/maschinenrichtlinie/neue-mrl-2006-42-eg/sicherheits-anforderungen/fuer-alle-maschinen/statische-elektrizit/"]
["2006 / 42","1.5.03.",{"$f":"Sprache!A$124","v":"Nichtelektrische Energieversorgung "},"","http://www.maschinenrichtlinie.de/maschinenrichtlinie/neue-mrl-2006-42-eg/sicherheits-anforderungen/fuer-alle-maschinen/nichtelektrische-energie/"]
["2006 / 42","1.5.04.",{"$f":"Sprache!A$125","v":"Montagefehler "},"","http://www.maschinenrichtlinie.de/maschinenrichtlinie/neue-mrl-2006-42-eg/sicherheits-anforderungen/fuer-alle-maschinen/montagefehler/"]
["2006 / 42","1.5.05.",{"$f":"Sprache!A$126","v":"Extreme Temperaturen "},"","http://www.maschinenrichtlinie.de/maschinenrichtlinie/neue-mrl-2006-42-eg/sicherheits-anforderungen/fuer-alle-maschinen/extreme-temperaturen/"]
["2006 / 42","1.5.06.",{"$f":"Sprache!A$127","v":"Brand "},"","http://www.maschinenrichtlinie.de/maschinenrichtlinie/neue-mrl-2006-42-eg/sicherheits-anforderungen/fuer-alle-maschinen/brand/"]
["2006 / 42","1.5.07.",{"$f":"Sprache!A$128","v":"Explosion "},"","http://www.maschinenrichtlinie.de/maschinenrichtlinie/neue-mrl-2006-42-eg/sicherheits-anforderungen/fuer-alle-maschinen/explosion/"]
["2006 / 42","1.5.08.",{"$f":"Sprache!A$129","v":"Lärm "},"","http://www.maschinenrichtlinie.de/maschinenrichtlinie/neue-mrl-2006-42-eg/sicherheits-anforderungen/fuer-alle-maschinen/laerm/"]
["2006 / 42","1.5.09.",{"$f":"Sprache!A$130","v":"Vibrationen "},"","http://www.maschinenrichtlinie.de/maschinenrichtlinie/neue-mrl-2006-42-eg/sicherheits-anforderungen/fuer-alle-maschinen/vibrationen/"]
["2006 / 42","1.5.10.",{"$f":"Sprache!A$131","v":"Strahlung "},"","http://www.maschinenrichtlinie.de/maschinenrichtlinie/neue-mrl-2006-42-eg/sicherheits-anforderungen/fuer-alle-maschinen/strahlung/"]
["2006 / 42","1.5.11.",{"$f":"Sprache!A$132","v":"Strahlung von außen "},"","http://www.maschinenrichtlinie.de/maschinenrichtlinie/neue-mrl-2006-42-eg/sicherheits-anforderungen/fuer-alle-maschinen/strahlung-von-aussen/"]
["2006 / 42","1.5.12.",{"$f":"Sprache!A$133","v":"Laserstrahlung "},"","http://www.maschinenrichtlinie.de/maschinenrichtlinie/neue-mrl-2006-42-eg/sicherheits-anforderungen/fuer-alle-maschinen/laserstrahlung/"]
["2006 / 42","1.5.13.",{"$f":"Sprache!A$134","v":"Emission gefährlicher Werkstoffe und Substanzen "},"","http://www.maschinenrichtlinie.de/maschinenrichtlinie/neue-mrl-2006-42-eg/sicherheits-anforderungen/fuer-alle-maschinen/emissionen/"]
["2006 / 42","1.5.14.",{"$f":"Sprache!A$135","v":"Risiko, in einer Maschine eingeschlossen zu werden"},"","http://www.maschinenrichtlinie.de/maschinenrichtlinie/neue-mrl-2006-42-eg/sicherheits-anforderungen/fuer-alle-maschinen/eingeschlossen-werden/"]
["2006 / 42","1.5.15.",{"$f":"Sprache!A$136","v":"Ausrutsch-, Stolper- und Sturzrisiko "},"","http://www.maschinenrichtlinie.de/maschinenrichtlinie/neue-mrl-2006-42-eg/sicherheits-anforderungen/fuer-alle-maschinen/ausrutschen-stolpern-sturz/"]
["2006 / 42","1.5.16.",{"$f":"Sprache!A$137","v":"Blitzschlag "},"","http://www.maschinenrichtlinie.de/maschinenrichtlinie/neue-mrl-2006-42-eg/sicherheits-anforderungen/fuer-alle-maschinen/blitzschlag/"]
["2006 / 42","1.6.",{"$f":"Sprache!A$138","v":"Instandhaltung "},"x"]
["2006 / 42","1.6.1.",{"$f":"Sprache!A$139","v":"Wartung der Maschine "},"","http://www.maschinenrichtlinie.de/maschinenrichtlinie/neue-mrl-2006-42-eg/sicherheits-anforderungen/fuer-alle-maschinen/wartung-der-maschine/"]
["2006 / 42","1.6.2.",{"$f":"Sprache!A$140","v":"Zugang zu den Bedienungsständen und den Eingriffspunkten für die Instandhaltung "},"","http://www.maschinenrichtlinie.de/maschinenrichtlinie/neue-mrl-2006-42-eg/sicherheits-anforderungen/fuer-alle-maschinen/zugang-bedienung-wartung/"]
["2006 / 42","1.6.3.",{"$f":"Sprache!A$141","v":"Trennung von den Energiequellen "},"","http://www.maschinenrichtlinie.de/maschinenrichtlinie/neue-mrl-2006-42-eg/sicherheits-anforderungen/fuer-alle-maschinen/trennung-von-energiequellen/"]
["2006 / 42","1.6.4.",{"$f":"Sprache!A$142","v":"Eingriffe des Bedienungspersonals "},"","http://www.maschinenrichtlinie.de/maschinenrichtlinie/neue-mrl-2006-42-eg/sicherheits-anforderungen/fuer-alle-maschinen/eingriffe-bedienungspersonal/"]
["2006 / 42","1.6.5.",{"$f":"Sprache!A$143","v":"Reinigung innen liegender Maschinenteile "},"","http://www.maschinenrichtlinie.de/maschinenrichtlinie/neue-mrl-2006-42-eg/sicherheits-anforderungen/fuer-alle-maschinen/reinigung-maschinenteile/"]
["2006 / 42","1.7.",{"$f":"Sprache!A$144","v":"Informationen "},"x","http://www.maschinenrichtlinie.de/maschinenrichtlinie/neue-mrl-2006-42-eg/sicherheits-anforderungen/fuer-alle-maschinen/17-informationen/"]
["2006 / 42","1.7.1.",{"$f":"Sprache!A$145","v":"Informationen und Warnhinweise an der Maschine "},"","http://www.maschinenrichtlinie.de/maschinenrichtlinie/neue-mrl-2006-42-eg/sicherheits-anforderungen/fuer-alle-maschinen/informationen-und-warnhinweise/"]
["2006 / 42","1.7.1.1.",{"$f":"Sprache!A$146","v":"Informationen und Informationseinrichtungen "},"","http://www.maschinenrichtlinie.de/maschinenrichtlinie/neue-mrl-2006-42-eg/sicherheits-anforderungen/fuer-alle-maschinen/informationen-einrichtungen/"]
["2006 / 42","1.7.1.2.",{"$f":"Sprache!A$147","v":"Warneinrichtungen "},"","http://www.maschinenrichtlinie.de/maschinenrichtlinie/neue-mrl-2006-42-eg/sicherheits-anforderungen/fuer-alle-maschinen/warneinrichtungen/"]
["2006 / 42","1.7.2.",{"$f":"Sprache!A$148","v":"Warnung vor Restrisiken "},"","http://www.maschinenrichtlinie.de/maschinenrichtlinie/neue-mrl-2006-42-eg/sicherheits-anforderungen/fuer-alle-maschinen/warnung-vor-restrisiken/"]
["2006 / 42","1.7.3.",{"$f":"Sprache!A$149","v":"Kennzeichnung der Maschinen "},"","http://www.maschinenrichtlinie.de/maschinenrichtlinie/neue-mrl-2006-42-eg/sicherheits-anforderungen/fuer-alle-maschinen/kennzeichnung-der-maschinen/"]
["2006 / 42","1.7.4.",{"$f":"Sprache!A$150","v":"Betriebsanleitung "},"","http://www.maschinenrichtlinie.de/maschinenrichtlinie/neue-mrl-2006-42-eg/sicherheits-anforderungen/fuer-alle-maschinen/betriebsanleitung/"]
["2006 / 42","1.7.4.1.",{"$f":"Sprache!A$151","v":"Allgemeine Grundsätze für die Abfassung der Betriebsanleitung "},"","http://www.maschinenrichtlinie.de/maschinenrichtlinie/neue-mrl-2006-42-eg/sicherheits-anforderungen/fuer-alle-maschinen/abfassung-betriebsanleitung.html"]
["2006 / 42","1.7.4.2.",{"$f":"Sprache!A$152","v":"Inhalt der Betriebsanleitung "},"","http://www.maschinenrichtlinie.de/maschinenrichtlinie/neue-mrl-2006-42-eg/sicherheits-anforderungen/fuer-alle-maschinen/inhalt-betriebsanleitung.html"]
["2006 / 42","1.7.4.3.",{"$f":"Sprache!A$153","v":"Verkaufsprospekte"},"","http://www.maschinenrichtlinie.de/maschinenrichtlinie/neue-mrl-2006-42-eg/sicherheits-anforderungen/fuer-alle-maschinen/verkaufsprospekte.html"]
["2006 / 42","2.",{"$f":"Sprache!A$154","v":"Bestimmte Maschinengattungen"},"x"]
["2006 / 42","2.1.",{"$f":"Sprache!A$155","v":"Nahrungsmittelmaschinen und Maschinen für kosmetische oder pharmazeutische Erzeugnisse"},"x","http://www.maschinenrichtlinie.de/maschinenrichtlinie/neue-mrl-2006-42-eg/sicherheits-anforderungen/nahrungsmittelmaschinen/"]
["2006 / 42","2.1.1.",{"$f":"Sprache!A$156","v":"Allgemeines"},"","http://www.maschinenrichtlinie.de/maschinenrichtlinie/neue-mrl-2006-42-eg/sicherheits-anforderungen/nahrungsmittelmaschinen/nahrungsmittelmaschinen-allgem/"]
["2006 / 42","2.1.2.",{"$f":"Sprache!A$157","v":"Betriebsanleitung"},"","http://www.maschinenrichtlinie.de/maschinenrichtlinie/neue-mrl-2006-42-eg/sicherheits-anforderungen/nahrungsmittelmaschinen/betriebsanleitung-nahrungsmitt/"]
["2006 / 42","2.2.",{"$f":"Sprache!A$158","v":"handgehaltene und/oder handgeführte tragbare Maschinen"},"x","http://www.maschinenrichtlinie.de/maschinenrichtlinie/neue-mrl-2006-42-eg/sicherheits-anforderungen/handgehaltene-maschinen/"]
["2006 / 42","2.2.1.",{"$f":"Sprache!A$159","v":"Allgemeines"},"","http://www.maschinenrichtlinie.de/maschinenrichtlinie/neue-mrl-2006-42-eg/sicherheits-anforderungen/handgehaltene-maschinen/hand-gehaltene-maschinen-allge/"]
["2006 / 42","2.2.1.1.",{"$f":"Sprache!A$160","v":"Betriebsanleitung"},"","http://www.maschinenrichtlinie.de/maschinenrichtlinie/neue-mrl-2006-42-eg/sicherheits-anforderungen/handgehaltene-maschinen/betriebsanleitung-hand-maschin/"]
["2006 / 42","2.2.2.",{"$f":"Sprache!A$161","v":"Tragbare Befestigungsgeräte und andere Schussgeräte"},"x","http://www.maschinenrichtlinie.de/maschinenrichtlinie/neue-mrl-2006-42-eg/sicherheits-anforderungen/schussgeraete/"]
["2006 / 42","2.2.2.1.",{"$f":"Sprache!A$162","v":"Allgemeines"},"","http://www.maschinenrichtlinie.de/maschinenrichtlinie/neue-mrl-2006-42-eg/sicherheits-anforderungen/schussgeraete/schussgeraete-allgemeines/"]
["2006 / 42","2.2.2.2.",{"$f":"Sprache!A$163","v":"Betriebsanleitung"},"","http://www.maschinenrichtlinie.de/maschinenrichtlinie/neue-mrl-2006-42-eg/sicherheits-anforderungen/schussgeraete/betriebsanleitung-schussgeraet/"]
["2006 / 42","2.3.",{"$f":"Sprache!A$164","v":"Maschinen zur Bearbeitung von Holz und von Werkstoffen mit ähnlichen physikalischen Eigenschaften"},"","http://www.maschinenrichtlinie.de/maschinenrichtlinie/neue-mrl-2006-42-eg/sicherheits-anforderungen/holzbearbeitungsmaschinen/holzbearbeitungsmaschinen/"]
["2006 / 42","2.4.",{"$f":"Sprache!A$165","v":"Maschinen zur Ausbringung von Pestiziden"},"x","http://www.maschinenrichtlinie.de/maschinenrichtlinie/neue-mrl-2006-42-eg/sicherheits-anforderungen/pestizidausbringungsmaschinen/241-begriffsbestimmung/"]
["2006 / 42","2.4.01.",{"$f":"Sprache!A$166","v":"Begriffsbestimmung"},"","http://www.maschinenrichtlinie.de/maschinenrichtlinie/neue-mrl-2006-42-eg/sicherheits-anforderungen/pestizidausbringungsmaschinen/241-begriffsbestimmung/"]
["2006 / 42","2.4.02.",{"$f":"Sprache!A$167","v":"Allgemeines"},"","http://www.maschinenrichtlinie.de/maschinenrichtlinie/neue-mrl-2006-42-eg/sicherheits-anforderungen/pestizidausbringungsmaschinen/242-allgemeines/"]
["2006 / 42","2.4.03.",{"$f":"Sprache!A$168","v":"Bedienung und Überwachung"},"","http://www.maschinenrichtlinie.de/maschinenrichtlinie/neue-mrl-2006-42-eg/sicherheits-anforderungen/pestizidausbringungsmaschinen/243-bedienung-und-ueberwachung/"]
["2006 / 42","2.4.04.",{"$f":"Sprache!A$169","v":"Füllung und Entleerung"},"","http://www.maschinenrichtlinie.de/maschinenrichtlinie/neue-mrl-2006-42-eg/sicherheits-anforderungen/pestizidausbringungsmaschinen/244-fuellung-und-entleerung/"]
["2006 / 42","2.4.05.",{"$f":"Sprache!A$170","v":"Ausbringung von Pestiziden"},"x","http://www.maschinenrichtlinie.de/maschinenrichtlinie/neue-mrl-2006-42-eg/sicherheits-anforderungen/pestizidausbringungsmaschinen/245-ausbringung-von-pestiziden/"]
["2006 / 42","2.4.05.1.",{"$f":"Sprache!A$171","v":"Ausbringungsrate"},"","http://www.maschinenrichtlinie.de/maschinenrichtlinie/neue-mrl-2006-42-eg/sicherheits-anforderungen/pestizidausbringungsmaschinen/245-ausbringung-von-pestiziden/2451-ausbringungsrate/"]
["2006 / 42","2.4.05.2.",{"$f":"Sprache!A$172","v":"Verteilung, Anlagerung und Abdrift von Pestiziden"},"","http://www.maschinenrichtlinie.de/maschinenrichtlinie/neue-mrl-2006-42-eg/sicherheits-anforderungen/pestizidausbringungsmaschinen/245-ausbringung-von-pestiziden/2452-verteilung-anlagerung-und-abdrift-von-pestiziden/"]
["2006 / 42","2.4.05.3.",{"$f":"Sprache!A$173","v":"Prüfungen"},"","http://www.maschinenrichtlinie.de/maschinenrichtlinie/neue-mrl-2006-42-eg/sicherheits-anforderungen/pestizidausbringungsmaschinen/245-ausbringung-von-pestiziden/2453-pruefungen/"]
["2006 / 42","2.4.05.4.",{"$f":"Sprache!A$174","v":"Unbeabsichtigte Freisetzungen während und nach der Abschaltung"},"","http://www.maschinenrichtlinie.de/maschinenrichtlinie/neue-mrl-2006-42-eg/sicherheits-anforderungen/pestizidausbringungsmaschinen/245-ausbringung-von-pestiziden/2454-unbeabsichtigte-freisetzungen/"]
["2006 / 42","2.4.06.",{"$f":"Sprache!A$175","v":"Wartung"},"x","http://www.maschinenrichtlinie.de/maschinenrichtlinie/neue-mrl-2006-42-eg/sicherheits-anforderungen/pestizidausbringungsmaschinen/246-wartung/"]
["2006 / 42","2.4.06.1.",{"$f":"Sprache!A$176","v":"Reinigung"},"","http://www.maschinenrichtlinie.de/maschinenrichtlinie/neue-mrl-2006-42-eg/sicherheits-anforderungen/pestizidausbringungsmaschinen/246-wartung/2461-reinigung/"]
["2006 / 42","2.4.06.2.",{"$f":"Sprache!A$177","v":"Instandhaltung"},"","http://www.maschinenrichtlinie.de/maschinenrichtlinie/neue-mrl-2006-42-eg/sicherheits-anforderungen/pestizidausbringungsmaschinen/246-wartung/2462-instandhaltung/"]
["2006 / 42","2.4.07.",{"$f":"Sprache!A$178","v":"Kontrollen"},"","http://www.maschinenrichtlinie.de/maschinenrichtlinie/neue-mrl-2006-42-eg/sicherheits-anforderungen/pestizidausbringungsmaschinen/247-kontrollen/"]
["2006 / 42","2.4.08.",{"$f":"Sprache!A$179","v":"Kennzeichnung von Düsen, Sieben und Filtern"},"","http://www.maschinenrichtlinie.de/maschinenrichtlinie/neue-mrl-2006-42-eg/sicherheits-anforderungen/pestizidausbringungsmaschinen/248-kennzeichnung/"]
["2006 / 42","2.4.09.",{"$f":"Sprache!A$180","v":"Angabe des verwendeten Pestizids"},"","http://www.maschinenrichtlinie.de/maschinenrichtlinie/neue-mrl-2006-42-eg/sicherheits-anforderungen/pestizidausbringungsmaschinen/249-angabe-pestizid/"]
["2006 / 42","2.4.10.",{"$f":"Sprache!A$181","v":"Betriebsanleitung"},"","http://www.maschinenrichtlinie.de/maschinenrichtlinie/neue-mrl-2006-42-eg/sicherheits-anforderungen/pestizidausbringungsmaschinen/2410-betriebsanleitung/"]
["2006 / 42","3.",{"$f":"Sprache!A$182","v":"Beweglichkeit von Maschinen"},"x","http://www.maschinenrichtlinie.de/maschinenrichtlinie/neue-mrl-2006-42-eg/sicherheits-anforderungen/bewegliche-maschinen/"]
["2006 / 42","3.1.",{"$f":"Sprache!A$183","v":"Allgemeines"},"x"]
["2006 / 42","3.1.1.",{"$f":"Sprache!A$184","v":"Begriffsbestimmungen"},"","http://www.maschinenrichtlinie.de/maschinenrichtlinie/neue-mrl-2006-42-eg/sicherheits-anforderungen/bewegliche-maschinen/begriffsbestimmungen-beweglich/"]
["2006 / 42","3.2.",{"$f":"Sprache!A$185","v":"Bedienerplätze"},"x","http://www.maschinenrichtlinie.de/maschinenrichtlinie/neue-mrl-2006-42-eg/sicherheits-anforderungen/bewegliche-maschinen/bedienerplaetze/"]
["2006 / 42","3.2.1.",{"$f":"Sprache!A$186","v":"Fahrerplatz"},"","http://www.maschinenrichtlinie.de/maschinenrichtlinie/neue-mrl-2006-42-eg/sicherheits-anforderungen/bewegliche-maschinen/fahrerplatz-bewegliche-maschin/"]
["2006 / 42","3.2.2.",{"$f":"Sprache!A$187","v":"Sitze"},"","http://www.maschinenrichtlinie.de/maschinenrichtlinie/neue-mrl-2006-42-eg/sicherheits-anforderungen/bewegliche-maschinen/sitze-bewegliche-maschinen/"]
["2006 / 42","3.2.3.",{"$f":"Sprache!A$188","v":"Plätze für andere Personen"},"","http://www.maschinenrichtlinie.de/maschinenrichtlinie/neue-mrl-2006-42-eg/sicherheits-anforderungen/bewegliche-maschinen/plaetze-fuer-andere-personen/"]
["2006 / 42","3.3.",{"$f":"Sprache!A$189","v":"Steuerung"},"x","http://www.maschinenrichtlinie.de/maschinenrichtlinie/neue-mrl-2006-42-eg/sicherheits-anforderungen/bewegliche-maschinen/steuerung-bewegliche-maschinen/"]
["2006 / 42","3.3.1.",{"$f":"Sprache!A$190","v":"Stellteile"},"","http://www.maschinenrichtlinie.de/maschinenrichtlinie/neue-mrl-2006-42-eg/sicherheits-anforderungen/bewegliche-maschinen/stellteile-bewegliche-maschine/"]
["2006 / 42","3.3.2.",{"$f":"Sprache!A$191","v":"Ingangsetzen/Verfahren"},"","http://www.maschinenrichtlinie.de/maschinenrichtlinie/neue-mrl-2006-42-eg/sicherheits-anforderungen/bewegliche-maschinen/ingangsetzen-verfahren-bewegli/"]
["2006 / 42","3.3.3.",{"$f":"Sprache!A$192","v":"Stillsetzen/Bremsen"},"","http://www.maschinenrichtlinie.de/maschinenrichtlinie/neue-mrl-2006-42-eg/sicherheits-anforderungen/bewegliche-maschinen/stillsetzen-bremsen-bewegliche/"]
["2006 / 42","3.3.4.",{"$f":"Sprache!A$193","v":"Verfahren mitgängergeführter Maschinen"},"","http://www.maschinenrichtlinie.de/maschinenrichtlinie/neue-mrl-2006-42-eg/sicherheits-anforderungen/bewegliche-maschinen/mitgaengergefuehrte-maschinen/"]
["2006 / 42","3.3.5.",{"$f":"Sprache!A$194","v":"Störung des Steuerkreises"},"","http://www.maschinenrichtlinie.de/maschinenrichtlinie/neue-mrl-2006-42-eg/sicherheits-anforderungen/bewegliche-maschinen/stoerung-des-steuerkreises/"]
["2006 / 42","3.4.",{"$f":"Sprache!A$195","v":"Schutzmaßnahmen gegen mechanische Gefährdungen"},"x","http://www.maschinenrichtlinie.de/maschinenrichtlinie/anhang-i-sicherheitsanforderungen/bewegliche-maschinen/mechanische-gefaehrdungen/"]
["2006 / 42","3.4.1.",{"$f":"Sprache!A$196","v":"Unkontrollierte Bewegungen"},"","http://www.maschinenrichtlinie.de/maschinenrichtlinie/neue-mrl-2006-42-eg/sicherheits-anforderungen/bewegliche-maschinen/unkontrollierte-bewegungen/"]
["2006 / 42","3.4.2.",{"$f":"Sprache!A$197","v":"Bewegliche Übertragungselemente"},"","http://www.maschinenrichtlinie.de/maschinenrichtlinie/neue-mrl-2006-42-eg/sicherheits-anforderungen/bewegliche-maschinen/beweglich-uebertragungselement/"]
["2006 / 42","3.4.3.",{"$f":"Sprache!A$198","v":"Überrollen und Umkippen"},"","http://www.maschinenrichtlinie.de/maschinenrichtlinie/neue-mrl-2006-42-eg/sicherheits-anforderungen/bewegliche-maschinen/ueberrollen-und-umkippen/"]
["2006 / 42","3.4.4.",{"$f":"Sprache!A$199","v":"Herabfallende Gegenstände"},"","http://www.maschinenrichtlinie.de/maschinenrichtlinie/neue-mrl-2006-42-eg/sicherheits-anforderungen/bewegliche-maschinen/herabfallende-gegenstaende/"]
["2006 / 42","3.4.5.",{"$f":"Sprache!A$200","v":"Zugänge"},"","http://www.maschinenrichtlinie.de/maschinenrichtlinie/neue-mrl-2006-42-eg/sicherheits-anforderungen/bewegliche-maschinen/zugaenge/"]
["2006 / 42","3.4.6.",{"$f":"Sprache!A$201","v":"Anhängevorrichtungen"},"","http://www.maschinenrichtlinie.de/maschinenrichtlinie/neue-mrl-2006-42-eg/sicherheits-anforderungen/bewegliche-maschinen/anhaengevorrichtungen/"]
["2006 / 42","3.4.7.",{"$f":"Sprache!A$202","v":"Kraftübertragung zwischen einer selbstfahrenden Maschine (oder einer Zugmaschine) und einer angetriebenen Maschine"},"","http://www.maschinenrichtlinie.de/maschinenrichtlinie/neue-mrl-2006-42-eg/sicherheits-anforderungen/bewegliche-maschinen/kraftuebertragung/"]
["2006 / 42","3.5.",{"$f":"Sprache!A$203","v":"Schutzmaßnahmen gegen sonstige Gefährdungen"},"x"]
["2006 / 42","3.5.1.",{"$f":"Sprache!A$204","v":"Batterien"},"","http://www.maschinenrichtlinie.de/maschinenrichtlinie/neue-mrl-2006-42-eg/sicherheits-anforderungen/bewegliche-maschinen/batterien/"]
["2006 / 42","3.5.2.",{"$f":"Sprache!A$205","v":"Brand"},"","http://www.maschinenrichtlinie.de/maschinenrichtlinie/neue-mrl-2006-42-eg/sicherheits-anforderungen/bewegliche-maschinen/brand-bewegliche-maschinen/"]
["2006 / 42","3.5.3.",{"$f":"Sprache!A$206","v":"Emission von gefährlichen Stoffen"},"","http://www.maschinenrichtlinie.de/maschinenrichtlinie/neue-mrl-2006-42-eg/sicherheits-anforderungen/bewegliche-maschinen/emission-gefaehrliche-stoffe/"]
["2006 / 42","3.6.",{"$f":"Sprache!A$207","v":"Informationen und Angaben"},"x","http://www.maschinenrichtlinie.de/maschinenrichtlinie/neue-mrl-2006-42-eg/sicherheits-anforderungen/bewegliche-maschinen/informationen-angaben/"]
["2006 / 42","3.6.1.",{"$f":"Sprache!A$208","v":"Zeichen, Signaleinrichtungen und Warnhinweise"},"","http://www.maschinenrichtlinie.de/maschinenrichtlinie/neue-mrl-2006-42-eg/sicherheits-anforderungen/bewegliche-maschinen/zeichen-signaleinrichtungen/"]
["2006 / 42","3.6.2.",{"$f":"Sprache!A$209","v":"Kennzeichnung"},"","http://www.maschinenrichtlinie.de/maschinenrichtlinie/neue-mrl-2006-42-eg/sicherheits-anforderungen/bewegliche-maschinen/kennzeichnung-bewegliche-masch/"]
["2006 / 42","3.6.3.",{"$f":"Sprache!A$210","v":"Betriebsanleitung"},"x"]
["2006 / 42","3.6.3.1.",{"$f":"Sprache!A$211","v":"Vibrationen"},"","http://www.maschinenrichtlinie.de/maschinenrichtlinie/neue-mrl-2006-42-eg/sicherheits-anforderungen/bewegliche-maschinen/vibrationen-betriebsanleitung/"]
["2006 / 42","3.6.3.2.",{"$f":"Sprache!A$212","v":"Mehrere Verwendungsmöglichkeiten"},"","http://www.maschinenrichtlinie.de/maschinenrichtlinie/neue-mrl-2006-42-eg/sicherheits-anforderungen/bewegliche-maschinen/verwendungsmoeglichkeiten/"]
["2006 / 42","4.",{"$f":"Sprache!A$213","v":"durch Hebevorgänge bedingten Gefährdungen"},"x","http://www.maschinenrichtlinie.de/maschinenrichtlinie/neue-mrl-2006-42-eg/sicherheits-anforderungen/hebemaschinen/hebemaschinen/"]
["2006 / 42","4.1.",{"$f":"Sprache!A$214","v":"Allgemeines"},"x"]
["2006 / 42","4.1.1.",{"$f":"Sprache!A$215","v":"Begriffsbestimmungen"},"","http://www.maschinenrichtlinie.de/maschinenrichtlinie/neue-mrl-2006-42-eg/sicherheits-anforderungen/hebemaschinen/begriffsbestimmungen/"]
["2006 / 42","4.1.2.",{"$f":"Sprache!A$216","v":"Schutzmaßnahmen gegen mechanische Gefährdungen"},"x"]
["2006 / 42","4.1.2.1.",{"$f":"Sprache!A$217","v":"Risiken durch mangelnde Standsicherheit"},"","http://www.maschinenrichtlinie.de/maschinenrichtlinie/neue-mrl-2006-42-eg/sicherheits-anforderungen/hebemaschinen/mangelnde-standsicherheit/"]
["2006 / 42","4.1.2.2.",{"$f":"Sprache!A$218","v":"An Führungen oder auf Laufbahnen fahrende Maschinen"},"","http://www.maschinenrichtlinie.de/maschinenrichtlinie/neue-mrl-2006-42-eg/sicherheits-anforderungen/hebemaschinen/fuehrungen-laufbahnen/"]
["2006 / 42","4.1.2.3.",{"$f":"Sprache!A$219","v":"Festigkeit"},"","http://www.maschinenrichtlinie.de/maschinenrichtlinie/neue-mrl-2006-42-eg/sicherheits-anforderungen/hebemaschinen/festigkeit/"]
["2006 / 42","4.1.2.4.",{"$f":"Sprache!A$220","v":"Rollen, Trommeln, Scheiben, Seile und Ketten"},"","http://www.maschinenrichtlinie.de/maschinenrichtlinie/neue-mrl-2006-42-eg/sicherheits-anforderungen/hebemaschinen/rollen-trommeln-scheiben-seile/"]
["2006 / 42","4.1.2.5.",{"$f":"Sprache!A$221","v":"Lastaufnahmemittel und ihre Bauteile"},"","http://www.maschinenrichtlinie.de/maschinenrichtlinie/neue-mrl-2006-42-eg/sicherheits-anforderungen/hebemaschinen/lastaufnahmemittel-bauteile/"]
["2006 / 42","4.1.2.6.",{"$f":"Sprache!A$222","v":"Bewegungsbegrenzung"},"","http://www.maschinenrichtlinie.de/maschinenrichtlinie/neue-mrl-2006-42-eg/sicherheits-anforderungen/hebemaschinen/bewegungsbegrenzung/"]
["2006 / 42","4.1.2.7.",{"$f":"Sprache!A$223","v":"Bewegungen von Lasten während der Benutzung"},"","http://www.maschinenrichtlinie.de/maschinenrichtlinie/neue-mrl-2006-42-eg/sicherheits-anforderungen/hebemaschinen/bewegungen-von-lasten/"]
["2006 / 42","4.1.2.8.",{"$f":"Sprache!A$224","v":"Maschinen, die feste Ladestellen anfahren"},"x","http://www.maschinenrichtlinie.de/maschinenrichtlinie/neue-mrl-2006-42-eg/sicherheits-anforderungen/hebemaschinen/feste-ladestellen-anfahren/"]
["2006 / 42","4.1.2.8.1.",{"$f":"Sprache!A$225","v":"Bewegungen des Lastträgers"},"","http://www.maschinenrichtlinie.de/maschinenrichtlinie/neue-mrl-2006-42-eg/sicherheits-anforderungen/hebemaschinen/bewegungen-des-lasttraegers/"]
["2006 / 42","4.1.2.8.2.",{"$f":"Sprache!A$226","v":"Zugang zum Lastträger"},"","http://www.maschinenrichtlinie.de/maschinenrichtlinie/neue-mrl-2006-42-eg/sicherheits-anforderungen/hebemaschinen/zugang-zum-lasttraeger/"]
["2006 / 42","4.1.2.8.3.",{"$f":"Sprache!A$227","v":"Risiken durch Kontakt mit dem bewegten Lastträger"},"","http://www.maschinenrichtlinie.de/maschinenrichtlinie/neue-mrl-2006-42-eg/sicherheits-anforderungen/hebemaschinen/kontakt-mit-lasttraeger/"]
["2006 / 42","4.1.2.8.4.",{"$f":"Sprache!A$228","v":"Risiken durch vom Lastträger herabstürzende Lasten"},"","http://www.maschinenrichtlinie.de/maschinenrichtlinie/neue-mrl-2006-42-eg/sicherheits-anforderungen/hebemaschinen/herabstuerzende-lasten/"]
["2006 / 42","4.1.2.8.5.",{"$f":"Sprache!A$229","v":"Ladestellen"},"","http://www.maschinenrichtlinie.de/maschinenrichtlinie/neue-mrl-2006-42-eg/sicherheits-anforderungen/hebemaschinen/ladestellen/"]
["2006 / 42","4.1.3.",{"$f":"Sprache!A$230","v":"Zwecktauglichkeit"},"","http://www.maschinenrichtlinie.de/maschinenrichtlinie/neue-mrl-2006-42-eg/sicherheits-anforderungen/hebemaschinen/zwecktauglichkeit/"]
["2006 / 42","4.2.",{"$f":"Sprache!A$231","v":"Anforderungen an Maschinen, die nicht durch menschliche Kraft angetrieben werden"},"x"]
["2006 / 42","4.2.1.",{"$f":"Sprache!A$232","v":"Bewegungssteuerung"},"","http://www.maschinenrichtlinie.de/maschinenrichtlinie/neue-mrl-2006-42-eg/sicherheits-anforderungen/hebemaschinen/bewegungssteuerung/"]
["2006 / 42","4.2.2.",{"$f":"Sprache!A$233","v":"Belastungsbegrenzung"},"","http://www.maschinenrichtlinie.de/maschinenrichtlinie/neue-mrl-2006-42-eg/sicherheits-anforderungen/hebemaschinen/belastungsbegrenzung/"]
["2006 / 42","4.2.3.",{"$f":"Sprache!A$234","v":"Seilgeführte Einrichtungen"},"","http://www.maschinenrichtlinie.de/maschinenrichtlinie/neue-mrl-2006-42-eg/sicherheits-anforderungen/hebemaschinen/seilgefuehrte-einrichtungen/"]
["2006 / 42","4.3.",{"$f":"Sprache!A$235","v":"Informationen und Kennzeichnung"},"x","http://www.maschinenrichtlinie.de/maschinenrichtlinie/neue-mrl-2006-42-eg/sicherheits-anforderungen/hebemaschinen/informationen-kennzeichnung/"]
["2006 / 42","4.3.1.",{"$f":"Sprache!A$236","v":"Ketten, Seile und Gurte"},"","http://www.maschinenrichtlinie.de/maschinenrichtlinie/neue-mrl-2006-42-eg/sicherheits-anforderungen/hebemaschinen/ketten-seile-gurte/"]
["2006 / 42","4.3.2.",{"$f":"Sprache!A$237","v":"Lastaufnahmemittel"},"","http://www.maschinenrichtlinie.de/maschinenrichtlinie/neue-mrl-2006-42-eg/sicherheits-anforderungen/hebemaschinen/lastaufnahmemittel/"]
["2006 / 42","4.3.3.",{"$f":"Sprache!A$238","v":"Maschinen zum Heben von Lasten"},"","http://www.maschinenrichtlinie.de/maschinenrichtlinie/neue-mrl-2006-42-eg/sicherheits-anforderungen/hebemaschinen/info-lastenheben/"]
["2006 / 42","4.4.",{"$f":"Sprache!A$239","v":"Betriebsanleitung"},"x"]
["2006 / 42","4.4.1.",{"$f":"Sprache!A$240","v":"Lastaufnahmemittel"},"","http://www.maschinenrichtlinie.de/maschinenrichtlinie/neue-mrl-2006-42-eg/sicherheits-anforderungen/hebemaschinen/lastaufnahmemittel-betriebsanl/"]
["2006 / 42","4.4.2.",{"$f":"Sprache!A$241","v":"Maschinen zum Heben von Lasten"},"","http://www.maschinenrichtlinie.de/maschinenrichtlinie/neue-mrl-2006-42-eg/sicherheits-anforderungen/hebemaschinen/lastenheben-betriebsanleit/"]
["2006 / 42","5.",{"$f":"Sprache!A$242","v":"zum Einsatz unter Tage bestimmte Maschinen"},"x","http://www.maschinenrichtlinie.de/maschinenrichtlinie/neue-mrl-2006-42-eg/sicherheits-anforderungen/bergbaumaschinen/maschinen-einsatz-unter-tage/"]
["2006 / 42","5.1.",{"$f":"Sprache!A$243","v":"Risiken durch mangelnde Standsicherheit"},"","http://www.maschinenrichtlinie.de/maschinenrichtlinie/anhang-i-sicherheitsanforderungen/bergbaumaschinen/mangelnde-standsicherheit/"]
["2006 / 42","5.2.",{"$f":"Sprache!A$244","v":"Bewegungsfreiheit"},"","http://www.maschinenrichtlinie.de/maschinenrichtlinie/neue-mrl-2006-42-eg/sicherheits-anforderungen/bergbaumaschinen/bewegungsfreiheit/"]
["2006 / 42","5.3.",{"$f":"Sprache!A$245","v":"Stellteile"},"","http://www.maschinenrichtlinie.de/maschinenrichtlinie/neue-mrl-2006-42-eg/sicherheits-anforderungen/bergbaumaschinen/stellteile/"]
["2006 / 42","5.4.",{"$f":"Sprache!A$246","v":"Anhalten der Fahrbewegung"},"","http://www.maschinenrichtlinie.de/maschinenrichtlinie/neue-mrl-2006-42-eg/sicherheits-anforderungen/bergbaumaschinen/anhalten-der-fahrbewegung/"]
["2006 / 42","5.5.",{"$f":"Sprache!A$247","v":"Brand"},"","http://www.maschinenrichtlinie.de/maschinenrichtlinie/neue-mrl-2006-42-eg/sicherheits-anforderungen/bergbaumaschinen/brand/"]
["2006 / 42","5.6.",{"$f":"Sprache!A$248","v":"Emission von Abgasen"},"","http://www.maschinenrichtlinie.de/maschinenrichtlinie/neue-mrl-2006-42-eg/sicherheits-anforderungen/bergbaumaschinen/emission-von-abgasen/"]
["2006 / 42","6.",{"$f":"Sprache!A$249","v":"durch das Heben von Personen bedingte Gefährdungen"},"x","http://www.maschinenrichtlinie.de/maschinenrichtlinie/neue-mrl-2006-42-eg/sicherheits-anforderungen/personenheben/heben-von-personen/"]
["2006 / 42","6.1.",{"$f":"Sprache!A$250","v":"Allgemeines"},"x"]
["2006 / 42","6.1.1.",{"$f":"Sprache!A$251","v":"Festigkeit"},"","http://www.maschinenrichtlinie.de/maschinenrichtlinie/neue-mrl-2006-42-eg/sicherheits-anforderungen/personenheben/festigkeit/"]
["2006 / 42","6.1.2.",{"$f":"Sprache!A$252","v":"Belastungsbegrenzung bei nicht durch menschliche Kraft angetriebenen Maschinen"},"","http://www.maschinenrichtlinie.de/maschinenrichtlinie/neue-mrl-2006-42-eg/sicherheits-anforderungen/personenheben/belastungsbegrenzung/"]
["2006 / 42","6.2.",{"$f":"Sprache!A$253","v":"Stellteile"},"","http://www.maschinenrichtlinie.de/maschinenrichtlinie/neue-mrl-2006-42-eg/sicherheits-anforderungen/personenheben/stellteile/"]
["2006 / 42","6.3.",{"$f":"Sprache!A$254","v":"Risiken für in oder auf dem Lastträger befindliche Personen"},"x"]
["2006 / 42","6.3.1.",{"$f":"Sprache!A$255","v":"Risiken durch Bewegungen des Lastträgers"},"","http://www.maschinenrichtlinie.de/maschinenrichtlinie/neue-mrl-2006-42-eg/sicherheits-anforderungen/personenheben/bewegung-des-lasttraegers/"]
["2006 / 42","6.3.2.",{"$f":"Sprache!A$256","v":"Risiko des Sturzes aus dem Lastträger"},"","http://www.maschinenrichtlinie.de/maschinenrichtlinie/neue-mrl-2006-42-eg/sicherheits-anforderungen/personenheben/sturz-aus-dem-lasttraeger/"]
["2006 / 42","6.3.3.",{"$f":"Sprache!A$257","v":"Risiken durch auf den Lastträger herabfallende Gegenstände"},"","http://www.maschinenrichtlinie.de/maschinenrichtlinie/neue-mrl-2006-42-eg/sicherheits-anforderungen/personenheben/herabfallende-gegenstaende/"]
["2006 / 42","6.4.",{"$f":"Sprache!A$258","v":"Maschinen, die feste Haltestellen anfahren"},"x","http://www.maschinenrichtlinie.de/maschinenrichtlinie/neue-mrl-2006-42-eg/sicherheits-anforderungen/personenheben/feste-haltestellen/"]
["2006 / 42","6.4.1.",{"$f":"Sprache!A$259","v":"Risiken für in oder auf dem Lastträger befindliche Personen"},"","http://www.maschinenrichtlinie.de/maschinenrichtlinie/neue-mrl-2006-42-eg/sicherheits-anforderungen/personenheben/personen-auf-dem-lasttraeger/"]
["2006 / 42","6.4.2.",{"$f":"Sprache!A$260","v":"Befehlseinrichtungen an den Haltestellen"},"","http://www.maschinenrichtlinie.de/maschinenrichtlinie/neue-mrl-2006-42-eg/sicherheits-anforderungen/personenheben/befehlseinrichtung-haltestelle/"]
["2006 / 42","6.4.3.",{"$f":"Sprache!A$261","v":"Zugang zum Lastträger"},"","http://www.maschinenrichtlinie.de/maschinenrichtlinie/neue-mrl-2006-42-eg/sicherheits-anforderungen/personenheben/zugang-zum-lasttraeger/"]
["2006 / 42","6.5.",{"$f":"Sprache!A$262","v":"Kennzeichnung"},"","http://www.maschinenrichtlinie.de/maschinenrichtlinie/neue-mrl-2006-42-eg/sicherheits-anforderungen/personenheben/kennzeichnung/"]

{"sheet":"Constants","index":9,"n_rows":11,"n_cols":9,"rows_kept":11,"cut":false,"hidden":false,"merged":[[0,4,0,8],[0,0,0,2]]}
["Constants",null,null,null,"Dropdown Lists"]
["Const_Name","Value","Description",null,"DD_RAColl_HazardExists","DD_RAColl_ContentAlreadyCovered","DD_RAColl_StandardType","DD_RAColl_FurtherReductionNecessary","DD_RAColl_HazardCovered"]
[null,null,null,null,"x","x","C","x","x"]
[null,null,null,null,"-","-","B2","-","-"]
[null,null,null,null,"?",null,"B1"]
[null,null,null,null,null,null,"B"]
[null,null,null,null,null,null,"A"]
[null,null,null,null,null,null,1]
[null,null,null,null,null,null,2]
[null,null,null,null,null,null,3]
[null,null,null,null,null,null,4]